Build #233

Build: #233 failed Scheduled with changes by Mahmoud Ben Hassine <mbenhassine@vmware.com> and Spring Buildmaster

Build result summary

Details

Completed
Duration
3 minutes
Labels
None
Agent
bamboo-21.af.pivotal.io
Revision
c4a440ef780563db1ae03e074ad5c526dc2ec745 c4a440ef780563db1ae03e074ad5c526dc2ec745
Total tests
1916
Fixed in
#235 (Scheduled)

Tests

Responsible

Code commits

Author Commit Message Commit date
Spring Buildmaster Spring Buildmaster c4a440ef780563db1ae03e074ad5c526dc2ec745 c4a440ef780563db1ae03e074ad5c526dc2ec745 [artifactory-release] Next development version
Spring Buildmaster Spring Buildmaster f0481b1ef586fe3fd675545ea450119506359643 f0481b1ef586fe3fd675545ea450119506359643 [artifactory-release] Release version 4.2.3.RELEASE
Mahmoud Ben Hassine <mbenhassine@vmware.com> Mahmoud Ben Hassine <mbenhassine@vmware.com> ba456debed4ae011d646d6e59ab5937bb45581a8 ba456debed4ae011d646d6e59ab5937bb45581a8 Update dependencies
Mahmoud Ben Hassine <mbenhassine@vmware.com> Mahmoud Ben Hassine <mbenhassine@vmware.com> 6d7d2927ddcd8c7ddd902fa1196b1e780c0d70ea 6d7d2927ddcd8c7ddd902fa1196b1e780c0d70ea Update Jackson2ExecutionContextStringSerializer

Tests

New test failures 1
Status Test View job Duration
Collapse Failed JsrSplitParsingTests test History
Default Job < 1 sec
java.lang.AssertionError: java.lang.AssertionError: expected:<COMPLETED> but was:<FAILED>
java.lang.AssertionError: expected:<COMPLETED> but was:<FAILED>
	at org.junit.Assert.fail(Assert.java:89)
	at org.junit.Assert.failNotEquals(Assert.java:835)
	at org.junit.Assert.assertEquals(Assert.java:120)
	at org.junit.Assert.assertEquals(Assert.java:146)
	at org.springframework.batch.core.jsr.configuration.xml.JsrSplitParsingTests.test(JsrSplitParsingTests.java:49)
	at sun.reflect.NativeMethodAccessorImpl.invoke0(Native Method)
(48 more lines...)