Build #233

Build: #233 failed Scheduled with changes by Mahmoud Ben Hassine <mbenhassine@vmware.com> and Spring Buildmaster

Logs

The following logs have been generated by the jobs in this branch.
  • Expand all
  • Collapse all
Job Logs
Collapse Default Job Default Stage Download or View
10-Jun-2020 20:03:38 org.springframework.batch.core.jsr.configuration.xml.JsrSplitParsingTests > test FAILED
10-Jun-2020 20:03:38     java.lang.AssertionError at JsrSplitParsingTests.java:49
10-Jun-2020 20:03:43
10-Jun-2020 20:03:43 1916 tests completed, 1 failed, 7 skipped
10-Jun-2020 20:03:43
10-Jun-2020 20:03:43 > Task :spring-batch-core:test FAILED
10-Jun-2020 20:03:43
10-Jun-2020 20:03:43 Deprecated Gradle features were used in this build, making it incompatible with Gradle 7.0.
10-Jun-2020 20:03:43 Use '--warning-mode all' to show the individual deprecation warnings.
10-Jun-2020 20:03:43 See https://docs.gradle.org/6.0.1/userguide/command_line_interface.html#sec:command_line_warnings
10-Jun-2020 20:03:43 44 actionable tasks: 35 executed, 9 up-to-date
10-Jun-2020 20:03:43
10-Jun-2020 20:03:43 FAILURE: Build failed with an exception.
10-Jun-2020 20:03:43
10-Jun-2020 20:03:43 * What went wrong:
10-Jun-2020 20:03:43 Execution failed for task ':spring-batch-core:test'.
10-Jun-2020 20:03:43 > There were failing tests. See the report at: file:///opt/bamboo-home/xml-data/build-dir/BATCH-NIGHTLY4-JOB1/spring-batch-core/build/reports/tests/test/index.html
10-Jun-2020 20:03:43
10-Jun-2020 20:03:43 * Try:
10-Jun-2020 20:03:43 Run with --stacktrace option to get the stack trace. Run with --info or --debug option to get more log output. Run with --scan to get full insights.
10-Jun-2020 20:03:43
10-Jun-2020 20:03:43 * Get more help at https://help.gradle.org
10-Jun-2020 20:03:43
10-Jun-2020 20:03:43 BUILD FAILED in 2m 57s
10-Jun-2020 20:03:43 Expiring Daemon because JVM heap space is exhausted