Build #233

Build: #233 failed Scheduled with changes by Mahmoud Ben Hassine <mbenhassine@vmware.com> and Spring Buildmaster

Test results

  • 1,916 tests in total
  • 1 test failed
  • 1 failure is new
  • 7 tests were quarantined / skipped
  • 44 seconds taken in total.
New test failures 1
Status Test View job Duration
Collapse Failed JsrSplitParsingTests test History
Default Job < 1 sec
java.lang.AssertionError: java.lang.AssertionError: expected:<COMPLETED> but was:<FAILED>
java.lang.AssertionError: expected:<COMPLETED> but was:<FAILED>
	at org.junit.Assert.fail(Assert.java:89)
	at org.junit.Assert.failNotEquals(Assert.java:835)
	at org.junit.Assert.assertEquals(Assert.java:120)
	at org.junit.Assert.assertEquals(Assert.java:146)
	at org.springframework.batch.core.jsr.configuration.xml.JsrSplitParsingTests.test(JsrSplitParsingTests.java:49)
	at sun.reflect.NativeMethodAccessorImpl.invoke0(Native Method)
(48 more lines...)
Skipped tests 7
Status Test Failing since View job
Skipped ItemListenerErrorTests testOnReadError History

Passing on the master branch.

Default Job
Skipped JobRepositoryFactoryBeanTests testTransactionAttributesForCreateMethodNullHypothesis History

Passing on the master branch.

Default Job
Skipped StepScopeClassIntegrationTests testNested History

Passing on the master branch.

Default Job
Skipped StepScopeClassIntegrationTests testSimpleValue History

Passing on the master branch.

Default Job
Skipped FaultTolerantStepFactoryBeanUnexpectedRollbackTests testTransactionException History

Passing on the master branch.

Default Job
Skipped AsyncChunkOrientedStepIntegrationTests testStatus History

Passing on the master branch.

Default Job
Skipped ChunkOrientedStepIntegrationTests testStatusForCommitFailedException History

Passing on the master branch.

Default Job