Build #234

Build: #234 failed Scheduled with changes by Mahmoud Ben Hassine <mbenhassine@vmware.com> and Spring Buildmaster

Build result summary

Details

Completed
Duration
2 minutes
Labels
None
Agent
bamboo-19.af.pivotal.io
Revision
e375b9bf0eda6593241bdb9f09fb280ab77e2ffa e375b9bf0eda6593241bdb9f09fb280ab77e2ffa
Total tests
1916
Failing since
#233 (Scheduled with changes by Mahmoud Ben Hassine <mbenhassine@vmware.com> and Spring Buildmaster)
Fixed in
#235 (Scheduled)

Tests

Responsible

Code commits

Author Commit Message Commit date
Spring Buildmaster Spring Buildmaster e375b9bf0eda6593241bdb9f09fb280ab77e2ffa e375b9bf0eda6593241bdb9f09fb280ab77e2ffa [artifactory-release] Next development version
Spring Buildmaster Spring Buildmaster f75f1711fe5e30bf5bd9dba6553776af521a2781 f75f1711fe5e30bf5bd9dba6553776af521a2781 [artifactory-release] Release version 4.2.4.RELEASE
Mahmoud Ben Hassine <mbenhassine@vmware.com> Mahmoud Ben Hassine <mbenhassine@vmware.com> bc006d7d30e52f40ba1aeb19abf5d309bf1347a0 bc006d7d30e52f40ba1aeb19abf5d309bf1347a0 Prepare release 4.2.4
Mahmoud Ben Hassine <mbenhassine@vmware.com> Mahmoud Ben Hassine <mbenhassine@vmware.com> 1e111f34d3ff8beb0982fe8205d6a88b050a38be 1e111f34d3ff8beb0982fe8205d6a88b050a38be Downgrade Jackson version to 2.10.4
Mahmoud Ben Hassine <mbenhassine@vmware.com> Mahmoud Ben Hassine <mbenhassine@vmware.com> b7f202f8104d01b01515baed78ef569d809a3cf4 b7f202f8104d01b01515baed78ef569d809a3cf4 Update Spring projects dependencies to latest BUILD-SNAPSHOT

Tests

Existing test failures 1
Status Test Failing since View job Duration
java.lang.AssertionError: java.lang.AssertionError: expected:<COMPLETED> but was:<FAILED>
java.lang.AssertionError: expected:<COMPLETED> but was:<FAILED>
	at org.junit.Assert.fail(Assert.java:89)
	at org.junit.Assert.failNotEquals(Assert.java:835)
	at org.junit.Assert.assertEquals(Assert.java:120)
	at org.junit.Assert.assertEquals(Assert.java:146)
	at org.springframework.batch.core.jsr.configuration.xml.JsrSplitParsingTests.test(JsrSplitParsingTests.java:49)
	at sun.reflect.NativeMethodAccessorImpl.invoke0(Native Method)
(48 more lines...)