Build #248

Build: #248 failed Scheduled

Build result summary

Details

Completed
Duration
3 minutes
Labels
None
Agent
bamboo-12.af.pivotal.io
Revision
006a9632ca6ed6da07137b5d613aace3b4c9af8c 006a9632ca6ed6da07137b5d613aace3b4c9af8c
Total tests
1916
Failing since
#247 (Scheduled – )
Fixed in
#249 (Scheduled)

Responsible

This build has been failing since #247
No one has taken responsibility

Tests

New test failures 1
Status Test View job Duration
Collapse Failed DecisionStepTests testDecisionAfterSplit History
Default Job < 1 sec
java.lang.AssertionError: java.lang.AssertionError: Received a FAILED because of org.springframework.batch.core.JobExecutionException: Flow execution ended unexpectedly
	at org.springframework.batch.core.jsr.job.flow.JsrFlowJob.doExecute(JsrFlowJob.java:88)
	at org.springframework.batch.core.job.AbstractJob.execute(AbstractJob.java:319)
	at org.springframework.batch.core.jsr.launch.JsrJobOperator$2.run(JsrJobOperator.java:674)
	at java.lang.Thread.run(Thread.java:748)
Caused by: org.springframework.batch.core.job.flow.FlowExecutionException: Ended flow=flow1.step1 at state=flow1.step1.flow1.step1 with exception
	at org.springframework.batch.core.job.flow.support.SimpleFlow.resume(SimpleFlow.java:178)
	at org.springframework.batch.core.job.flow.support.SimpleFlow.start(SimpleFlow.java:144)
(95 more lines...)
Fixed tests 1
Status Test Failing since View job Duration
Successful OptimisticLockingFailureTests testAsyncStopOfStartingJob History
Failing since build #247 (Scheduled) Default Job 4 secs