Nightly build for the 4.3.x branch

Build: #184 failed Scheduled

Build result summary

Details

Completed
Duration
7 minutes
Labels
None
Agent
bamboo-36.spring.vmware.com
Revision
a318adb61b606441ad2dcf0b84f349fd26784244 a318adb61b606441ad2dcf0b84f349fd26784244
Total tests
1988
Failing since
#183 (Scheduled – )
Fixed in
#186 (Scheduled)

Tests

Responsible

This build has been failing since #183
No one has taken responsibility

Tests

New test failures 1
Status Test View job Duration
Collapse Failed StepExecutionSerializationUtilsTests testMultipleCycles History
Default Job 1 sec
java.lang.IllegalStateException: java.lang.IllegalStateException: Failed on count=1000
java.lang.IllegalStateException: Failed on count=1000
	at org.springframework.batch.core.test.step.StepExecutionSerializationUtilsTests.testMultipleCycles(StepExecutionSerializationUtilsTests.java:92)
	at sun.reflect.NativeMethodAccessorImpl.invoke0(Native Method)
	at sun.reflect.NativeMethodAccessorImpl.invoke(NativeMethodAccessorImpl.java:62)
	at sun.reflect.DelegatingMethodAccessorImpl.invoke(DelegatingMethodAccessorImpl.java:43)
	at java.lang.reflect.Method.invoke(Method.java:498)
	at org.junit.runners.model.FrameworkMethod$1.runReflectiveCall(FrameworkMethod.java:59)
(48 more lines...)