Nightly build for the 4.3.x branch

Build: #184 failed Scheduled

Test results

  • 1,988 tests in total
  • 1 test failed
  • 1 failure is new
  • 7 tests were quarantined / skipped
  • 2 minutes taken in total.
New test failures 1
Status Test View job Duration
Collapse Failed StepExecutionSerializationUtilsTests testMultipleCycles History
Default Job 1 sec
java.lang.IllegalStateException: java.lang.IllegalStateException: Failed on count=1000
java.lang.IllegalStateException: Failed on count=1000
	at org.springframework.batch.core.test.step.StepExecutionSerializationUtilsTests.testMultipleCycles(StepExecutionSerializationUtilsTests.java:92)
	at sun.reflect.NativeMethodAccessorImpl.invoke0(Native Method)
	at sun.reflect.NativeMethodAccessorImpl.invoke(NativeMethodAccessorImpl.java:62)
	at sun.reflect.DelegatingMethodAccessorImpl.invoke(DelegatingMethodAccessorImpl.java:43)
	at java.lang.reflect.Method.invoke(Method.java:498)
	at org.junit.runners.model.FrameworkMethod$1.runReflectiveCall(FrameworkMethod.java:59)
(48 more lines...)
Skipped tests 7
Status Test Failing since View job
Skipped ItemListenerErrorTests testOnReadError History
Default Job
Skipped JobRepositoryFactoryBeanTests testTransactionAttributesForCreateMethodNullHypothesis History
Default Job
Skipped StepScopeClassIntegrationTests testSimpleValue History
Default Job
Skipped StepScopeClassIntegrationTests testNested History
Default Job
Skipped FaultTolerantStepFactoryBeanUnexpectedRollbackTests testTransactionException History
Default Job
Skipped AsyncChunkOrientedStepIntegrationTests testStatus History
Default Job
Skipped ChunkOrientedStepIntegrationTests testStatusForCommitFailedException History
Default Job