Nightly build for the 4.3.x branch

Build: #91 failed Scheduled

Build result summary

Details

Completed
Duration
4 minutes
Labels
None
Agent
bamboo-38.spring.vmware.com
Revision
8d5afe6a41035406fa21f8cf6aa58434ec04e6a5 8d5afe6a41035406fa21f8cf6aa58434ec04e6a5
Total tests
1984
Fixed in
#95 (Manual run by Mahmoud Ben Hassine)

Tests

Responsible

No one has taken responsibility for this failure

Tests

New test failures 1
Status Test View job Duration
Collapse Failed MySQLJdbcJobRepositoryTests testDateMillisecondPrecision History
Default Job < 1 sec
java.lang.IllegalStateException: java.lang.IllegalStateException: Failed to load ApplicationContext
java.lang.IllegalStateException: Failed to load ApplicationContext
	at org.springframework.test.context.cache.DefaultCacheAwareContextLoaderDelegate.loadContext(DefaultCacheAwareContextLoaderDelegate.java:132)
	at org.springframework.test.context.support.DefaultTestContext.getApplicationContext(DefaultTestContext.java:124)
	at org.springframework.test.context.support.DependencyInjectionTestExecutionListener.injectDependencies(DependencyInjectionTestExecutionListener.java:118)
	at org.springframework.test.context.support.DependencyInjectionTestExecutionListener.prepareTestInstance(DependencyInjectionTestExecutionListener.java:83)
	at org.springframework.test.context.TestContextManager.prepareTestInstance(TestContextManager.java:244)
	at org.springframework.test.context.junit4.SpringJUnit4ClassRunner.createTest(SpringJUnit4ClassRunner.java:227)
(140 more lines...)