Executing Sonar tasks

Build: #2396 failed Scheduled

Build result summary

Details

Completed
Duration
6 minutes
Labels
None
Revision
9135423424fe9a608446f70c4584219ae212d84f 9135423424fe9a608446f70c4584219ae212d84f
Fixed in
#2398 (Scheduled)
No failed tests found, a possible compilation error occurred.

Responsible

No one has taken responsibility for this failure

Error summary for Default Job

The job generated some errors, drill down into the full build log for more details.

  required: Map<TopicPartition,Long>
  found:    Object
10 warnings
/opt/bamboo-home/xml-data/build-dir/BATCH-SONAR-JOB1/spring-batch-core/src/main/java/org/springframework/batch/core/configuration/support/ClasspathXmlApplicationContextsFactoryBean.java:27: warning: [deprecation] PropertyPlaceholderConfigurer in org.springframework.beans.factory.config has been deprecated
import org.springframework.beans.factory.config.PropertyPlaceholderConfigurer;
                                               ^
/opt/bamboo-home/xml-data/build-dir/BATCH-SONAR-JOB1/spring-batch-core/src/main/java/org/springframework/batch/core/configuration/support/AbstractApplicationContextFactory.java:34: warning: [deprecation] PropertyPlaceholderConfigurer in org.springframework.beans.factory.config has been deprecated
import org.springframework.beans.factory.config.PropertyPlaceholderConfigurer;
                                               ^
/opt/bamboo-home/xml-data/build-dir/BATCH-SONAR-JOB1/spring-batch-core/src/main/java/org/springframework/batch/core/step/builder/SimpleStepBuilder.java:232: warning: [overloads] processor(ItemProcessor<? super I,? extends O>) in SimpleStepBuilder is potentially ambiguous with processor(Function<? super I,? extends O>) in SimpleStepBuilder
        public SimpleStepBuilder<I, O> processor(ItemProcessor<? super I, ? extends O> processor) {
                                       ^
  where I,O are type-variables:
    I extends Object declared in class SimpleStepBuilder
    O extends Object declared in class SimpleStepBuilder
/opt/bamboo-home/xml-data/build-dir/BATCH-SONAR-JOB1/spring-batch-core/src/main/java/org/springframework/batch/core/configuration/support/AbstractApplicationContextFactory.java:75: warning: [deprecation] PropertyPlaceholderConfigurer in org.springframework.beans.factory.config has been deprecated
                beanFactoryPostProcessorClasses.add(PropertyPlaceholderConfigurer.class);
                                                    ^
/opt/bamboo-home/xml-data/build-dir/BATCH-SONAR-JOB1/spring-batch-core/src/main/java/org/springframework/batch/core/jsr/configuration/support/SpringAutowiredAnnotationBeanPostProcessor.java:264: warning: [deprecation] postProcessPropertyValues(PropertyValues,PropertyDescriptor[],Object,String) in InstantiationAwareBeanPostProcessorAdapter has been deprecated
    public PropertyValues postProcessPropertyValues(
                          ^
5 warnings
/opt/bamboo-home/xml-data/build-dir/BATCH-SONAR-JOB1/spring-batch-core/src/main/java/org/springframework/batch/core/metrics/BatchMetrics.java:67: warning - Tag @link: reference not found: Timer.Sample
/opt/bamboo-home/xml-data/build-dir/BATCH-SONAR-JOB1/spring-batch-core/src/main/java/org/springframework/batch/core/metrics/BatchMetrics.java:67: warning - Tag @link: reference not found: Timer.Sample
/opt/bamboo-home/xml-data/build-dir/BATCH-SONAR-JOB1/spring-batch-core/src/main/java/org/springframework/batch/core/metrics/BatchMetrics.java:67: warning - Tag @link: reference not found: Timer.Sample
/opt/users/bamboo/.gradle/caches/modules-2/files-2.1/org.springframework/spring-core/5.2.0.M2/9a84d456ad8d5151da06fc8a85540da9cc95d734/spring-core-5.2.0.M2.jar(org/springframework/lang/Nullable.class): warning: Cannot find annotation method 'when()' in type 'Nonnull': class file for javax.annotation.Nonnull not found
warning: unknown enum constant When.MAYBE
  reason: class file for javax.annotation.meta.When not found
/opt/users/bamboo/.gradle/caches/modules-2/files-2.1/org.springframework/spring-core/5.2.0.M2/9a84d456ad8d5151da06fc8a85540da9cc95d734/spring-core-5.2.0.M2.jar(org/springframework/lang/NonNullApi.class): warning: Cannot find annotation method 'value()' in type 'TypeQualifierDefault': class file for javax.annotation.meta.TypeQualifierDefault not found
3 warnings

1528 tests completed, 1 failed, 1 skipped

FAILURE: Build failed with an exception.

* What went wrong:
Execution failed for task ':spring-batch-infrastructure:test'.
> There were failing tests. See the report at: file:///opt/bamboo-home/xml-data/build-dir/BATCH-SONAR-JOB1/spring-batch-infrastructure/build/reports/tests/test/index.html

* Try:
Run with --info or --debug option to get more log output. Run with --scan to get full insights.

* Exception is:
org.gradle.api.tasks.TaskExecutionException: Execution failed for task ':spring-batch-infrastructure:test'.
        at org.gradle.api.internal.tasks.execution.ExecuteActionsTaskExecuter.executeActions(ExecuteActionsTaskExecuter.java:110)
        at org.gradle.api.internal.tasks.execution.ExecuteActionsTaskExecuter.execute(ExecuteActionsTaskExecuter.java:77)
        at org.gradle.api.internal.tasks.execution.OutputDirectoryCreatingTaskExecuter.execute(OutputDirectoryCreatingTaskExecuter.java:51)
        at org.gradle.api.internal.tasks.execution.SkipUpToDateTaskExecuter.execute(SkipUpToDateTaskExecuter.java:59)
        at org.gradle.api.internal.tasks.execution.ResolveTaskOutputCachingStateExecuter.execute(ResolveTaskOutputCachingStateExecuter.java:54)
        at org.gradle.api.internal.tasks.execution.ValidatingTaskExecuter.execute(ValidatingTaskExecuter.java:59)
        at org.gradle.api.internal.tasks.execution.SkipEmptySourceFilesTaskExecuter.execute(SkipEmptySourceFilesTaskExecuter.java:101)
        at org.gradle.api.internal.tasks.execution.FinalizeInputFilePropertiesTaskExecuter.execute(FinalizeInputFilePropertiesTaskExecuter.java:44)
        at org.gradle.api.internal.tasks.execution.CleanupStaleOutputsExecuter.execute(CleanupStaleOutputsExecuter.java:91)
        at org.gradle.api.internal.tasks.execution.ResolveTaskArtifactStateTaskExecuter.execute(ResolveTaskArtifactStateTaskExecuter.java:62)
        at org.gradle.api.internal.tasks.execution.SkipTaskWithNoActionsExecuter.execute(SkipTaskWithNoActionsExecuter.java:59)
        at org.gradle.api.internal.tasks.execution.SkipOnlyIfTaskExecuter.execute(SkipOnlyIfTaskExecuter.java:54)
        at org.gradle.api.internal.tasks.execution.ExecuteAtMostOnceTaskExecuter.execute(ExecuteAtMostOnceTaskExecuter.java:43)
        at org.gradle.api.internal.tasks.execution.CatchExceptionTaskExecuter.execute(CatchExceptionTaskExecuter.java:34)
        at org.gradle.api.internal.tasks.execution.EventFiringTaskExecuter$1.run(EventFiringTaskExecuter.java:51)
        at org.gradle.internal.operations.DefaultBuildOperationExecutor$RunnableBuildOperationWorker.execute(DefaultBuildOperationExecutor.java:301)
        at org.gradle.internal.operations.DefaultBuildOperationExecutor$RunnableBuildOperationWorker.execute(DefaultBuildOperationExecutor.java:293)
        at org.gradle.internal.operations.DefaultBuildOperationExecutor.execute(DefaultBuildOperationExecutor.java:175)
        at org.gradle.internal.operations.DefaultBuildOperationExecutor.run(DefaultBuildOperationExecutor.java:91)
        at org.gradle.internal.operations.DelegatingBuildOperationExecutor.run(DelegatingBuildOperationExecutor.java:31)
        at org.gradle.api.internal.tasks.execution.EventFiringTaskExecuter.execute(EventFiringTaskExecuter.java:46)
        at org.gradle.execution.taskgraph.LocalTaskInfoExecutor.execute(LocalTaskInfoExecutor.java:42)
        at org.gradle.execution.taskgraph.DefaultTaskExecutionGraph$BuildOperationAwareWorkItemExecutor.execute(DefaultTaskExecutionGraph.java:277)
        at org.gradle.execution.taskgraph.DefaultTaskExecutionGraph$BuildOperationAwareWorkItemExecutor.execute(DefaultTaskExecutionGraph.java:262)
        at org.gradle.execution.taskgraph.DefaultTaskPlanExecutor$ExecutorWorker$1.execute(DefaultTaskPlanExecutor.java:135)
        at org.gradle.execution.taskgraph.DefaultTaskPlanExecutor$ExecutorWorker$1.execute(DefaultTaskPlanExecutor.java:130)
        at org.gradle.execution.taskgraph.DefaultTaskPlanExecutor$ExecutorWorker.execute(DefaultTaskPlanExecutor.java:200)
        at org.gradle.execution.taskgraph.DefaultTaskPlanExecutor$ExecutorWorker.executeWithWork(DefaultTaskPlanExecutor.java:191)
        at org.gradle.execution.taskgraph.DefaultTaskPlanExecutor$ExecutorWorker.run(DefaultTaskPlanExecutor.java:130)
        at org.gradle.internal.concurrent.ExecutorPolicy$CatchAndRecordFailures.onExecute(ExecutorPolicy.java:63)
        at org.gradle.internal.concurrent.ManagedExecutorImpl$1.run(ManagedExecutorImpl.java:46)
        at org.gradle.internal.concurrent.ThreadFactoryImpl$ManagedThreadRunnable.run(ThreadFactoryImpl.java:55)
Caused by: org.gradle.api.GradleException: There were failing tests. See the report at: file:///opt/bamboo-home/xml-data/build-dir/BATCH-SONAR-JOB1/spring-batch-infrastructure/build/reports/tests/test/index.html
        at org.gradle.api.tasks.testing.AbstractTestTask.handleTestFailures(AbstractTestTask.java:612)
        at org.gradle.api.tasks.testing.AbstractTestTask.executeTests(AbstractTestTask.java:484)
        at org.gradle.api.tasks.testing.Test.executeTests(Test.java:603)
        at org.gradle.internal.reflect.JavaMethod.invoke(JavaMethod.java:73)
        at org.gradle.api.internal.project.taskfactory.StandardTaskAction.doExecute(StandardTaskAction.java:46)
        at org.gradle.api.internal.project.taskfactory.StandardTaskAction.execute(StandardTaskAction.java:39)
        at org.gradle.api.internal.project.taskfactory.StandardTaskAction.execute(StandardTaskAction.java:26)
        at org.gradle.api.internal.AbstractTask$TaskActionWrapper.execute(AbstractTask.java:801)
        at org.gradle.api.internal.AbstractTask$TaskActionWrapper.execute(AbstractTask.java:768)
        at org.gradle.api.internal.tasks.execution.ExecuteActionsTaskExecuter$1.run(ExecuteActionsTaskExecuter.java:131)
        at org.gradle.internal.operations.DefaultBuildOperationExecutor$RunnableBuildOperationWorker.execute(DefaultBuildOperationExecutor.java:301)
        at org.gradle.internal.operations.DefaultBuildOperationExecutor$RunnableBuildOperationWorker.execute(DefaultBuildOperationExecutor.java:293)
        at org.gradle.internal.operations.DefaultBuildOperationExecutor.execute(DefaultBuildOperationExecutor.java:175)
        at org.gradle.internal.operations.DefaultBuildOperationExecutor.run(DefaultBuildOperationExecutor.java:91)
        at org.gradle.internal.operations.DelegatingBuildOperationExecutor.run(DelegatingBuildOperationExecutor.java:31)
        at org.gradle.api.internal.tasks.execution.ExecuteActionsTaskExecuter.executeAction(ExecuteActionsTaskExecuter.java:120)
        at org.gradle.api.internal.tasks.execution.ExecuteActionsTaskExecuter.executeActions(ExecuteActionsTaskExecuter.java:99)
        ... 31 more


* Get more help at https://help.gradle.org

BUILD FAILED in 6m 1s