Build #71

Master build using JDK9

Build: #71 failed Changes by 3 people

Logs

The following logs have been generated by the jobs in this plan.
  • Expand all
  • Collapse all
Job Logs
Collapse Default Job Default Stage Download or View
20-Oct-2017 00:13:53 [INFO] Spring Boot Server Tests ........................... SKIPPED
20-Oct-2017 00:13:53 [INFO] Spring Boot Launch Script Integration Tests ........ SKIPPED
20-Oct-2017 00:13:53 [INFO] Spring Boot Security Tests ......................... SKIPPED
20-Oct-2017 00:13:53 [INFO] Spring Boot Security Tests - Web Hello World ....... SKIPPED
20-Oct-2017 00:13:53 [INFO] ------------------------------------------------------------------------
20-Oct-2017 00:13:53 [INFO] BUILD FAILURE
20-Oct-2017 00:13:53 [INFO] ------------------------------------------------------------------------
20-Oct-2017 00:13:53 [INFO] Total time: 12:13 min
20-Oct-2017 00:13:53 [INFO] Finished at: 2017-10-20T00:13:53Z
20-Oct-2017 00:13:54 [INFO] Final Memory: 480M/863M
20-Oct-2017 00:13:54 [INFO] ------------------------------------------------------------------------
20-Oct-2017 00:13:54 [ERROR] Failed to execute goal org.apache.maven.plugins:maven-surefire-plugin:2.20.1:test (default-test) on project spring-boot-test-autoconfigure: There are test failures.
20-Oct-2017 00:13:54 [ERROR]
20-Oct-2017 00:13:54 [ERROR] Please refer to /opt/bamboo-home/xml-data/build-dir/BOOT-JDK9-JOB1/spring-boot-project/spring-boot-test-autoconfigure/target/surefire-reports for the individual test results.
20-Oct-2017 00:13:54 [ERROR] Please refer to dump files (if any exist) [date]-jvmRun[N].dump, [date].dumpstream and [date]-jvmRun[N].dumpstream.
20-Oct-2017 00:13:54 [ERROR] -> [Help 1]
20-Oct-2017 00:13:54 [ERROR]
20-Oct-2017 00:13:54 [ERROR] To see the full stack trace of the errors, re-run Maven with the -e switch.
20-Oct-2017 00:13:54 [ERROR] Re-run Maven using the -X switch to enable full debug logging.
20-Oct-2017 00:13:54 [ERROR]
20-Oct-2017 00:13:54 [ERROR] For more information about the errors and possible solutions, please read the following articles:
20-Oct-2017 00:13:54 [ERROR] [Help 1] http://cwiki.apache.org/confluence/display/MAVEN/MojoFailureException
20-Oct-2017 00:13:54 [ERROR]
20-Oct-2017 00:13:54 [ERROR] After correcting the problems, you can resume the build with the command
20-Oct-2017 00:13:54 [ERROR]   mvn <goals> -rf :spring-boot-test-autoconfigure