Build #71

Master build using JDK9

Build: #71 failed

Job: Default Job failed

Stages & jobs

  1. Default Stage

Build log

The build generated 2,853 lines of output.The output is too long and has been truncated to the last 1,000 lines. Download or view full build log

20-Oct-2017 00:09:33 [INFO] Running org.springframework.boot.autoconfigure.jdbc.JndiDataSourceAutoConfigurationTests
20-Oct-2017 00:09:33 [INFO] Tests run: 4, Failures: 0, Errors: 0, Skipped: 0, Time elapsed: 0.173 s - in org.springframework.boot.autoconfigure.jdbc.JndiDataSourceAutoConfigurationTests
20-Oct-2017 00:09:33 [INFO] Running org.springframework.boot.autoconfigure.jdbc.TomcatDataSourceConfigurationTests
20-Oct-2017 00:09:34 [INFO] Tests run: 3, Failures: 0, Errors: 0, Skipped: 0, Time elapsed: 0.2 s - in org.springframework.boot.autoconfigure.jdbc.TomcatDataSourceConfigurationTests
20-Oct-2017 00:09:34 [INFO] Running org.springframework.boot.autoconfigure.jdbc.XADataSourceAutoConfigurationTests
20-Oct-2017 00:09:34 [INFO] Tests run: 3, Failures: 0, Errors: 0, Skipped: 0, Time elapsed: 0.22 s - in org.springframework.boot.autoconfigure.jdbc.XADataSourceAutoConfigurationTests
20-Oct-2017 00:09:34 [INFO] Running org.springframework.boot.autoconfigure.jersey.JerseyAutoConfigurationCustomFilterContextPathTests
20-Oct-2017 00:09:36 [INFO] Tests run: 1, Failures: 0, Errors: 0, Skipped: 0, Time elapsed: 1.848 s - in org.springframework.boot.autoconfigure.jersey.JerseyAutoConfigurationCustomFilterContextPathTests
20-Oct-2017 00:09:36 [INFO] Running org.springframework.boot.autoconfigure.jersey.JerseyAutoConfigurationCustomFilterPathTests
20-Oct-2017 00:09:36 [INFO] Tests run: 1, Failures: 0, Errors: 0, Skipped: 0, Time elapsed: 0.561 s - in org.springframework.boot.autoconfigure.jersey.JerseyAutoConfigurationCustomFilterPathTests
20-Oct-2017 00:09:36 [INFO] Running org.springframework.boot.autoconfigure.jersey.JerseyAutoConfigurationCustomLoadOnStartupTests
20-Oct-2017 00:09:37 [INFO] Tests run: 1, Failures: 0, Errors: 0, Skipped: 0, Time elapsed: 0.511 s - in org.springframework.boot.autoconfigure.jersey.JerseyAutoConfigurationCustomLoadOnStartupTests
20-Oct-2017 00:09:37 [INFO] Running org.springframework.boot.autoconfigure.jersey.JerseyAutoConfigurationCustomObjectMapperProviderTests
20-Oct-2017 00:09:37 [INFO] Tests run: 1, Failures: 0, Errors: 0, Skipped: 0, Time elapsed: 0.591 s - in org.springframework.boot.autoconfigure.jersey.JerseyAutoConfigurationCustomObjectMapperProviderTests
20-Oct-2017 00:09:37 [INFO] Running org.springframework.boot.autoconfigure.jersey.JerseyAutoConfigurationCustomServletContextPathTests
20-Oct-2017 00:09:38 [INFO] Tests run: 1, Failures: 0, Errors: 0, Skipped: 0, Time elapsed: 0.55 s - in org.springframework.boot.autoconfigure.jersey.JerseyAutoConfigurationCustomServletContextPathTests
20-Oct-2017 00:09:38 [INFO] Running org.springframework.boot.autoconfigure.jersey.JerseyAutoConfigurationCustomServletPathTests
20-Oct-2017 00:09:38 [INFO] Tests run: 1, Failures: 0, Errors: 0, Skipped: 0, Time elapsed: 0.497 s - in org.springframework.boot.autoconfigure.jersey.JerseyAutoConfigurationCustomServletPathTests
20-Oct-2017 00:09:38 [INFO] Running org.springframework.boot.autoconfigure.jersey.JerseyAutoConfigurationDefaultFilterPathTests
20-Oct-2017 00:09:39 [INFO] Tests run: 1, Failures: 0, Errors: 0, Skipped: 0, Time elapsed: 0.49 s - in org.springframework.boot.autoconfigure.jersey.JerseyAutoConfigurationDefaultFilterPathTests
20-Oct-2017 00:09:39 [INFO] Running org.springframework.boot.autoconfigure.jersey.JerseyAutoConfigurationDefaultServletPathTests
20-Oct-2017 00:09:39 [INFO] Tests run: 1, Failures: 0, Errors: 0, Skipped: 0, Time elapsed: 0.518 s - in org.springframework.boot.autoconfigure.jersey.JerseyAutoConfigurationDefaultServletPathTests
20-Oct-2017 00:09:39 [INFO] Running org.springframework.boot.autoconfigure.jersey.JerseyAutoConfigurationObjectMapperProviderTests
20-Oct-2017 00:09:40 [INFO] Tests run: 1, Failures: 0, Errors: 0, Skipped: 0, Time elapsed: 0.539 s - in org.springframework.boot.autoconfigure.jersey.JerseyAutoConfigurationObjectMapperProviderTests
20-Oct-2017 00:09:40 [INFO] Running org.springframework.boot.autoconfigure.jersey.JerseyAutoConfigurationServletContainerTests
20-Oct-2017 00:09:41 [INFO] Tests run: 1, Failures: 0, Errors: 0, Skipped: 0, Time elapsed: 1.213 s - in org.springframework.boot.autoconfigure.jersey.JerseyAutoConfigurationServletContainerTests
20-Oct-2017 00:09:41 [INFO] Running org.springframework.boot.autoconfigure.jersey.JerseyAutoConfigurationWithoutApplicationPathTests
20-Oct-2017 00:09:42 [INFO] Tests run: 1, Failures: 0, Errors: 0, Skipped: 0, Time elapsed: 0.599 s - in org.springframework.boot.autoconfigure.jersey.JerseyAutoConfigurationWithoutApplicationPathTests
20-Oct-2017 00:09:42 [INFO] Running org.springframework.boot.autoconfigure.jms.JmsAutoConfigurationTests
20-Oct-2017 00:09:45 [INFO] Tests run: 26, Failures: 0, Errors: 0, Skipped: 0, Time elapsed: 2.819 s - in org.springframework.boot.autoconfigure.jms.JmsAutoConfigurationTests
20-Oct-2017 00:09:45 [INFO] Running org.springframework.boot.autoconfigure.jms.JmsPropertiesTests
20-Oct-2017 00:09:45 [INFO] Tests run: 7, Failures: 0, Errors: 0, Skipped: 0, Time elapsed: 0 s - in org.springframework.boot.autoconfigure.jms.JmsPropertiesTests
20-Oct-2017 00:09:45 [INFO] Running org.springframework.boot.autoconfigure.jms.activemq.ActiveMQAutoConfigurationTests
20-Oct-2017 00:09:45 [INFO] Tests run: 7, Failures: 0, Errors: 0, Skipped: 0, Time elapsed: 0.631 s - in org.springframework.boot.autoconfigure.jms.activemq.ActiveMQAutoConfigurationTests
20-Oct-2017 00:09:45 [INFO] Running org.springframework.boot.autoconfigure.jms.activemq.ActiveMQPropertiesTests
20-Oct-2017 00:09:45 [INFO] Tests run: 6, Failures: 0, Errors: 0, Skipped: 0, Time elapsed: 0 s - in org.springframework.boot.autoconfigure.jms.activemq.ActiveMQPropertiesTests
20-Oct-2017 00:09:45 [INFO] Running org.springframework.boot.autoconfigure.jms.artemis.ArtemisAutoConfigurationTests
20-Oct-2017 00:09:49 [INFO] Tests run: 14, Failures: 0, Errors: 0, Skipped: 0, Time elapsed: 3.75 s - in org.springframework.boot.autoconfigure.jms.artemis.ArtemisAutoConfigurationTests
20-Oct-2017 00:09:49 [INFO] Running org.springframework.boot.autoconfigure.jms.artemis.ArtemisEmbeddedConfigurationFactoryTests
20-Oct-2017 00:09:49 [INFO] Tests run: 4, Failures: 0, Errors: 0, Skipped: 0, Time elapsed: 0 s - in org.springframework.boot.autoconfigure.jms.artemis.ArtemisEmbeddedConfigurationFactoryTests
20-Oct-2017 00:09:49 [INFO] Running org.springframework.boot.autoconfigure.jmx.JmxAutoConfigurationTests
20-Oct-2017 00:09:50 [INFO] Tests run: 7, Failures: 0, Errors: 0, Skipped: 0, Time elapsed: 0.689 s - in org.springframework.boot.autoconfigure.jmx.JmxAutoConfigurationTests
20-Oct-2017 00:09:50 [INFO] Running org.springframework.boot.autoconfigure.jooq.JooqAutoConfigurationTests
20-Oct-2017 00:09:51 [INFO] Tests run: 5, Failures: 0, Errors: 0, Skipped: 0, Time elapsed: 1.258 s - in org.springframework.boot.autoconfigure.jooq.JooqAutoConfigurationTests
20-Oct-2017 00:09:51 [INFO] Running org.springframework.boot.autoconfigure.jooq.JooqExceptionTranslatorTests
20-Oct-2017 00:09:51 [INFO] Tests run: 10, Failures: 0, Errors: 0, Skipped: 0, Time elapsed: 0.103 s - in org.springframework.boot.autoconfigure.jooq.JooqExceptionTranslatorTests
20-Oct-2017 00:09:51 [INFO] Running org.springframework.boot.autoconfigure.jooq.JooqPropertiesTests
20-Oct-2017 00:09:52 [INFO] Tests run: 4, Failures: 0, Errors: 0, Skipped: 0, Time elapsed: 0.344 s - in org.springframework.boot.autoconfigure.jooq.JooqPropertiesTests
20-Oct-2017 00:09:52 [INFO] Running org.springframework.boot.autoconfigure.jooq.SqlDialectLookupTests
20-Oct-2017 00:09:52 [INFO] Tests run: 11, Failures: 0, Errors: 0, Skipped: 0, Time elapsed: 0 s - in org.springframework.boot.autoconfigure.jooq.SqlDialectLookupTests
20-Oct-2017 00:09:52 [INFO] Running org.springframework.boot.autoconfigure.jsonb.JsonbAutoConfigurationTests
20-Oct-2017 00:09:52 [INFO] Tests run: 1, Failures: 0, Errors: 0, Skipped: 0, Time elapsed: 0.06 s - in org.springframework.boot.autoconfigure.jsonb.JsonbAutoConfigurationTests
20-Oct-2017 00:09:52 [INFO] Running org.springframework.boot.autoconfigure.kafka.KafkaAutoConfigurationIntegrationTests
20-Oct-2017 00:09:58 [INFO] Tests run: 1, Failures: 0, Errors: 0, Skipped: 0, Time elapsed: 6.623 s - in org.springframework.boot.autoconfigure.kafka.KafkaAutoConfigurationIntegrationTests
20-Oct-2017 00:09:58 [INFO] Running org.springframework.boot.autoconfigure.kafka.KafkaAutoConfigurationTests
20-Oct-2017 00:09:59 [INFO] Tests run: 6, Failures: 0, Errors: 0, Skipped: 0, Time elapsed: 0.502 s - in org.springframework.boot.autoconfigure.kafka.KafkaAutoConfigurationTests
20-Oct-2017 00:09:59 [INFO] Running org.springframework.boot.autoconfigure.ldap.LdapAutoConfigurationTests
20-Oct-2017 00:09:59 [INFO] Tests run: 4, Failures: 0, Errors: 0, Skipped: 0, Time elapsed: 0.224 s - in org.springframework.boot.autoconfigure.ldap.LdapAutoConfigurationTests
20-Oct-2017 00:09:59 [INFO] Running org.springframework.boot.autoconfigure.ldap.embedded.EmbeddedLdapAutoConfigurationTests
20-Oct-2017 00:10:00 [INFO] Tests run: 9, Failures: 0, Errors: 0, Skipped: 0, Time elapsed: 1.093 s - in org.springframework.boot.autoconfigure.ldap.embedded.EmbeddedLdapAutoConfigurationTests
20-Oct-2017 00:10:00 [INFO] Running org.springframework.boot.autoconfigure.liquibase.LiquibaseAutoConfigurationTests
20-Oct-2017 00:10:07 [WARNING] Tests run: 15, Failures: 0, Errors: 0, Skipped: 1, Time elapsed: 6.98 s - in org.springframework.boot.autoconfigure.liquibase.LiquibaseAutoConfigurationTests
20-Oct-2017 00:10:07 [INFO] Running org.springframework.boot.autoconfigure.logging.AutoConfigurationReportLoggingInitializerTests
20-Oct-2017 00:10:08 [INFO] Tests run: 7, Failures: 0, Errors: 0, Skipped: 0, Time elapsed: 0.671 s - in org.springframework.boot.autoconfigure.logging.AutoConfigurationReportLoggingInitializerTests
20-Oct-2017 00:10:08 [INFO] Running org.springframework.boot.autoconfigure.mail.MailSenderAutoConfigurationTests
20-Oct-2017 00:10:08 [INFO] Tests run: 11, Failures: 0, Errors: 0, Skipped: 0, Time elapsed: 0.502 s - in org.springframework.boot.autoconfigure.mail.MailSenderAutoConfigurationTests
20-Oct-2017 00:10:08 [INFO] Running org.springframework.boot.autoconfigure.mobile.DeviceDelegatingViewResolverAutoConfigurationTests
20-Oct-2017 00:10:14 [INFO] Tests run: 15, Failures: 0, Errors: 0, Skipped: 0, Time elapsed: 5.391 s - in org.springframework.boot.autoconfigure.mobile.DeviceDelegatingViewResolverAutoConfigurationTests
20-Oct-2017 00:10:14 [INFO] Running org.springframework.boot.autoconfigure.mobile.DeviceResolverAutoConfigurationTests
20-Oct-2017 00:10:15 [INFO] Tests run: 4, Failures: 0, Errors: 0, Skipped: 0, Time elapsed: 1.371 s - in org.springframework.boot.autoconfigure.mobile.DeviceResolverAutoConfigurationTests
20-Oct-2017 00:10:15 [INFO] Running org.springframework.boot.autoconfigure.mobile.SitePreferenceAutoConfigurationTests
20-Oct-2017 00:10:15 [INFO] Tests run: 7, Failures: 0, Errors: 0, Skipped: 0, Time elapsed: 0.48 s - in org.springframework.boot.autoconfigure.mobile.SitePreferenceAutoConfigurationTests
20-Oct-2017 00:10:15 [INFO] Running org.springframework.boot.autoconfigure.mongo.MongoAutoConfigurationTests
20-Oct-2017 00:10:16 [INFO] Tests run: 4, Failures: 0, Errors: 0, Skipped: 0, Time elapsed: 0.273 s - in org.springframework.boot.autoconfigure.mongo.MongoAutoConfigurationTests
20-Oct-2017 00:10:16 [INFO] Running org.springframework.boot.autoconfigure.mongo.MongoClientFactoryTests
20-Oct-2017 00:10:16 [INFO] Tests run: 7, Failures: 0, Errors: 0, Skipped: 0, Time elapsed: 0.026 s - in org.springframework.boot.autoconfigure.mongo.MongoClientFactoryTests
20-Oct-2017 00:10:16 [INFO] Running org.springframework.boot.autoconfigure.mongo.MongoPropertiesTests
20-Oct-2017 00:10:16 [INFO] Tests run: 6, Failures: 0, Errors: 0, Skipped: 0, Time elapsed: 0.091 s - in org.springframework.boot.autoconfigure.mongo.MongoPropertiesTests
20-Oct-2017 00:10:16 [INFO] Running org.springframework.boot.autoconfigure.mongo.MongoReactiveAutoConfigurationTests
20-Oct-2017 00:10:16 [INFO] Tests run: 5, Failures: 0, Errors: 0, Skipped: 0, Time elapsed: 0.315 s - in org.springframework.boot.autoconfigure.mongo.MongoReactiveAutoConfigurationTests
20-Oct-2017 00:10:16 [INFO] Running org.springframework.boot.autoconfigure.mongo.ReactiveMongoClientFactoryTests
20-Oct-2017 00:10:16 [INFO] Tests run: 10, Failures: 0, Errors: 0, Skipped: 0, Time elapsed: 0.02 s - in org.springframework.boot.autoconfigure.mongo.ReactiveMongoClientFactoryTests
20-Oct-2017 00:10:16 [INFO] Running org.springframework.boot.autoconfigure.mongo.embedded.EmbeddedMongoAutoConfigurationTests
20-Oct-2017 00:10:21 [INFO] Tests run: 11, Failures: 0, Errors: 0, Skipped: 0, Time elapsed: 4.772 s - in org.springframework.boot.autoconfigure.mongo.embedded.EmbeddedMongoAutoConfigurationTests
20-Oct-2017 00:10:21 [INFO] Running org.springframework.boot.autoconfigure.mustache.MustacheAutoConfigurationReactiveIntegrationTests
20-Oct-2017 00:10:22 [INFO] Tests run: 2, Failures: 0, Errors: 0, Skipped: 0, Time elapsed: 1.082 s - in org.springframework.boot.autoconfigure.mustache.MustacheAutoConfigurationReactiveIntegrationTests
20-Oct-2017 00:10:22 [INFO] Running org.springframework.boot.autoconfigure.mustache.MustacheAutoConfigurationServletIntegrationTests
20-Oct-2017 00:10:23 [INFO] Tests run: 3, Failures: 0, Errors: 0, Skipped: 0, Time elapsed: 0.561 s - in org.springframework.boot.autoconfigure.mustache.MustacheAutoConfigurationServletIntegrationTests
20-Oct-2017 00:10:23 [INFO] Running org.springframework.boot.autoconfigure.mustache.MustacheAutoConfigurationTests
20-Oct-2017 00:10:23 [INFO] Tests run: 4, Failures: 0, Errors: 0, Skipped: 0, Time elapsed: 0.285 s - in org.springframework.boot.autoconfigure.mustache.MustacheAutoConfigurationTests
20-Oct-2017 00:10:23 [INFO] Running org.springframework.boot.autoconfigure.mustache.MustacheStandaloneIntegrationTests
20-Oct-2017 00:10:23 [INFO] Tests run: 4, Failures: 0, Errors: 0, Skipped: 0, Time elapsed: 0.385 s - in org.springframework.boot.autoconfigure.mustache.MustacheStandaloneIntegrationTests
20-Oct-2017 00:10:23 [INFO] Running org.springframework.boot.autoconfigure.orm.jpa.CustomHibernateJpaAutoConfigurationTests
20-Oct-2017 00:10:24 [INFO] Tests run: 2, Failures: 0, Errors: 0, Skipped: 0, Time elapsed: 0.467 s - in org.springframework.boot.autoconfigure.orm.jpa.CustomHibernateJpaAutoConfigurationTests
20-Oct-2017 00:10:24 [INFO] Running org.springframework.boot.autoconfigure.orm.jpa.DatabaseLookupTests
20-Oct-2017 00:10:24 [INFO] Tests run: 11, Failures: 0, Errors: 0, Skipped: 0, Time elapsed: 0 s - in org.springframework.boot.autoconfigure.orm.jpa.DatabaseLookupTests
20-Oct-2017 00:10:24 [INFO] Running org.springframework.boot.autoconfigure.orm.jpa.HibernateDefaultDdlAutoProviderTests
20-Oct-2017 00:10:25 [INFO] Tests run: 4, Failures: 0, Errors: 0, Skipped: 0, Time elapsed: 1.015 s - in org.springframework.boot.autoconfigure.orm.jpa.HibernateDefaultDdlAutoProviderTests
20-Oct-2017 00:10:25 [INFO] Running org.springframework.boot.autoconfigure.orm.jpa.HibernateJpaAutoConfigurationTests
20-Oct-2017 00:10:34 [INFO] Tests run: 28, Failures: 0, Errors: 0, Skipped: 0, Time elapsed: 9.019 s - in org.springframework.boot.autoconfigure.orm.jpa.HibernateJpaAutoConfigurationTests
20-Oct-2017 00:10:34 [INFO] Running org.springframework.boot.autoconfigure.orm.jpa.JpaPropertiesTests
20-Oct-2017 00:10:34 [INFO] Tests run: 9, Failures: 0, Errors: 0, Skipped: 0, Time elapsed: 0.381 s - in org.springframework.boot.autoconfigure.orm.jpa.JpaPropertiesTests
20-Oct-2017 00:10:34 [INFO] Running org.springframework.boot.autoconfigure.quartz.QuartzAutoConfigurationTests
20-Oct-2017 00:10:36 [INFO] Tests run: 12, Failures: 0, Errors: 0, Skipped: 0, Time elapsed: 2.194 s - in org.springframework.boot.autoconfigure.quartz.QuartzAutoConfigurationTests
20-Oct-2017 00:10:36 [INFO] Running org.springframework.boot.autoconfigure.security.SecurityAutoConfigurationTests
20-Oct-2017 00:10:39 [INFO] Tests run: 13, Failures: 0, Errors: 0, Skipped: 0, Time elapsed: 2.828 s - in org.springframework.boot.autoconfigure.security.SecurityAutoConfigurationTests
20-Oct-2017 00:10:39 [INFO] Running org.springframework.boot.autoconfigure.security.SecurityFilterAutoConfigurationEarlyInitializationTests
20-Oct-2017 00:10:40 [INFO] Tests run: 1, Failures: 0, Errors: 0, Skipped: 0, Time elapsed: 0.88 s - in org.springframework.boot.autoconfigure.security.SecurityFilterAutoConfigurationEarlyInitializationTests
20-Oct-2017 00:10:40 [INFO] Running org.springframework.boot.autoconfigure.security.SecurityFilterAutoConfigurationTests
20-Oct-2017 00:10:41 [INFO] Tests run: 1, Failures: 0, Errors: 0, Skipped: 0, Time elapsed: 0.844 s - in org.springframework.boot.autoconfigure.security.SecurityFilterAutoConfigurationTests
20-Oct-2017 00:10:41 [INFO] Running org.springframework.boot.autoconfigure.security.SecurityPropertiesTests
20-Oct-2017 00:10:41 [INFO] Tests run: 1, Failures: 0, Errors: 0, Skipped: 0, Time elapsed: 0 s - in org.springframework.boot.autoconfigure.security.SecurityPropertiesTests
20-Oct-2017 00:10:41 [INFO] Running org.springframework.boot.autoconfigure.security.StaticResourceRequestTests
20-Oct-2017 00:10:41 [INFO] Tests run: 6, Failures: 0, Errors: 0, Skipped: 0, Time elapsed: 0 s - in org.springframework.boot.autoconfigure.security.StaticResourceRequestTests
20-Oct-2017 00:10:41 [INFO] Running org.springframework.boot.autoconfigure.security.jpa.JpaUserDetailsTests
20-Oct-2017 00:10:41 [INFO] Tests run: 1, Failures: 0, Errors: 0, Skipped: 0, Time elapsed: 0.386 s - in org.springframework.boot.autoconfigure.security.jpa.JpaUserDetailsTests
20-Oct-2017 00:10:41 [INFO] Running org.springframework.boot.autoconfigure.security.oauth2.client.OAuth2ClientPropertiesRegistrationAdapterTests
20-Oct-2017 00:10:41 [INFO] Tests run: 6, Failures: 0, Errors: 0, Skipped: 0, Time elapsed: 0.021 s - in org.springframework.boot.autoconfigure.security.oauth2.client.OAuth2ClientPropertiesRegistrationAdapterTests
20-Oct-2017 00:10:41 [INFO] Running org.springframework.boot.autoconfigure.security.oauth2.client.OAuth2ClientPropertiesTests
20-Oct-2017 00:10:41 [INFO] Tests run: 2, Failures: 0, Errors: 0, Skipped: 0, Time elapsed: 0 s - in org.springframework.boot.autoconfigure.security.oauth2.client.OAuth2ClientPropertiesTests
20-Oct-2017 00:10:41 [INFO] Running org.springframework.boot.autoconfigure.security.oauth2.client.OAuth2ClientRegistrationRepositoryConfigurationTests
20-Oct-2017 00:10:42 [INFO] Tests run: 2, Failures: 0, Errors: 0, Skipped: 0, Time elapsed: 0.081 s - in org.springframework.boot.autoconfigure.security.oauth2.client.OAuth2ClientRegistrationRepositoryConfigurationTests
20-Oct-2017 00:10:42 [INFO] Running org.springframework.boot.autoconfigure.security.oauth2.client.OAuth2WebSecurityConfigurationTests
20-Oct-2017 00:10:42 [INFO] Tests run: 3, Failures: 0, Errors: 0, Skipped: 0, Time elapsed: 0.562 s - in org.springframework.boot.autoconfigure.security.oauth2.client.OAuth2WebSecurityConfigurationTests
20-Oct-2017 00:10:42 [INFO] Running org.springframework.boot.autoconfigure.security.reactive.ReactiveSecurityAutoConfigurationTests
20-Oct-2017 00:10:43 [INFO] Tests run: 4, Failures: 0, Errors: 0, Skipped: 0, Time elapsed: 0.618 s - in org.springframework.boot.autoconfigure.security.reactive.ReactiveSecurityAutoConfigurationTests
20-Oct-2017 00:10:43 [INFO] Running org.springframework.boot.autoconfigure.sendgrid.SendGridAutoConfigurationTests
20-Oct-2017 00:10:43 [INFO] Tests run: 4, Failures: 0, Errors: 0, Skipped: 0, Time elapsed: 0.206 s - in org.springframework.boot.autoconfigure.sendgrid.SendGridAutoConfigurationTests
20-Oct-2017 00:10:43 [INFO] Running org.springframework.boot.autoconfigure.session.NonUniqueSessionRepositoryFailureAnalyzerTests
20-Oct-2017 00:10:43 [INFO] Tests run: 1, Failures: 0, Errors: 0, Skipped: 0, Time elapsed: 0 s - in org.springframework.boot.autoconfigure.session.NonUniqueSessionRepositoryFailureAnalyzerTests
20-Oct-2017 00:10:43 [INFO] Running org.springframework.boot.autoconfigure.session.SessionAutoConfigurationHazelcastTests
20-Oct-2017 00:10:44 [INFO] Tests run: 4, Failures: 0, Errors: 0, Skipped: 0, Time elapsed: 0.533 s - in org.springframework.boot.autoconfigure.session.SessionAutoConfigurationHazelcastTests
20-Oct-2017 00:10:44 [INFO] Running org.springframework.boot.autoconfigure.session.SessionAutoConfigurationIntegrationTests
20-Oct-2017 00:10:44 [INFO] Tests run: 3, Failures: 0, Errors: 0, Skipped: 0, Time elapsed: 0.735 s - in org.springframework.boot.autoconfigure.session.SessionAutoConfigurationIntegrationTests
20-Oct-2017 00:10:44 [INFO] Running org.springframework.boot.autoconfigure.session.SessionAutoConfigurationJdbcTests
20-Oct-2017 00:10:45 [INFO] Tests run: 5, Failures: 0, Errors: 0, Skipped: 0, Time elapsed: 1.171 s - in org.springframework.boot.autoconfigure.session.SessionAutoConfigurationJdbcTests
20-Oct-2017 00:10:45 [INFO] Running org.springframework.boot.autoconfigure.session.SessionAutoConfigurationMongoTests
20-Oct-2017 00:10:47 [INFO] Tests run: 3, Failures: 0, Errors: 0, Skipped: 0, Time elapsed: 1.419 s - in org.springframework.boot.autoconfigure.session.SessionAutoConfigurationMongoTests
20-Oct-2017 00:10:47 [INFO] Running org.springframework.boot.autoconfigure.session.SessionAutoConfigurationRedisTests
20-Oct-2017 00:10:51 [INFO] Tests run: 3, Failures: 0, Errors: 0, Skipped: 0, Time elapsed: 4.166 s - in org.springframework.boot.autoconfigure.session.SessionAutoConfigurationRedisTests
20-Oct-2017 00:10:51 [INFO] Running org.springframework.boot.autoconfigure.session.SessionAutoConfigurationTests
20-Oct-2017 00:10:52 [INFO] Tests run: 8, Failures: 0, Errors: 0, Skipped: 0, Time elapsed: 0.62 s - in org.springframework.boot.autoconfigure.session.SessionAutoConfigurationTests
20-Oct-2017 00:10:52 [INFO] Running org.springframework.boot.autoconfigure.social.FacebookAutoConfigurationTests
20-Oct-2017 00:10:52 [INFO] Tests run: 2, Failures: 0, Errors: 0, Skipped: 0, Time elapsed: 0.257 s - in org.springframework.boot.autoconfigure.social.FacebookAutoConfigurationTests
20-Oct-2017 00:10:52 [INFO] Running org.springframework.boot.autoconfigure.social.LinkedInAutoConfigurationTests
20-Oct-2017 00:10:52 [INFO] Tests run: 2, Failures: 0, Errors: 0, Skipped: 0, Time elapsed: 0.148 s - in org.springframework.boot.autoconfigure.social.LinkedInAutoConfigurationTests
20-Oct-2017 00:10:52 [INFO] Running org.springframework.boot.autoconfigure.social.MultiApiAutoConfigurationTests
20-Oct-2017 00:10:53 [INFO] Tests run: 7, Failures: 0, Errors: 0, Skipped: 0, Time elapsed: 0.636 s - in org.springframework.boot.autoconfigure.social.MultiApiAutoConfigurationTests
20-Oct-2017 00:10:53 [INFO] Running org.springframework.boot.autoconfigure.social.TwitterAutoConfigurationTests
20-Oct-2017 00:10:53 [INFO] Tests run: 2, Failures: 0, Errors: 0, Skipped: 0, Time elapsed: 0.139 s - in org.springframework.boot.autoconfigure.social.TwitterAutoConfigurationTests
20-Oct-2017 00:10:53 [INFO] Running org.springframework.boot.autoconfigure.template.TemplateAvailabilityProvidersTests
20-Oct-2017 00:10:53 [INFO] Tests run: 16, Failures: 0, Errors: 0, Skipped: 0, Time elapsed: 0.061 s - in org.springframework.boot.autoconfigure.template.TemplateAvailabilityProvidersTests
20-Oct-2017 00:10:53 [INFO] Running org.springframework.boot.autoconfigure.template.ViewResolverPropertiesTests
20-Oct-2017 00:10:53 [INFO] Tests run: 5, Failures: 0, Errors: 0, Skipped: 0, Time elapsed: 0 s - in org.springframework.boot.autoconfigure.template.ViewResolverPropertiesTests
20-Oct-2017 00:10:53 [INFO] Running org.springframework.boot.autoconfigure.thymeleaf.ThymeleafReactiveAutoConfigurationTests
20-Oct-2017 00:10:55 [INFO] Tests run: 14, Failures: 0, Errors: 0, Skipped: 0, Time elapsed: 2.179 s - in org.springframework.boot.autoconfigure.thymeleaf.ThymeleafReactiveAutoConfigurationTests
20-Oct-2017 00:10:55 [INFO] Running org.springframework.boot.autoconfigure.thymeleaf.ThymeleafServletAutoConfigurationTests
20-Oct-2017 00:10:57 [INFO] Tests run: 15, Failures: 0, Errors: 0, Skipped: 0, Time elapsed: 2.26 s - in org.springframework.boot.autoconfigure.thymeleaf.ThymeleafServletAutoConfigurationTests
20-Oct-2017 00:10:57 [INFO] Running org.springframework.boot.autoconfigure.thymeleaf.ThymeleafTemplateAvailabilityProviderTests
20-Oct-2017 00:10:57 [INFO] Tests run: 4, Failures: 0, Errors: 0, Skipped: 0, Time elapsed: 0 s - in org.springframework.boot.autoconfigure.thymeleaf.ThymeleafTemplateAvailabilityProviderTests
20-Oct-2017 00:10:57 [INFO] Running org.springframework.boot.autoconfigure.transaction.TransactionAutoConfigurationTests
20-Oct-2017 00:10:58 [INFO] Tests run: 9, Failures: 0, Errors: 0, Skipped: 0, Time elapsed: 0.88 s - in org.springframework.boot.autoconfigure.transaction.TransactionAutoConfigurationTests
20-Oct-2017 00:10:58 [INFO] Running org.springframework.boot.autoconfigure.transaction.TransactionManagerCustomizersTests
20-Oct-2017 00:10:58 [INFO] Tests run: 2, Failures: 0, Errors: 0, Skipped: 0, Time elapsed: 0 s - in org.springframework.boot.autoconfigure.transaction.TransactionManagerCustomizersTests
20-Oct-2017 00:10:58 [INFO] Running org.springframework.boot.autoconfigure.transaction.jta.JtaAutoConfigurationTests
20-Oct-2017 00:11:03 [INFO] Tests run: 15, Failures: 0, Errors: 0, Skipped: 0, Time elapsed: 5.17 s - in org.springframework.boot.autoconfigure.transaction.jta.JtaAutoConfigurationTests
20-Oct-2017 00:11:03 [INFO] Running org.springframework.boot.autoconfigure.validation.ValidationAutoConfigurationTests
20-Oct-2017 00:11:04 [INFO] Tests run: 11, Failures: 0, Errors: 0, Skipped: 0, Time elapsed: 0.782 s - in org.springframework.boot.autoconfigure.validation.ValidationAutoConfigurationTests
20-Oct-2017 00:11:04 [INFO] Running org.springframework.boot.autoconfigure.validation.ValidationAutoConfigurationWithHibernateValidatorMissingElImplTests
20-Oct-2017 00:11:06 [INFO] Tests run: 1, Failures: 0, Errors: 0, Skipped: 0, Time elapsed: 1.42 s - in org.springframework.boot.autoconfigure.validation.ValidationAutoConfigurationWithHibernateValidatorMissingElImplTests
20-Oct-2017 00:11:06 [INFO] Running org.springframework.boot.autoconfigure.validation.ValidationAutoConfigurationWithoutValidatorTests
20-Oct-2017 00:11:07 [INFO] Tests run: 1, Failures: 0, Errors: 0, Skipped: 0, Time elapsed: 0.89 s - in org.springframework.boot.autoconfigure.validation.ValidationAutoConfigurationWithoutValidatorTests
20-Oct-2017 00:11:07 [INFO] Running org.springframework.boot.autoconfigure.validation.ValidatorAdapterTests
20-Oct-2017 00:11:07 [INFO] Tests run: 3, Failures: 0, Errors: 0, Skipped: 0, Time elapsed: 0.212 s - in org.springframework.boot.autoconfigure.validation.ValidatorAdapterTests
20-Oct-2017 00:11:07 [INFO] Running org.springframework.boot.autoconfigure.web.ConditionalOnEnabledResourceChainTests
20-Oct-2017 00:11:07 [INFO] Tests run: 5, Failures: 0, Errors: 0, Skipped: 0, Time elapsed: 0.152 s - in org.springframework.boot.autoconfigure.web.ConditionalOnEnabledResourceChainTests
20-Oct-2017 00:11:07 [INFO] Running org.springframework.boot.autoconfigure.web.ResourcePropertiesTests
20-Oct-2017 00:11:07 [INFO] Tests run: 6, Failures: 0, Errors: 0, Skipped: 0, Time elapsed: 0 s - in org.springframework.boot.autoconfigure.web.ResourcePropertiesTests
20-Oct-2017 00:11:07 [INFO] Running org.springframework.boot.autoconfigure.web.ServerPropertiesTests
20-Oct-2017 00:11:07 [INFO] Tests run: 16, Failures: 0, Errors: 0, Skipped: 0, Time elapsed: 0.005 s - in org.springframework.boot.autoconfigure.web.ServerPropertiesTests
20-Oct-2017 00:11:07 [INFO] Running org.springframework.boot.autoconfigure.web.client.RestTemplateAutoConfigurationTests
20-Oct-2017 00:11:07 [INFO] Tests run: 6, Failures: 0, Errors: 0, Skipped: 0, Time elapsed: 0.362 s - in org.springframework.boot.autoconfigure.web.client.RestTemplateAutoConfigurationTests
20-Oct-2017 00:11:07 [INFO] Running org.springframework.boot.autoconfigure.web.reactive.DefaultReactiveWebServerCustomizerTests
20-Oct-2017 00:11:07 [INFO] Tests run: 2, Failures: 0, Errors: 0, Skipped: 0, Time elapsed: 0.034 s - in org.springframework.boot.autoconfigure.web.reactive.DefaultReactiveWebServerCustomizerTests
20-Oct-2017 00:11:07 [INFO] Running org.springframework.boot.autoconfigure.web.reactive.HttpHandlerAutoConfigurationTests
20-Oct-2017 00:11:08 [INFO] Tests run: 2, Failures: 0, Errors: 0, Skipped: 0, Time elapsed: 0.19 s - in org.springframework.boot.autoconfigure.web.reactive.HttpHandlerAutoConfigurationTests
20-Oct-2017 00:11:08 [INFO] Running org.springframework.boot.autoconfigure.web.reactive.ReactiveWebServerAutoConfigurationTests
20-Oct-2017 00:11:08 [INFO] Tests run: 4, Failures: 0, Errors: 0, Skipped: 0, Time elapsed: 0.251 s - in org.springframework.boot.autoconfigure.web.reactive.ReactiveWebServerAutoConfigurationTests
20-Oct-2017 00:11:08 [INFO] Running org.springframework.boot.autoconfigure.web.reactive.WebFluxAutoConfigurationTests
20-Oct-2017 00:11:10 [INFO] Tests run: 16, Failures: 0, Errors: 0, Skipped: 0, Time elapsed: 2.064 s - in org.springframework.boot.autoconfigure.web.reactive.WebFluxAutoConfigurationTests
20-Oct-2017 00:11:10 [INFO] Running org.springframework.boot.autoconfigure.web.reactive.error.DefaultErrorAttributesTests
20-Oct-2017 00:11:10 [INFO] Tests run: 10, Failures: 0, Errors: 0, Skipped: 0, Time elapsed: 0.017 s - in org.springframework.boot.autoconfigure.web.reactive.error.DefaultErrorAttributesTests
20-Oct-2017 00:11:10 [INFO] Running org.springframework.boot.autoconfigure.web.reactive.function.client.WebClientAutoConfigurationTests
20-Oct-2017 00:11:10 [INFO] Tests run: 4, Failures: 0, Errors: 0, Skipped: 0, Time elapsed: 0.231 s - in org.springframework.boot.autoconfigure.web.reactive.function.client.WebClientAutoConfigurationTests
20-Oct-2017 00:11:10 [INFO] Running org.springframework.boot.autoconfigure.web.servlet.DefaultServletWebServerFactoryCustomizerTests
20-Oct-2017 00:11:12 [INFO] Tests run: 38, Failures: 0, Errors: 0, Skipped: 0, Time elapsed: 1.335 s - in org.springframework.boot.autoconfigure.web.servlet.DefaultServletWebServerFactoryCustomizerTests
20-Oct-2017 00:11:12 [INFO] Running org.springframework.boot.autoconfigure.web.servlet.DispatcherServletAutoConfigurationTests
20-Oct-2017 00:11:13 [INFO] Tests run: 9, Failures: 0, Errors: 0, Skipped: 0, Time elapsed: 1.633 s - in org.springframework.boot.autoconfigure.web.servlet.DispatcherServletAutoConfigurationTests
20-Oct-2017 00:11:13 [INFO] Running org.springframework.boot.autoconfigure.web.servlet.FilterOrderingIntegrationTests
20-Oct-2017 00:11:14 [INFO] Tests run: 1, Failures: 0, Errors: 0, Skipped: 0, Time elapsed: 0.949 s - in org.springframework.boot.autoconfigure.web.servlet.FilterOrderingIntegrationTests
20-Oct-2017 00:11:14 [INFO] Running org.springframework.boot.autoconfigure.web.servlet.HttpEncodingAutoConfigurationTests
20-Oct-2017 00:11:15 [INFO] Tests run: 11, Failures: 0, Errors: 0, Skipped: 0, Time elapsed: 0.743 s - in org.springframework.boot.autoconfigure.web.servlet.HttpEncodingAutoConfigurationTests
20-Oct-2017 00:11:15 [INFO] Running org.springframework.boot.autoconfigure.web.servlet.JspTemplateAvailabilityProviderTests
20-Oct-2017 00:11:15 [INFO] Tests run: 3, Failures: 0, Errors: 0, Skipped: 0, Time elapsed: 0.001 s - in org.springframework.boot.autoconfigure.web.servlet.JspTemplateAvailabilityProviderTests
20-Oct-2017 00:11:15 [INFO] Running org.springframework.boot.autoconfigure.web.servlet.MultipartAutoConfigurationTests
20-Oct-2017 00:11:20 [INFO] Tests run: 11, Failures: 0, Errors: 0, Skipped: 0, Time elapsed: 4.872 s - in org.springframework.boot.autoconfigure.web.servlet.MultipartAutoConfigurationTests
20-Oct-2017 00:11:20 [INFO] Running org.springframework.boot.autoconfigure.web.servlet.ServletWebServerFactoryAutoConfigurationTests
20-Oct-2017 00:11:21 [INFO] Tests run: 9, Failures: 0, Errors: 0, Skipped: 0, Time elapsed: 1.66 s - in org.springframework.boot.autoconfigure.web.servlet.ServletWebServerFactoryAutoConfigurationTests
20-Oct-2017 00:11:21 [INFO] Running org.springframework.boot.autoconfigure.web.servlet.ServletWebServerServletContextListenerTests
20-Oct-2017 00:11:22 [INFO] Tests run: 6, Failures: 0, Errors: 0, Skipped: 0, Time elapsed: 0.68 s - in org.springframework.boot.autoconfigure.web.servlet.ServletWebServerServletContextListenerTests
20-Oct-2017 00:11:22 [INFO] Running org.springframework.boot.autoconfigure.web.servlet.WebMvcAutoConfigurationTests
20-Oct-2017 00:11:36 [INFO] Tests run: 53, Failures: 0, Errors: 0, Skipped: 0, Time elapsed: 13.749 s - in org.springframework.boot.autoconfigure.web.servlet.WebMvcAutoConfigurationTests
20-Oct-2017 00:11:36 [INFO] Running org.springframework.boot.autoconfigure.web.servlet.error.BasicErrorControllerDirectMockMvcTests
20-Oct-2017 00:11:40 [INFO] Tests run: 4, Failures: 0, Errors: 0, Skipped: 0, Time elapsed: 4.18 s - in org.springframework.boot.autoconfigure.web.servlet.error.BasicErrorControllerDirectMockMvcTests
20-Oct-2017 00:11:40 [INFO] Running org.springframework.boot.autoconfigure.web.servlet.error.BasicErrorControllerIntegrationTests
20-Oct-2017 00:11:52 [INFO] Tests run: 10, Failures: 0, Errors: 0, Skipped: 0, Time elapsed: 12.141 s - in org.springframework.boot.autoconfigure.web.servlet.error.BasicErrorControllerIntegrationTests
20-Oct-2017 00:11:52 [INFO] Running org.springframework.boot.autoconfigure.web.servlet.error.BasicErrorControllerMockMvcTests
20-Oct-2017 00:11:53 [INFO] Tests run: 4, Failures: 0, Errors: 0, Skipped: 0, Time elapsed: 0.81 s - in org.springframework.boot.autoconfigure.web.servlet.error.BasicErrorControllerMockMvcTests
20-Oct-2017 00:11:53 [INFO] Running org.springframework.boot.autoconfigure.web.servlet.error.DefaultErrorViewIntegrationTests
20-Oct-2017 00:11:54 [INFO] Tests run: 3, Failures: 0, Errors: 0, Skipped: 0, Time elapsed: 0.601 s - in org.springframework.boot.autoconfigure.web.servlet.error.DefaultErrorViewIntegrationTests
20-Oct-2017 00:11:54 [INFO] Running org.springframework.boot.autoconfigure.web.servlet.error.DefaultErrorViewResolverTests
20-Oct-2017 00:11:54 [INFO] Tests run: 13, Failures: 0, Errors: 0, Skipped: 0, Time elapsed: 0.302 s - in org.springframework.boot.autoconfigure.web.servlet.error.DefaultErrorViewResolverTests
20-Oct-2017 00:11:54 [INFO] Running org.springframework.boot.autoconfigure.web.servlet.error.NonRecursivePropertyPlaceholderHelperTests
20-Oct-2017 00:11:54 [INFO] Tests run: 2, Failures: 0, Errors: 0, Skipped: 0, Time elapsed: 0 s - in org.springframework.boot.autoconfigure.web.servlet.error.NonRecursivePropertyPlaceholderHelperTests
20-Oct-2017 00:11:54 [INFO] Running org.springframework.boot.autoconfigure.web.servlet.error.RemappedErrorViewIntegrationTests
20-Oct-2017 00:11:55 [INFO] Tests run: 2, Failures: 0, Errors: 0, Skipped: 0, Time elapsed: 0.686 s - in org.springframework.boot.autoconfigure.web.servlet.error.RemappedErrorViewIntegrationTests
20-Oct-2017 00:11:55 [INFO] Running org.springframework.boot.autoconfigure.webservices.WebServicesAutoConfigurationTests
20-Oct-2017 00:11:55 [INFO] Tests run: 7, Failures: 0, Errors: 0, Skipped: 0, Time elapsed: 0.686 s - in org.springframework.boot.autoconfigure.webservices.WebServicesAutoConfigurationTests
20-Oct-2017 00:11:55 [INFO] Running org.springframework.boot.autoconfigure.websocket.servlet.WebSocketMessagingAutoConfigurationTests
20-Oct-2017 00:11:57 [INFO] Tests run: 3, Failures: 0, Errors: 0, Skipped: 0, Time elapsed: 1.634 s - in org.springframework.boot.autoconfigure.websocket.servlet.WebSocketMessagingAutoConfigurationTests
20-Oct-2017 00:11:57 [INFO] Running org.springframework.boot.autoconfigure.websocket.servlet.WebSocketServletAutoConfigurationTests
20-Oct-2017 00:11:58 [INFO] Tests run: 2, Failures: 0, Errors: 0, Skipped: 0, Time elapsed: 0.594 s - in org.springframework.boot.autoconfigure.websocket.servlet.WebSocketServletAutoConfigurationTests
20-Oct-2017 00:11:58 [INFO]
20-Oct-2017 00:11:58 [INFO] Results:
20-Oct-2017 00:11:58 [INFO]
20-Oct-2017 00:11:58 [WARNING] Tests run: 1611, Failures: 0, Errors: 0, Skipped: 10
20-Oct-2017 00:11:58 [INFO]
20-Oct-2017 00:11:58 [INFO]
20-Oct-2017 00:11:58 [INFO] --- maven-jar-plugin:3.0.2:jar (default-jar) @ spring-boot-autoconfigure ---
20-Oct-2017 00:11:58 [INFO] Building jar: /opt/bamboo-home/xml-data/build-dir/BOOT-JDK9-JOB1/spring-boot-project/spring-boot-autoconfigure/target/spring-boot-autoconfigure-2.0.0.BUILD-SNAPSHOT.jar
20-Oct-2017 00:11:58 [INFO]
20-Oct-2017 00:11:58 [INFO] --- maven-source-plugin:3.0.1:jar-no-fork (attach-sources) @ spring-boot-autoconfigure ---
20-Oct-2017 00:11:58 [INFO] Building jar: /opt/bamboo-home/xml-data/build-dir/BOOT-JDK9-JOB1/spring-boot-project/spring-boot-autoconfigure/target/spring-boot-autoconfigure-2.0.0.BUILD-SNAPSHOT-sources.jar
20-Oct-2017 00:11:58 [INFO]
20-Oct-2017 00:11:58 [INFO] --- maven-install-plugin:2.5.2:install (default-install) @ spring-boot-autoconfigure ---
20-Oct-2017 00:11:58 [INFO] Installing /opt/bamboo-home/xml-data/build-dir/BOOT-JDK9-JOB1/spring-boot-project/spring-boot-autoconfigure/target/spring-boot-autoconfigure-2.0.0.BUILD-SNAPSHOT.jar to /home/bamboo/.m2/repository/org/springframework/boot/spring-boot-autoconfigure/2.0.0.BUILD-SNAPSHOT/spring-boot-autoconfigure-2.0.0.BUILD-SNAPSHOT.jar
20-Oct-2017 00:11:58 [INFO] Installing /opt/bamboo-home/xml-data/build-dir/BOOT-JDK9-JOB1/spring-boot-project/spring-boot-autoconfigure/.flattened-pom.xml to /home/bamboo/.m2/repository/org/springframework/boot/spring-boot-autoconfigure/2.0.0.BUILD-SNAPSHOT/spring-boot-autoconfigure-2.0.0.BUILD-SNAPSHOT.pom
20-Oct-2017 00:11:58 [INFO] Installing /opt/bamboo-home/xml-data/build-dir/BOOT-JDK9-JOB1/spring-boot-project/spring-boot-autoconfigure/target/spring-boot-autoconfigure-2.0.0.BUILD-SNAPSHOT-sources.jar to /home/bamboo/.m2/repository/org/springframework/boot/spring-boot-autoconfigure/2.0.0.BUILD-SNAPSHOT/spring-boot-autoconfigure-2.0.0.BUILD-SNAPSHOT-sources.jar
20-Oct-2017 00:11:58 [INFO]
20-Oct-2017 00:11:58 [INFO] ------------------------------------------------------------------------
20-Oct-2017 00:11:58 [INFO] Building Spring Boot Actuator 2.0.0.BUILD-SNAPSHOT
20-Oct-2017 00:11:58 [INFO] ------------------------------------------------------------------------
20-Oct-2017 00:11:59 [INFO]
20-Oct-2017 00:11:59 [INFO] --- maven-clean-plugin:3.0.0:clean (default-clean) @ spring-boot-actuator ---
20-Oct-2017 00:11:59 [INFO]
20-Oct-2017 00:11:59 [INFO] --- maven-checkstyle-plugin:2.17:check (checkstyle-validation) @ spring-boot-actuator ---
20-Oct-2017 00:12:00 [INFO] Starting audit...
20-Oct-2017 00:12:00 Audit done.
20-Oct-2017 00:12:00 [INFO]
20-Oct-2017 00:12:00 [INFO] --- maven-enforcer-plugin:3.0.0-M1:enforce (enforce-rules) @ spring-boot-actuator ---
20-Oct-2017 00:12:00 [INFO]
20-Oct-2017 00:12:00 [INFO] --- maven-resources-plugin:3.0.1:resources (default-resources) @ spring-boot-actuator ---
20-Oct-2017 00:12:00 [INFO] Using 'UTF-8' encoding to copy filtered resources.
20-Oct-2017 00:12:00 [INFO] skip non existing resourceDirectory /opt/bamboo-home/xml-data/build-dir/BOOT-JDK9-JOB1/spring-boot-project/spring-boot-actuator/src/main/resources
20-Oct-2017 00:12:00 [INFO]
20-Oct-2017 00:12:00 [INFO] --- flatten-maven-plugin:1.0.0:flatten (flatten) @ spring-boot-actuator ---
20-Oct-2017 00:12:00 [INFO] Generating flattened POM of project org.springframework.boot:spring-boot-actuator:jar:2.0.0.BUILD-SNAPSHOT...
20-Oct-2017 00:12:00 [INFO]
20-Oct-2017 00:12:00 [INFO] --- maven-compiler-plugin:3.7.0:compile (default-compile) @ spring-boot-actuator ---
20-Oct-2017 00:12:00 [INFO] Changes detected - recompiling the module!
20-Oct-2017 00:12:00 [INFO] Compiling 194 source files to /opt/bamboo-home/xml-data/build-dir/BOOT-JDK9-JOB1/spring-boot-project/spring-boot-actuator/target/classes
20-Oct-2017 00:12:02 [INFO]
20-Oct-2017 00:12:02 [INFO] --- maven-resources-plugin:3.0.1:testResources (default-testResources) @ spring-boot-actuator ---
20-Oct-2017 00:12:02 [INFO] Using 'UTF-8' encoding to copy filtered resources.
20-Oct-2017 00:12:02 [INFO] Copying 11 resources
20-Oct-2017 00:12:02 [INFO]
20-Oct-2017 00:12:02 [INFO] --- maven-compiler-plugin:3.7.0:testCompile (default-testCompile) @ spring-boot-actuator ---
20-Oct-2017 00:12:02 [INFO] Changes detected - recompiling the module!
20-Oct-2017 00:12:02 [INFO] Compiling 97 source files to /opt/bamboo-home/xml-data/build-dir/BOOT-JDK9-JOB1/spring-boot-project/spring-boot-actuator/target/test-classes
20-Oct-2017 00:12:04 [INFO]
20-Oct-2017 00:12:04 [INFO] --- maven-surefire-plugin:2.20.1:test (default-test) @ spring-boot-actuator ---
20-Oct-2017 00:12:04 [INFO]
20-Oct-2017 00:12:04 [INFO] -------------------------------------------------------
20-Oct-2017 00:12:04 [INFO]  T E S T S
20-Oct-2017 00:12:04 [INFO] -------------------------------------------------------
20-Oct-2017 00:12:05 [INFO] Running org.springframework.boot.actuate.ActuatorConfigurationClassTests
20-Oct-2017 00:12:06 [INFO] Tests run: 1, Failures: 0, Errors: 0, Skipped: 0, Time elapsed: 0.894 s - in org.springframework.boot.actuate.ActuatorConfigurationClassTests
20-Oct-2017 00:12:06 [INFO] Running org.springframework.boot.actuate.amqp.RabbitHealthIndicatorTests
20-Oct-2017 00:12:07 [INFO] Tests run: 3, Failures: 0, Errors: 0, Skipped: 0, Time elapsed: 1.433 s - in org.springframework.boot.actuate.amqp.RabbitHealthIndicatorTests
20-Oct-2017 00:12:07 [INFO] Running org.springframework.boot.actuate.audit.AuditEventTests
20-Oct-2017 00:12:08 [INFO] Tests run: 6, Failures: 0, Errors: 0, Skipped: 0, Time elapsed: 0.196 s - in org.springframework.boot.actuate.audit.AuditEventTests
20-Oct-2017 00:12:08 [INFO] Running org.springframework.boot.actuate.audit.AuditEventsEndpointTests
20-Oct-2017 00:12:08 [INFO] Tests run: 3, Failures: 0, Errors: 0, Skipped: 0, Time elapsed: 0.019 s - in org.springframework.boot.actuate.audit.AuditEventsEndpointTests
20-Oct-2017 00:12:08 [INFO] Running org.springframework.boot.actuate.audit.AuditEventsEndpointWebIntegrationTests
20-Oct-2017 00:12:13 [INFO] Tests run: 12, Failures: 0, Errors: 0, Skipped: 0, Time elapsed: 5.488 s - in org.springframework.boot.actuate.audit.AuditEventsEndpointWebIntegrationTests
20-Oct-2017 00:12:13 [INFO] Running org.springframework.boot.actuate.audit.AuditEventsJmxEndpointExtensionTests
20-Oct-2017 00:12:13 [INFO] Tests run: 2, Failures: 0, Errors: 0, Skipped: 0, Time elapsed: 0 s - in org.springframework.boot.actuate.audit.AuditEventsJmxEndpointExtensionTests
20-Oct-2017 00:12:13 [INFO] Running org.springframework.boot.actuate.audit.InMemoryAuditEventRepositoryTests
20-Oct-2017 00:12:13 [INFO] Tests run: 6, Failures: 0, Errors: 0, Skipped: 0, Time elapsed: 0.002 s - in org.springframework.boot.actuate.audit.InMemoryAuditEventRepositoryTests
20-Oct-2017 00:12:13 [INFO] Running org.springframework.boot.actuate.audit.listener.AuditListenerTests
20-Oct-2017 00:12:13 [INFO] Tests run: 1, Failures: 0, Errors: 0, Skipped: 0, Time elapsed: 0.007 s - in org.springframework.boot.actuate.audit.listener.AuditListenerTests
20-Oct-2017 00:12:13 [INFO] Running org.springframework.boot.actuate.beans.BeansEndpointTests
20-Oct-2017 00:12:13 [INFO] Tests run: 4, Failures: 0, Errors: 0, Skipped: 0, Time elapsed: 0.166 s - in org.springframework.boot.actuate.beans.BeansEndpointTests
20-Oct-2017 00:12:13 [INFO] Running org.springframework.boot.actuate.context.ShutdownEndpointTests
20-Oct-2017 00:12:16 [INFO] Tests run: 3, Failures: 0, Errors: 0, Skipped: 0, Time elapsed: 3.099 s - in org.springframework.boot.actuate.context.ShutdownEndpointTests
20-Oct-2017 00:12:16 [INFO] Running org.springframework.boot.actuate.context.properties.ConfigurationPropertiesReportEndpointMethodAnnotationsTests
20-Oct-2017 00:12:17 [INFO] Tests run: 2, Failures: 0, Errors: 0, Skipped: 0, Time elapsed: 0.212 s - in org.springframework.boot.actuate.context.properties.ConfigurationPropertiesReportEndpointMethodAnnotationsTests
20-Oct-2017 00:12:17 [INFO] Running org.springframework.boot.actuate.context.properties.ConfigurationPropertiesReportEndpointParentTests
20-Oct-2017 00:12:17 [INFO] Tests run: 2, Failures: 0, Errors: 0, Skipped: 0, Time elapsed: 0.216 s - in org.springframework.boot.actuate.context.properties.ConfigurationPropertiesReportEndpointParentTests
20-Oct-2017 00:12:17 [INFO] Running org.springframework.boot.actuate.context.properties.ConfigurationPropertiesReportEndpointProxyTests
20-Oct-2017 00:12:17 [INFO] Tests run: 1, Failures: 0, Errors: 0, Skipped: 0, Time elapsed: 0.469 s - in org.springframework.boot.actuate.context.properties.ConfigurationPropertiesReportEndpointProxyTests
20-Oct-2017 00:12:17 [INFO] Running org.springframework.boot.actuate.context.properties.ConfigurationPropertiesReportEndpointSerializationTests
20-Oct-2017 00:12:18 [INFO] Tests run: 8, Failures: 0, Errors: 0, Skipped: 0, Time elapsed: 0.475 s - in org.springframework.boot.actuate.context.properties.ConfigurationPropertiesReportEndpointSerializationTests
20-Oct-2017 00:12:18 [INFO] Running org.springframework.boot.actuate.context.properties.ConfigurationPropertiesReportEndpointTests
20-Oct-2017 00:12:18 [INFO] Tests run: 9, Failures: 0, Errors: 0, Skipped: 0, Time elapsed: 0.401 s - in org.springframework.boot.actuate.context.properties.ConfigurationPropertiesReportEndpointTests
20-Oct-2017 00:12:18 [INFO] Running org.springframework.boot.actuate.elasticsearch.ElasticsearchHealthIndicatorTests
20-Oct-2017 00:12:19 [INFO] Tests run: 7, Failures: 0, Errors: 0, Skipped: 0, Time elapsed: 0.549 s - in org.springframework.boot.actuate.elasticsearch.ElasticsearchHealthIndicatorTests
20-Oct-2017 00:12:19 [INFO] Running org.springframework.boot.actuate.elasticsearch.ElasticsearchJestHealthIndicatorTests
20-Oct-2017 00:12:19 [INFO] Tests run: 3, Failures: 0, Errors: 0, Skipped: 0, Time elapsed: 0.074 s - in org.springframework.boot.actuate.elasticsearch.ElasticsearchJestHealthIndicatorTests
20-Oct-2017 00:12:19 [INFO] Running org.springframework.boot.actuate.endpoint.NamePatternFilterTests
20-Oct-2017 00:12:19 [INFO] Tests run: 7, Failures: 0, Errors: 0, Skipped: 0, Time elapsed: 0 s - in org.springframework.boot.actuate.endpoint.NamePatternFilterTests
20-Oct-2017 00:12:19 [INFO] Running org.springframework.boot.actuate.endpoint.SanitizerTests
20-Oct-2017 00:12:19 [INFO] Tests run: 2, Failures: 0, Errors: 0, Skipped: 0, Time elapsed: 0 s - in org.springframework.boot.actuate.endpoint.SanitizerTests
20-Oct-2017 00:12:19 [INFO] Running org.springframework.boot.actuate.endpoint.annotation.AnnotationEndpointDiscovererTests
20-Oct-2017 00:12:19 [INFO] Tests run: 8, Failures: 0, Errors: 0, Skipped: 0, Time elapsed: 0.211 s - in org.springframework.boot.actuate.endpoint.annotation.AnnotationEndpointDiscovererTests
20-Oct-2017 00:12:19 [INFO] Running org.springframework.boot.actuate.endpoint.cache.CachingOperationInvokerTests
20-Oct-2017 00:12:19 [INFO] Tests run: 3, Failures: 0, Errors: 0, Skipped: 0, Time elapsed: 0.065 s - in org.springframework.boot.actuate.endpoint.cache.CachingOperationInvokerTests
20-Oct-2017 00:12:19 [INFO] Running org.springframework.boot.actuate.endpoint.convert.ConversionServiceOperationParameterMapperTests
20-Oct-2017 00:12:19 [INFO] Tests run: 4, Failures: 0, Errors: 0, Skipped: 0, Time elapsed: 0.077 s - in org.springframework.boot.actuate.endpoint.convert.ConversionServiceOperationParameterMapperTests
20-Oct-2017 00:12:19 [INFO] Running org.springframework.boot.actuate.endpoint.convert.IsoOffsetDateTimeConverterTests
20-Oct-2017 00:12:19 [INFO] Tests run: 2, Failures: 0, Errors: 0, Skipped: 0, Time elapsed: 0 s - in org.springframework.boot.actuate.endpoint.convert.IsoOffsetDateTimeConverterTests
20-Oct-2017 00:12:19 [INFO] Running org.springframework.boot.actuate.endpoint.jmx.EndpointMBeanInfoAssemblerTests
20-Oct-2017 00:12:19 [INFO] Tests run: 2, Failures: 0, Errors: 0, Skipped: 0, Time elapsed: 0.007 s - in org.springframework.boot.actuate.endpoint.jmx.EndpointMBeanInfoAssemblerTests
20-Oct-2017 00:12:19 [INFO] Running org.springframework.boot.actuate.endpoint.jmx.EndpointMBeanRegistrarTests
20-Oct-2017 00:12:19 [INFO] Tests run: 8, Failures: 0, Errors: 0, Skipped: 0, Time elapsed: 0.133 s - in org.springframework.boot.actuate.endpoint.jmx.EndpointMBeanRegistrarTests
20-Oct-2017 00:12:19 [INFO] Running org.springframework.boot.actuate.endpoint.jmx.EndpointMBeanTests
20-Oct-2017 00:12:20 [INFO] Tests run: 11, Failures: 0, Errors: 0, Skipped: 0, Time elapsed: 0.321 s - in org.springframework.boot.actuate.endpoint.jmx.EndpointMBeanTests
20-Oct-2017 00:12:20 [INFO] Running org.springframework.boot.actuate.endpoint.jmx.annotation.JmxAnnotationEndpointDiscovererTests
20-Oct-2017 00:12:20 [INFO] Tests run: 13, Failures: 0, Errors: 0, Skipped: 0, Time elapsed: 0.385 s - in org.springframework.boot.actuate.endpoint.jmx.annotation.JmxAnnotationEndpointDiscovererTests
20-Oct-2017 00:12:20 [INFO] Running org.springframework.boot.actuate.endpoint.web.EndpointLinksResolverTests
20-Oct-2017 00:12:20 [INFO] Tests run: 3, Failures: 0, Errors: 0, Skipped: 0, Time elapsed: 0.001 s - in org.springframework.boot.actuate.endpoint.web.EndpointLinksResolverTests
20-Oct-2017 00:12:20 [INFO] Running org.springframework.boot.actuate.endpoint.web.OperationRequestPredicateTests
20-Oct-2017 00:12:20 [INFO] Tests run: 6, Failures: 0, Errors: 0, Skipped: 0, Time elapsed: 0 s - in org.springframework.boot.actuate.endpoint.web.OperationRequestPredicateTests
20-Oct-2017 00:12:20 [INFO] Running org.springframework.boot.actuate.endpoint.web.WebAnnotationEndpointDiscovererTests
20-Oct-2017 00:12:21 [INFO] Tests run: 14, Failures: 0, Errors: 0, Skipped: 0, Time elapsed: 0.476 s - in org.springframework.boot.actuate.endpoint.web.WebAnnotationEndpointDiscovererTests
20-Oct-2017 00:12:21 [INFO] Running org.springframework.boot.actuate.endpoint.web.jersey.JerseyWebEndpointIntegrationTests
20-Oct-2017 00:12:28 [INFO] Tests run: 30, Failures: 0, Errors: 0, Skipped: 0, Time elapsed: 7.353 s - in org.springframework.boot.actuate.endpoint.web.jersey.JerseyWebEndpointIntegrationTests
20-Oct-2017 00:12:28 [INFO] Running org.springframework.boot.actuate.endpoint.web.reactive.WebFluxEndpointIntegrationTests
20-Oct-2017 00:12:32 [INFO] Tests run: 32, Failures: 0, Errors: 0, Skipped: 0, Time elapsed: 3.992 s - in org.springframework.boot.actuate.endpoint.web.reactive.WebFluxEndpointIntegrationTests
20-Oct-2017 00:12:32 [INFO] Running org.springframework.boot.actuate.endpoint.web.servlet.MvcWebEndpointIntegrationTests
20-Oct-2017 00:12:40 [INFO] Tests run: 32, Failures: 0, Errors: 0, Skipped: 0, Time elapsed: 8.393 s - in org.springframework.boot.actuate.endpoint.web.servlet.MvcWebEndpointIntegrationTests
20-Oct-2017 00:12:40 [INFO] Running org.springframework.boot.actuate.env.EnvironmentEndpointTests
20-Oct-2017 00:12:40 [INFO] Tests run: 13, Failures: 0, Errors: 0, Skipped: 0, Time elapsed: 0.019 s - in org.springframework.boot.actuate.env.EnvironmentEndpointTests
20-Oct-2017 00:12:40 [INFO] Running org.springframework.boot.actuate.env.EnvironmentEndpointWebIntegrationTests
20-Oct-2017 00:12:41 [INFO] Tests run: 24, Failures: 0, Errors: 0, Skipped: 0, Time elapsed: 1.122 s - in org.springframework.boot.actuate.env.EnvironmentEndpointWebIntegrationTests
20-Oct-2017 00:12:41 [INFO] Running org.springframework.boot.actuate.flyway.FlywayEndpointTests
20-Oct-2017 00:12:42 [INFO] Tests run: 1, Failures: 0, Errors: 0, Skipped: 0, Time elapsed: 0.305 s - in org.springframework.boot.actuate.flyway.FlywayEndpointTests
20-Oct-2017 00:12:42 [INFO] Running org.springframework.boot.actuate.health.ApplicationHealthIndicatorTests
20-Oct-2017 00:12:42 [INFO] Tests run: 1, Failures: 0, Errors: 0, Skipped: 0, Time elapsed: 0 s - in org.springframework.boot.actuate.health.ApplicationHealthIndicatorTests
20-Oct-2017 00:12:42 [INFO] Running org.springframework.boot.actuate.health.CompositeHealthIndicatorFactoryTests
20-Oct-2017 00:12:42 [INFO] Tests run: 3, Failures: 0, Errors: 0, Skipped: 0, Time elapsed: 0.001 s - in org.springframework.boot.actuate.health.CompositeHealthIndicatorFactoryTests
20-Oct-2017 00:12:42 [INFO] Running org.springframework.boot.actuate.health.CompositeHealthIndicatorTests
20-Oct-2017 00:12:42 [INFO] Tests run: 4, Failures: 0, Errors: 0, Skipped: 0, Time elapsed: 0.024 s - in org.springframework.boot.actuate.health.CompositeHealthIndicatorTests
20-Oct-2017 00:12:42 [INFO] Running org.springframework.boot.actuate.health.CompositeReactiveHealthIndicatorFactoryTests
20-Oct-2017 00:12:42 [INFO] Tests run: 4, Failures: 0, Errors: 0, Skipped: 0, Time elapsed: 0.04 s - in org.springframework.boot.actuate.health.CompositeReactiveHealthIndicatorFactoryTests
20-Oct-2017 00:12:42 [INFO] Running org.springframework.boot.actuate.health.CompositeReactiveHealthIndicatorTests
20-Oct-2017 00:12:42 [INFO] Tests run: 4, Failures: 0, Errors: 0, Skipped: 0, Time elapsed: 0.117 s - in org.springframework.boot.actuate.health.CompositeReactiveHealthIndicatorTests
20-Oct-2017 00:12:42 [INFO] Running org.springframework.boot.actuate.health.HealthEndpointTests
20-Oct-2017 00:12:42 [INFO] Tests run: 1, Failures: 0, Errors: 0, Skipped: 0, Time elapsed: 0 s - in org.springframework.boot.actuate.health.HealthEndpointTests
20-Oct-2017 00:12:42 [INFO] Running org.springframework.boot.actuate.health.HealthEndpointWebIntegrationTests
20-Oct-2017 00:12:43 [INFO] Tests run: 6, Failures: 0, Errors: 0, Skipped: 0, Time elapsed: 0.962 s - in org.springframework.boot.actuate.health.HealthEndpointWebIntegrationTests
20-Oct-2017 00:12:43 [INFO] Running org.springframework.boot.actuate.health.HealthIndicatorReactiveAdapterTests
20-Oct-2017 00:12:43 [INFO] Tests run: 3, Failures: 0, Errors: 0, Skipped: 0, Time elapsed: 0.005 s - in org.springframework.boot.actuate.health.HealthIndicatorReactiveAdapterTests
20-Oct-2017 00:12:43 [INFO] Running org.springframework.boot.actuate.health.HealthTests
20-Oct-2017 00:12:43 [INFO] Tests run: 15, Failures: 0, Errors: 0, Skipped: 0, Time elapsed: 0.004 s - in org.springframework.boot.actuate.health.HealthTests
20-Oct-2017 00:12:43 [INFO] Running org.springframework.boot.actuate.health.OrderedHealthAggregatorTests
20-Oct-2017 00:12:43 [INFO] Tests run: 4, Failures: 0, Errors: 0, Skipped: 0, Time elapsed: 0.002 s - in org.springframework.boot.actuate.health.OrderedHealthAggregatorTests
20-Oct-2017 00:12:43 [INFO] Running org.springframework.boot.actuate.health.StatusEndpointTests
20-Oct-2017 00:12:43 [INFO] Tests run: 1, Failures: 0, Errors: 0, Skipped: 0, Time elapsed: 0.001 s - in org.springframework.boot.actuate.health.StatusEndpointTests
20-Oct-2017 00:12:43 [INFO] Running org.springframework.boot.actuate.health.StatusEndpointWebIntegrationTests
20-Oct-2017 00:12:44 [INFO] Tests run: 6, Failures: 0, Errors: 0, Skipped: 0, Time elapsed: 0.925 s - in org.springframework.boot.actuate.health.StatusEndpointWebIntegrationTests
20-Oct-2017 00:12:44 [INFO] Running org.springframework.boot.actuate.info.EnvironmentInfoContributorTests
20-Oct-2017 00:12:44 [INFO] Tests run: 3, Failures: 0, Errors: 0, Skipped: 0, Time elapsed: 0.003 s - in org.springframework.boot.actuate.info.EnvironmentInfoContributorTests
20-Oct-2017 00:12:44 [INFO] Running org.springframework.boot.actuate.info.GitInfoContributorTests
20-Oct-2017 00:12:44 [INFO] Tests run: 2, Failures: 0, Errors: 0, Skipped: 0, Time elapsed: 0.014 s - in org.springframework.boot.actuate.info.GitInfoContributorTests
20-Oct-2017 00:12:44 [INFO] Running org.springframework.boot.actuate.info.InfoEndpointTests
20-Oct-2017 00:12:44 [INFO] Tests run: 2, Failures: 0, Errors: 0, Skipped: 0, Time elapsed: 0 s - in org.springframework.boot.actuate.info.InfoEndpointTests
20-Oct-2017 00:12:44 [INFO] Running org.springframework.boot.actuate.info.InfoEndpointWebIntegrationTests
20-Oct-2017 00:12:45 [INFO] Tests run: 3, Failures: 0, Errors: 0, Skipped: 0, Time elapsed: 0.989 s - in org.springframework.boot.actuate.info.InfoEndpointWebIntegrationTests
20-Oct-2017 00:12:45 [INFO] Running org.springframework.boot.actuate.info.InfoTests
20-Oct-2017 00:12:45 [INFO] Tests run: 2, Failures: 0, Errors: 0, Skipped: 0, Time elapsed: 0.001 s - in org.springframework.boot.actuate.info.InfoTests
20-Oct-2017 00:12:45 [INFO] Running org.springframework.boot.actuate.info.SimpleInfoContributorTests
20-Oct-2017 00:12:45 [INFO] Tests run: 2, Failures: 0, Errors: 0, Skipped: 0, Time elapsed: 0.002 s - in org.springframework.boot.actuate.info.SimpleInfoContributorTests
20-Oct-2017 00:12:45 [INFO] Running org.springframework.boot.actuate.jdbc.DataSourceHealthIndicatorTests
20-Oct-2017 00:12:45 [INFO] Tests run: 4, Failures: 0, Errors: 0, Skipped: 0, Time elapsed: 0.293 s - in org.springframework.boot.actuate.jdbc.DataSourceHealthIndicatorTests
20-Oct-2017 00:12:45 [INFO] Running org.springframework.boot.actuate.jms.JmsHealthIndicatorTests
20-Oct-2017 00:12:45 [INFO] Tests run: 4, Failures: 0, Errors: 0, Skipped: 0, Time elapsed: 0.041 s - in org.springframework.boot.actuate.jms.JmsHealthIndicatorTests
20-Oct-2017 00:12:45 [INFO] Running org.springframework.boot.actuate.ldap.LdapHealthIndicatorTests
20-Oct-2017 00:12:46 [INFO] Tests run: 2, Failures: 0, Errors: 0, Skipped: 0, Time elapsed: 0.307 s - in org.springframework.boot.actuate.ldap.LdapHealthIndicatorTests
20-Oct-2017 00:12:46 [INFO] Running org.springframework.boot.actuate.liquibase.LiquibaseEndpointTests
20-Oct-2017 00:12:47 [INFO] Tests run: 2, Failures: 0, Errors: 0, Skipped: 0, Time elapsed: 1.605 s - in org.springframework.boot.actuate.liquibase.LiquibaseEndpointTests
20-Oct-2017 00:12:47 [INFO] Running org.springframework.boot.actuate.logging.LogFileWebEndpointTests
20-Oct-2017 00:12:47 [INFO] Tests run: 4, Failures: 0, Errors: 0, Skipped: 0, Time elapsed: 0.008 s - in org.springframework.boot.actuate.logging.LogFileWebEndpointTests
20-Oct-2017 00:12:47 [INFO] Running org.springframework.boot.actuate.logging.LogFileWebEndpointWebIntegrationTests
20-Oct-2017 00:12:48 [INFO] Tests run: 6, Failures: 0, Errors: 0, Skipped: 0, Time elapsed: 1.081 s - in org.springframework.boot.actuate.logging.LogFileWebEndpointWebIntegrationTests
20-Oct-2017 00:12:48 [INFO] Running org.springframework.boot.actuate.logging.LoggersEndpointTests
20-Oct-2017 00:12:48 [INFO] Tests run: 4, Failures: 0, Errors: 0, Skipped: 0, Time elapsed: 0.022 s - in org.springframework.boot.actuate.logging.LoggersEndpointTests
20-Oct-2017 00:12:48 [INFO] Running org.springframework.boot.actuate.logging.LoggersEndpointWebIntegrationTests
20-Oct-2017 00:12:48 [WARNING] Tests run: 1, Failures: 0, Errors: 0, Skipped: 1, Time elapsed: 0 s - in org.springframework.boot.actuate.logging.LoggersEndpointWebIntegrationTests
20-Oct-2017 00:12:48 [INFO] Running org.springframework.boot.actuate.mail.MailHealthIndicatorTests
20-Oct-2017 00:12:48 [INFO] Tests run: 2, Failures: 0, Errors: 0, Skipped: 0, Time elapsed: 0.058 s - in org.springframework.boot.actuate.mail.MailHealthIndicatorTests
20-Oct-2017 00:12:48 [INFO] Running org.springframework.boot.actuate.management.HeapDumpWebEndpointTests
20-Oct-2017 00:12:51 [INFO] Tests run: 1, Failures: 0, Errors: 0, Skipped: 0, Time elapsed: 2.504 s - in org.springframework.boot.actuate.management.HeapDumpWebEndpointTests
20-Oct-2017 00:12:51 [INFO] Running org.springframework.boot.actuate.management.HeapDumpWebEndpointWebIntegrationTests
20-Oct-2017 00:12:52 [INFO] Tests run: 6, Failures: 0, Errors: 0, Skipped: 0, Time elapsed: 0.966 s - in org.springframework.boot.actuate.management.HeapDumpWebEndpointWebIntegrationTests
20-Oct-2017 00:12:52 [INFO] Running org.springframework.boot.actuate.management.ThreadDumpEndpointTests
20-Oct-2017 00:12:52 [INFO] Tests run: 1, Failures: 0, Errors: 0, Skipped: 0, Time elapsed: 0.038 s - in org.springframework.boot.actuate.management.ThreadDumpEndpointTests
20-Oct-2017 00:12:52 [INFO] Running org.springframework.boot.actuate.metrics.MetricsEndpointTests
20-Oct-2017 00:12:52 [INFO] Tests run: 7, Failures: 0, Errors: 0, Skipped: 0, Time elapsed: 0.024 s - in org.springframework.boot.actuate.metrics.MetricsEndpointTests
20-Oct-2017 00:12:52 [INFO] Running org.springframework.boot.actuate.metrics.MetricsEndpointWebIntegrationTests
20-Oct-2017 00:12:53 [INFO] Tests run: 9, Failures: 0, Errors: 0, Skipped: 0, Time elapsed: 1.015 s - in org.springframework.boot.actuate.metrics.MetricsEndpointWebIntegrationTests
20-Oct-2017 00:12:53 [INFO] Running org.springframework.boot.actuate.metrics.export.prometheus.PrometheusScrapeEndpointIntegrationTests
20-Oct-2017 00:12:54 [INFO] Tests run: 3, Failures: 0, Errors: 0, Skipped: 0, Time elapsed: 1.069 s - in org.springframework.boot.actuate.metrics.export.prometheus.PrometheusScrapeEndpointIntegrationTests
20-Oct-2017 00:12:54 [INFO] Running org.springframework.boot.actuate.metrics.integration.SpringIntegrationMetricsIntegrationTests
20-Oct-2017 00:12:55 [INFO] Tests run: 1, Failures: 0, Errors: 0, Skipped: 0, Time elapsed: 0.545 s - in org.springframework.boot.actuate.metrics.integration.SpringIntegrationMetricsIntegrationTests
20-Oct-2017 00:12:55 [INFO] Running org.springframework.boot.actuate.metrics.jdbc.DataSourcePoolMetricsTests
20-Oct-2017 00:12:55 [INFO] Tests run: 1, Failures: 0, Errors: 0, Skipped: 0, Time elapsed: 0.162 s - in org.springframework.boot.actuate.metrics.jdbc.DataSourcePoolMetricsTests
20-Oct-2017 00:12:55 [INFO] Running org.springframework.boot.actuate.metrics.web.client.MetricsRestTemplateCustomizerTests
20-Oct-2017 00:12:55 [INFO] Tests run: 1, Failures: 0, Errors: 0, Skipped: 0, Time elapsed: 0.07 s - in org.springframework.boot.actuate.metrics.web.client.MetricsRestTemplateCustomizerTests
20-Oct-2017 00:12:55 [INFO] Running org.springframework.boot.actuate.metrics.web.servlet.MetricsHandlerInterceptorAutoTimedTests
20-Oct-2017 00:12:55 [INFO] Tests run: 1, Failures: 0, Errors: 0, Skipped: 0, Time elapsed: 0.219 s - in org.springframework.boot.actuate.metrics.web.servlet.MetricsHandlerInterceptorAutoTimedTests
20-Oct-2017 00:12:55 [INFO] Running org.springframework.boot.actuate.metrics.web.servlet.MetricsHandlerInterceptorTests
20-Oct-2017 00:12:55 [INFO] Tests run: 10, Failures: 0, Errors: 0, Skipped: 0, Time elapsed: 0.333 s - in org.springframework.boot.actuate.metrics.web.servlet.MetricsHandlerInterceptorTests
20-Oct-2017 00:12:55 [INFO] Running org.springframework.boot.actuate.metrics.web.servlet.WebMvcMetricsIntegrationTests
20-Oct-2017 00:12:55 [INFO] Tests run: 2, Failures: 0, Errors: 0, Skipped: 0, Time elapsed: 0.117 s - in org.springframework.boot.actuate.metrics.web.servlet.WebMvcMetricsIntegrationTests
20-Oct-2017 00:12:55 [INFO] Running org.springframework.boot.actuate.mongo.MongoHealthIndicatorTests
20-Oct-2017 00:12:56 [INFO] Tests run: 2, Failures: 0, Errors: 0, Skipped: 0, Time elapsed: 0.408 s - in org.springframework.boot.actuate.mongo.MongoHealthIndicatorTests
20-Oct-2017 00:12:56 [INFO] Running org.springframework.boot.actuate.neo4j.Neo4jHealthIndicatorTests
20-Oct-2017 00:12:56 [INFO] Tests run: 2, Failures: 0, Errors: 0, Skipped: 0, Time elapsed: 0.126 s - in org.springframework.boot.actuate.neo4j.Neo4jHealthIndicatorTests
20-Oct-2017 00:12:56 [INFO] Running org.springframework.boot.actuate.redis.RedisHealthIndicatorTests
20-Oct-2017 00:12:56 [INFO] Tests run: 3, Failures: 0, Errors: 0, Skipped: 0, Time elapsed: 0.431 s - in org.springframework.boot.actuate.redis.RedisHealthIndicatorTests
20-Oct-2017 00:12:56 [INFO] Running org.springframework.boot.actuate.redis.RedisReactiveHealthIndicatorTests
20-Oct-2017 00:12:57 [INFO] Tests run: 2, Failures: 0, Errors: 0, Skipped: 0, Time elapsed: 0.054 s - in org.springframework.boot.actuate.redis.RedisReactiveHealthIndicatorTests
20-Oct-2017 00:12:57 [INFO] Running org.springframework.boot.actuate.security.AuthenticationAuditListenerTests
20-Oct-2017 00:12:57 [INFO] Tests run: 5, Failures: 0, Errors: 0, Skipped: 0, Time elapsed: 0.018 s - in org.springframework.boot.actuate.security.AuthenticationAuditListenerTests
20-Oct-2017 00:12:57 [INFO] Running org.springframework.boot.actuate.security.AuthorizationAuditListenerTests
20-Oct-2017 00:12:57 [INFO] Tests run: 3, Failures: 0, Errors: 0, Skipped: 0, Time elapsed: 0.001 s - in org.springframework.boot.actuate.security.AuthorizationAuditListenerTests
20-Oct-2017 00:12:57 [INFO] Running org.springframework.boot.actuate.session.SessionsEndpointTests
20-Oct-2017 00:12:57 [INFO] Tests run: 3, Failures: 0, Errors: 0, Skipped: 0, Time elapsed: 0.015 s - in org.springframework.boot.actuate.session.SessionsEndpointTests
20-Oct-2017 00:12:57 [INFO] Running org.springframework.boot.actuate.session.SessionsEndpointWebIntegrationTests
20-Oct-2017 00:12:58 [INFO] Tests run: 9, Failures: 0, Errors: 0, Skipped: 0, Time elapsed: 1.018 s - in org.springframework.boot.actuate.session.SessionsEndpointWebIntegrationTests
20-Oct-2017 00:12:58 [INFO] Running org.springframework.boot.actuate.solr.SolrHealthIndicatorTests
20-Oct-2017 00:12:58 [INFO] Tests run: 3, Failures: 0, Errors: 0, Skipped: 0, Time elapsed: 0.095 s - in org.springframework.boot.actuate.solr.SolrHealthIndicatorTests
20-Oct-2017 00:12:58 [INFO] Running org.springframework.boot.actuate.system.DiskSpaceHealthIndicatorTests
20-Oct-2017 00:12:58 [INFO] Tests run: 2, Failures: 0, Errors: 0, Skipped: 0, Time elapsed: 0.06 s - in org.springframework.boot.actuate.system.DiskSpaceHealthIndicatorTests
20-Oct-2017 00:12:58 [INFO] Running org.springframework.boot.actuate.trace.InMemoryTraceRepositoryTests
20-Oct-2017 00:12:58 [INFO] Tests run: 2, Failures: 0, Errors: 0, Skipped: 0, Time elapsed: 0 s - in org.springframework.boot.actuate.trace.InMemoryTraceRepositoryTests
20-Oct-2017 00:12:58 [INFO] Running org.springframework.boot.actuate.trace.TraceEndpointTests
20-Oct-2017 00:12:58 [INFO] Tests run: 1, Failures: 0, Errors: 0, Skipped: 0, Time elapsed: 0 s - in org.springframework.boot.actuate.trace.TraceEndpointTests
20-Oct-2017 00:12:58 [INFO] Running org.springframework.boot.actuate.trace.WebRequestTraceFilterTests
20-Oct-2017 00:12:58 [INFO] Tests run: 12, Failures: 0, Errors: 0, Skipped: 0, Time elapsed: 0.154 s - in org.springframework.boot.actuate.trace.WebRequestTraceFilterTests
20-Oct-2017 00:12:58 [INFO]
20-Oct-2017 00:12:58 [INFO] Results:
20-Oct-2017 00:12:58 [INFO]
20-Oct-2017 00:12:58 [WARNING] Tests run: 475, Failures: 0, Errors: 0, Skipped: 1
20-Oct-2017 00:12:58 [INFO]
20-Oct-2017 00:12:58 [INFO]
20-Oct-2017 00:12:58 [INFO] --- maven-jar-plugin:3.0.2:jar (default-jar) @ spring-boot-actuator ---
20-Oct-2017 00:12:58 [INFO] Building jar: /opt/bamboo-home/xml-data/build-dir/BOOT-JDK9-JOB1/spring-boot-project/spring-boot-actuator/target/spring-boot-actuator-2.0.0.BUILD-SNAPSHOT.jar
20-Oct-2017 00:12:58 [INFO]
20-Oct-2017 00:12:58 [INFO] --- maven-source-plugin:3.0.1:jar-no-fork (attach-sources) @ spring-boot-actuator ---
20-Oct-2017 00:12:58 [INFO] Building jar: /opt/bamboo-home/xml-data/build-dir/BOOT-JDK9-JOB1/spring-boot-project/spring-boot-actuator/target/spring-boot-actuator-2.0.0.BUILD-SNAPSHOT-sources.jar
20-Oct-2017 00:12:58 [INFO]
20-Oct-2017 00:12:58 [INFO] --- maven-install-plugin:2.5.2:install (default-install) @ spring-boot-actuator ---
20-Oct-2017 00:12:58 [INFO] Installing /opt/bamboo-home/xml-data/build-dir/BOOT-JDK9-JOB1/spring-boot-project/spring-boot-actuator/target/spring-boot-actuator-2.0.0.BUILD-SNAPSHOT.jar to /home/bamboo/.m2/repository/org/springframework/boot/spring-boot-actuator/2.0.0.BUILD-SNAPSHOT/spring-boot-actuator-2.0.0.BUILD-SNAPSHOT.jar
20-Oct-2017 00:12:58 [INFO] Installing /opt/bamboo-home/xml-data/build-dir/BOOT-JDK9-JOB1/spring-boot-project/spring-boot-actuator/.flattened-pom.xml to /home/bamboo/.m2/repository/org/springframework/boot/spring-boot-actuator/2.0.0.BUILD-SNAPSHOT/spring-boot-actuator-2.0.0.BUILD-SNAPSHOT.pom
20-Oct-2017 00:12:58 [INFO] Installing /opt/bamboo-home/xml-data/build-dir/BOOT-JDK9-JOB1/spring-boot-project/spring-boot-actuator/target/spring-boot-actuator-2.0.0.BUILD-SNAPSHOT-sources.jar to /home/bamboo/.m2/repository/org/springframework/boot/spring-boot-actuator/2.0.0.BUILD-SNAPSHOT/spring-boot-actuator-2.0.0.BUILD-SNAPSHOT-sources.jar
20-Oct-2017 00:12:58 [INFO]
20-Oct-2017 00:12:58 [INFO] ------------------------------------------------------------------------
20-Oct-2017 00:12:58 [INFO] Building Spring Boot Test Auto-Configure 2.0.0.BUILD-SNAPSHOT
20-Oct-2017 00:12:58 [INFO] ------------------------------------------------------------------------
20-Oct-2017 00:12:58 [INFO] Downloading: https://repo.maven.apache.org/maven2/io/rest-assured/rest-assured/3.0.5/rest-assured-3.0.5.pom
20-Oct-2017 00:12:59 [INFO] Downloaded: https://repo.maven.apache.org/maven2/io/rest-assured/rest-assured/3.0.5/rest-assured-3.0.5.pom (0 B at 0 B/s)
20-Oct-2017 00:12:59 [INFO] Downloading: https://repo.maven.apache.org/maven2/io/rest-assured/rest-assured-parent/3.0.5/rest-assured-parent-3.0.5.pom
20-Oct-2017 00:12:59 [INFO] Downloaded: https://repo.maven.apache.org/maven2/io/rest-assured/rest-assured-parent/3.0.5/rest-assured-parent-3.0.5.pom (0 B at 0 B/s)
20-Oct-2017 00:12:59 [INFO] Downloading: https://repo.maven.apache.org/maven2/io/rest-assured/json-path/3.0.5/json-path-3.0.5.pom
20-Oct-2017 00:12:59 [INFO] Downloaded: https://repo.maven.apache.org/maven2/io/rest-assured/json-path/3.0.5/json-path-3.0.5.pom (0 B at 0 B/s)
20-Oct-2017 00:12:59 [INFO] Downloading: https://repo.maven.apache.org/maven2/org/codehaus/groovy/groovy-json/2.5.0-beta-1/groovy-json-2.5.0-beta-1.pom
20-Oct-2017 00:12:59 [INFO] Downloaded: https://repo.maven.apache.org/maven2/org/codehaus/groovy/groovy-json/2.5.0-beta-1/groovy-json-2.5.0-beta-1.pom (0 B at 0 B/s)
20-Oct-2017 00:12:59 [INFO] Downloading: https://repo.maven.apache.org/maven2/io/rest-assured/rest-assured-common/3.0.5/rest-assured-common-3.0.5.pom
20-Oct-2017 00:12:59 [INFO] Downloaded: https://repo.maven.apache.org/maven2/io/rest-assured/rest-assured-common/3.0.5/rest-assured-common-3.0.5.pom (0 B at 0 B/s)
20-Oct-2017 00:12:59 [INFO] Downloading: https://repo.maven.apache.org/maven2/io/rest-assured/xml-path/3.0.5/xml-path-3.0.5.pom
20-Oct-2017 00:12:59 [INFO] Downloaded: https://repo.maven.apache.org/maven2/io/rest-assured/xml-path/3.0.5/xml-path-3.0.5.pom (0 B at 0 B/s)
20-Oct-2017 00:12:59 [INFO] Downloading: https://repo.maven.apache.org/maven2/io/rest-assured/rest-assured/3.0.5/rest-assured-3.0.5.jar
20-Oct-2017 00:12:59 [INFO] Downloading: https://repo.maven.apache.org/maven2/io/rest-assured/json-path/3.0.5/json-path-3.0.5.jar
20-Oct-2017 00:12:59 [INFO] Downloading: https://repo.maven.apache.org/maven2/org/codehaus/groovy/groovy-json/2.5.0-beta-1/groovy-json-2.5.0-beta-1.jar
20-Oct-2017 00:12:59 [INFO] Downloading: https://repo.maven.apache.org/maven2/io/rest-assured/rest-assured-common/3.0.5/rest-assured-common-3.0.5.jar
20-Oct-2017 00:12:59 [INFO] Downloading: https://repo.maven.apache.org/maven2/io/rest-assured/xml-path/3.0.5/xml-path-3.0.5.jar
20-Oct-2017 00:12:59 [INFO] Downloaded: https://repo.maven.apache.org/maven2/io/rest-assured/rest-assured/3.0.5/rest-assured-3.0.5.jar (0 B at 0 B/s)
20-Oct-2017 00:12:59 [INFO] Downloading: https://repo.maven.apache.org/maven2/org/springframework/restdocs/spring-restdocs-mockmvc/1.2.2.RELEASE/spring-restdocs-mockmvc-1.2.2.RELEASE.jar
20-Oct-2017 00:12:59 [INFO] Downloaded: https://repo.maven.apache.org/maven2/io/rest-assured/json-path/3.0.5/json-path-3.0.5.jar (0 B at 0 B/s)
20-Oct-2017 00:12:59 [INFO] Downloading: https://repo.maven.apache.org/maven2/org/springframework/restdocs/spring-restdocs-core/1.2.2.RELEASE/spring-restdocs-core-1.2.2.RELEASE.jar
20-Oct-2017 00:12:59 [INFO] Downloaded: https://repo.maven.apache.org/maven2/org/codehaus/groovy/groovy-json/2.5.0-beta-1/groovy-json-2.5.0-beta-1.jar (0 B at 0 B/s)
20-Oct-2017 00:12:59 [INFO] Downloading: https://repo.maven.apache.org/maven2/org/springframework/restdocs/spring-restdocs-restassured/1.2.2.RELEASE/spring-restdocs-restassured-1.2.2.RELEASE.jar
20-Oct-2017 00:12:59 [INFO] Downloaded: https://repo.maven.apache.org/maven2/org/springframework/restdocs/spring-restdocs-mockmvc/1.2.2.RELEASE/spring-restdocs-mockmvc-1.2.2.RELEASE.jar (0 B at 0 B/s)
20-Oct-2017 00:12:59 [INFO] Downloaded: https://repo.maven.apache.org/maven2/org/springframework/restdocs/spring-restdocs-core/1.2.2.RELEASE/spring-restdocs-core-1.2.2.RELEASE.jar (0 B at 0 B/s)
20-Oct-2017 00:12:59 [INFO] Downloaded: https://repo.maven.apache.org/maven2/org/springframework/restdocs/spring-restdocs-restassured/1.2.2.RELEASE/spring-restdocs-restassured-1.2.2.RELEASE.jar (0 B at 0 B/s)
20-Oct-2017 00:12:59 [INFO] Downloaded: https://repo.maven.apache.org/maven2/io/rest-assured/rest-assured-common/3.0.5/rest-assured-common-3.0.5.jar (0 B at 0 B/s)
20-Oct-2017 00:12:59 [INFO] Downloaded: https://repo.maven.apache.org/maven2/io/rest-assured/xml-path/3.0.5/xml-path-3.0.5.jar (0 B at 0 B/s)
20-Oct-2017 00:12:59 [INFO]
20-Oct-2017 00:12:59 [INFO] --- maven-clean-plugin:3.0.0:clean (default-clean) @ spring-boot-test-autoconfigure ---
20-Oct-2017 00:12:59 [INFO]
20-Oct-2017 00:12:59 [INFO] --- maven-checkstyle-plugin:2.17:check (checkstyle-validation) @ spring-boot-test-autoconfigure ---
20-Oct-2017 00:13:00 [INFO] Starting audit...
20-Oct-2017 00:13:00 Audit done.
20-Oct-2017 00:13:00 [INFO]
20-Oct-2017 00:13:00 [INFO] --- maven-enforcer-plugin:3.0.0-M1:enforce (enforce-rules) @ spring-boot-test-autoconfigure ---
20-Oct-2017 00:13:00 [INFO]
20-Oct-2017 00:13:00 [INFO] --- maven-resources-plugin:3.0.1:resources (default-resources) @ spring-boot-test-autoconfigure ---
20-Oct-2017 00:13:00 [INFO] Using 'UTF-8' encoding to copy filtered resources.
20-Oct-2017 00:13:00 [INFO] Copying 2 resources
20-Oct-2017 00:13:00 [INFO]
20-Oct-2017 00:13:00 [INFO] --- flatten-maven-plugin:1.0.0:flatten (flatten) @ spring-boot-test-autoconfigure ---
20-Oct-2017 00:13:00 [INFO] Generating flattened POM of project org.springframework.boot:spring-boot-test-autoconfigure:jar:2.0.0.BUILD-SNAPSHOT...
20-Oct-2017 00:13:00 [INFO]
20-Oct-2017 00:13:00 [INFO] --- maven-compiler-plugin:3.7.0:compile (default-compile) @ spring-boot-test-autoconfigure ---
20-Oct-2017 00:13:00 [INFO] Changes detected - recompiling the module!
20-Oct-2017 00:13:00 [INFO] Compiling 92 source files to /opt/bamboo-home/xml-data/build-dir/BOOT-JDK9-JOB1/spring-boot-project/spring-boot-test-autoconfigure/target/classes
20-Oct-2017 00:13:00 [INFO]
20-Oct-2017 00:13:00 [INFO] --- maven-resources-plugin:3.0.1:testResources (default-testResources) @ spring-boot-test-autoconfigure ---
20-Oct-2017 00:13:00 [INFO] Using 'UTF-8' encoding to copy filtered resources.
20-Oct-2017 00:13:00 [INFO] Copying 4 resources
20-Oct-2017 00:13:00 [INFO]
20-Oct-2017 00:13:00 [INFO] --- maven-compiler-plugin:3.7.0:testCompile (default-testCompile) @ spring-boot-test-autoconfigure ---
20-Oct-2017 00:13:00 [INFO] Changes detected - recompiling the module!
20-Oct-2017 00:13:00 [INFO] Compiling 136 source files to /opt/bamboo-home/xml-data/build-dir/BOOT-JDK9-JOB1/spring-boot-project/spring-boot-test-autoconfigure/target/test-classes
20-Oct-2017 00:13:01 [INFO]
20-Oct-2017 00:13:01 [INFO] --- maven-surefire-plugin:2.20.1:test (default-test) @ spring-boot-test-autoconfigure ---
20-Oct-2017 00:13:01 [INFO]
20-Oct-2017 00:13:01 [INFO] -------------------------------------------------------
20-Oct-2017 00:13:01 [INFO]  T E S T S
20-Oct-2017 00:13:01 [INFO] -------------------------------------------------------
20-Oct-2017 00:13:02 [INFO] Running org.springframework.boot.test.autoconfigure.OverrideAutoConfigurationContextCustomizerFactoryTests
20-Oct-2017 00:13:02 [INFO] Tests run: 4, Failures: 0, Errors: 0, Skipped: 0, Time elapsed: 0.128 s - in org.springframework.boot.test.autoconfigure.OverrideAutoConfigurationContextCustomizerFactoryTests
20-Oct-2017 00:13:02 [INFO] Running org.springframework.boot.test.autoconfigure.SpringBootDependencyInjectionTestExecutionListenerPostConstructIntegrationTests
20-Oct-2017 00:13:04 [INFO] Tests run: 1, Failures: 0, Errors: 0, Skipped: 0, Time elapsed: 1.459 s - in org.springframework.boot.test.autoconfigure.SpringBootDependencyInjectionTestExecutionListenerPostConstructIntegrationTests
20-Oct-2017 00:13:04 [INFO] Running org.springframework.boot.test.autoconfigure.SpringBootDependencyInjectionTestExecutionListenerTests
20-Oct-2017 00:13:05 [INFO] Tests run: 3, Failures: 0, Errors: 0, Skipped: 0, Time elapsed: 0.975 s - in org.springframework.boot.test.autoconfigure.SpringBootDependencyInjectionTestExecutionListenerTests
20-Oct-2017 00:13:05 [INFO] Running org.springframework.boot.test.autoconfigure.cache.ImportsContextCustomizerFactoryWithAutoConfigurationTests
20-Oct-2017 00:13:07 [INFO] Tests run: 3, Failures: 0, Errors: 0, Skipped: 0, Time elapsed: 2.795 s - in org.springframework.boot.test.autoconfigure.cache.ImportsContextCustomizerFactoryWithAutoConfigurationTests
20-Oct-2017 00:13:07 [INFO] Running org.springframework.boot.test.autoconfigure.core.AutoConfigureCacheIntegrationTests
20-Oct-2017 00:13:08 [INFO] Tests run: 1, Failures: 0, Errors: 0, Skipped: 0, Time elapsed: 0.287 s - in org.springframework.boot.test.autoconfigure.core.AutoConfigureCacheIntegrationTests
20-Oct-2017 00:13:08 [INFO] Running org.springframework.boot.test.autoconfigure.data.ldap.DataLdapTestIntegrationTests
20-Oct-2017 00:13:08 [INFO] Tests run: 2, Failures: 0, Errors: 0, Skipped: 0, Time elapsed: 0.666 s - in org.springframework.boot.test.autoconfigure.data.ldap.DataLdapTestIntegrationTests
20-Oct-2017 00:13:08 [INFO] Running org.springframework.boot.test.autoconfigure.data.ldap.DataLdapTestWithIncludeFilterIntegrationTests
20-Oct-2017 00:13:09 [INFO] Tests run: 1, Failures: 0, Errors: 0, Skipped: 0, Time elapsed: 0.231 s - in org.springframework.boot.test.autoconfigure.data.ldap.DataLdapTestWithIncludeFilterIntegrationTests
20-Oct-2017 00:13:09 [INFO] Running org.springframework.boot.test.autoconfigure.data.mongo.DataMongoTestIntegrationTests
20-Oct-2017 00:13:10 [INFO] Tests run: 2, Failures: 0, Errors: 0, Skipped: 0, Time elapsed: 1.221 s - in org.springframework.boot.test.autoconfigure.data.mongo.DataMongoTestIntegrationTests
20-Oct-2017 00:13:10 [INFO] Running org.springframework.boot.test.autoconfigure.data.mongo.DataMongoTestReactiveIntegrationTests
20-Oct-2017 00:13:10 [INFO] Tests run: 1, Failures: 0, Errors: 0, Skipped: 0, Time elapsed: 0.106 s - in org.springframework.boot.test.autoconfigure.data.mongo.DataMongoTestReactiveIntegrationTests
20-Oct-2017 00:13:10 [INFO] Running org.springframework.boot.test.autoconfigure.data.mongo.DataMongoTestWithIncludeFilterIntegrationTests
20-Oct-2017 00:13:10 [INFO] Tests run: 1, Failures: 0, Errors: 0, Skipped: 0, Time elapsed: 0.448 s - in org.springframework.boot.test.autoconfigure.data.mongo.DataMongoTestWithIncludeFilterIntegrationTests
20-Oct-2017 00:13:10 [INFO] Running org.springframework.boot.test.autoconfigure.data.neo4j.DataNeo4jTestIntegrationTests
20-Oct-2017 00:13:11 [WARNING] Tests run: 2, Failures: 0, Errors: 0, Skipped: 2, Time elapsed: 0.975 s - in org.springframework.boot.test.autoconfigure.data.neo4j.DataNeo4jTestIntegrationTests
20-Oct-2017 00:13:11 [INFO] Running org.springframework.boot.test.autoconfigure.data.neo4j.DataNeo4jTestWithIncludeFilterIntegrationTests
20-Oct-2017 00:13:12 [WARNING] Tests run: 1, Failures: 0, Errors: 0, Skipped: 1, Time elapsed: 0.492 s - in org.springframework.boot.test.autoconfigure.data.neo4j.DataNeo4jTestWithIncludeFilterIntegrationTests
20-Oct-2017 00:13:12 [INFO] Running org.springframework.boot.test.autoconfigure.data.redis.DataRedisTestIntegrationTests
20-Oct-2017 00:13:13 [INFO] Tests run: 2, Failures: 0, Errors: 0, Skipped: 0, Time elapsed: 0.906 s - in org.springframework.boot.test.autoconfigure.data.redis.DataRedisTestIntegrationTests
20-Oct-2017 00:13:13 [INFO] Running org.springframework.boot.test.autoconfigure.data.redis.DataRedisTestWithIncludeFilterIntegrationTests
20-Oct-2017 00:13:13 [INFO] Tests run: 1, Failures: 0, Errors: 0, Skipped: 0, Time elapsed: 0.334 s - in org.springframework.boot.test.autoconfigure.data.redis.DataRedisTestWithIncludeFilterIntegrationTests
20-Oct-2017 00:13:13 [INFO] Running org.springframework.boot.test.autoconfigure.filter.FilterAnnotationsTests
20-Oct-2017 00:13:13 [INFO] Tests run: 5, Failures: 0, Errors: 0, Skipped: 0, Time elapsed: 0.19 s - in org.springframework.boot.test.autoconfigure.filter.FilterAnnotationsTests
20-Oct-2017 00:13:13 [INFO] Running org.springframework.boot.test.autoconfigure.filter.TypeExcludeFiltersContextCustomizerFactoryTests
20-Oct-2017 00:13:13 [INFO] Tests run: 4, Failures: 0, Errors: 0, Skipped: 0, Time elapsed: 0.125 s - in org.springframework.boot.test.autoconfigure.filter.TypeExcludeFiltersContextCustomizerFactoryTests
20-Oct-2017 00:13:13 [INFO] Running org.springframework.boot.test.autoconfigure.jdbc.AutoConfigureTestDatabaseWithMultipleDatasourcesIntegrationTests
20-Oct-2017 00:13:14 [INFO] Tests run: 1, Failures: 0, Errors: 0, Skipped: 0, Time elapsed: 0.555 s - in org.springframework.boot.test.autoconfigure.jdbc.AutoConfigureTestDatabaseWithMultipleDatasourcesIntegrationTests
20-Oct-2017 00:13:14 [INFO] Running org.springframework.boot.test.autoconfigure.jdbc.AutoConfigureTestDatabaseWithNoDatabaseIntegrationTests
20-Oct-2017 00:13:14 [INFO] Tests run: 1, Failures: 0, Errors: 0, Skipped: 0, Time elapsed: 0.14 s - in org.springframework.boot.test.autoconfigure.jdbc.AutoConfigureTestDatabaseWithNoDatabaseIntegrationTests
20-Oct-2017 00:13:14 [INFO] Running org.springframework.boot.test.autoconfigure.jdbc.JdbcTestIntegrationTests
20-Oct-2017 00:13:15 [INFO] Tests run: 5, Failures: 0, Errors: 0, Skipped: 0, Time elapsed: 0.366 s - in org.springframework.boot.test.autoconfigure.jdbc.JdbcTestIntegrationTests
20-Oct-2017 00:13:15 [INFO] Running org.springframework.boot.test.autoconfigure.jdbc.JdbcTestWithAutoConfigureTestDatabaseReplaceAutoConfiguredIntegrationTests
20-Oct-2017 00:13:15 [INFO] Tests run: 1, Failures: 0, Errors: 0, Skipped: 0, Time elapsed: 0.276 s - in org.springframework.boot.test.autoconfigure.jdbc.JdbcTestWithAutoConfigureTestDatabaseReplaceAutoConfiguredIntegrationTests
20-Oct-2017 00:13:15 [INFO] Running org.springframework.boot.test.autoconfigure.jdbc.JdbcTestWithAutoConfigureTestDatabaseReplaceAutoConfiguredWithoutOverrideIntegrationTests
20-Oct-2017 00:13:15 [INFO] Tests run: 1, Failures: 0, Errors: 0, Skipped: 0, Time elapsed: 0.275 s - in org.springframework.boot.test.autoconfigure.jdbc.JdbcTestWithAutoConfigureTestDatabaseReplaceAutoConfiguredWithoutOverrideIntegrationTests
20-Oct-2017 00:13:15 [INFO] Running org.springframework.boot.test.autoconfigure.jdbc.JdbcTestWithAutoConfigureTestDatabaseReplaceExplicitIntegrationTests
20-Oct-2017 00:13:15 [INFO] Tests run: 1, Failures: 0, Errors: 0, Skipped: 0, Time elapsed: 0.296 s - in org.springframework.boot.test.autoconfigure.jdbc.JdbcTestWithAutoConfigureTestDatabaseReplaceExplicitIntegrationTests
20-Oct-2017 00:13:15 [INFO] Running org.springframework.boot.test.autoconfigure.jdbc.JdbcTestWithAutoConfigureTestDatabaseReplaceNoneIntegrationTests
20-Oct-2017 00:13:16 [INFO] Tests run: 1, Failures: 0, Errors: 0, Skipped: 0, Time elapsed: 0.267 s - in org.springframework.boot.test.autoconfigure.jdbc.JdbcTestWithAutoConfigureTestDatabaseReplaceNoneIntegrationTests
20-Oct-2017 00:13:16 [INFO] Running org.springframework.boot.test.autoconfigure.jdbc.JdbcTestWithAutoConfigureTestDatabaseReplacePropertyAnyIntegrationTests
20-Oct-2017 00:13:16 [INFO] Tests run: 1, Failures: 0, Errors: 0, Skipped: 0, Time elapsed: 0.264 s - in org.springframework.boot.test.autoconfigure.jdbc.JdbcTestWithAutoConfigureTestDatabaseReplacePropertyAnyIntegrationTests
20-Oct-2017 00:13:16 [INFO] Running org.springframework.boot.test.autoconfigure.jdbc.JdbcTestWithAutoConfigureTestDatabaseReplacePropertyAutoConfiguredIntegrationTests
20-Oct-2017 00:13:16 [INFO] Tests run: 1, Failures: 0, Errors: 0, Skipped: 0, Time elapsed: 0.309 s - in org.springframework.boot.test.autoconfigure.jdbc.JdbcTestWithAutoConfigureTestDatabaseReplacePropertyAutoConfiguredIntegrationTests
20-Oct-2017 00:13:16 [INFO] Running org.springframework.boot.test.autoconfigure.jdbc.JdbcTestWithAutoConfigureTestDatabaseReplacePropertyNoneIntegrationTests
20-Oct-2017 00:13:17 [INFO] Tests run: 1, Failures: 0, Errors: 0, Skipped: 0, Time elapsed: 0.27 s - in org.springframework.boot.test.autoconfigure.jdbc.JdbcTestWithAutoConfigureTestDatabaseReplacePropertyNoneIntegrationTests
20-Oct-2017 00:13:17 [INFO] Running org.springframework.boot.test.autoconfigure.jdbc.JdbcTestWithIncludeFilterIntegrationTests
20-Oct-2017 00:13:17 [INFO] Tests run: 1, Failures: 0, Errors: 0, Skipped: 0, Time elapsed: 0.279 s - in org.springframework.boot.test.autoconfigure.jdbc.JdbcTestWithIncludeFilterIntegrationTests
20-Oct-2017 00:13:17 [INFO] Running org.springframework.boot.test.autoconfigure.jdbc.TestDatabaseAutoConfigurationTests
20-Oct-2017 00:13:17 [INFO] Tests run: 2, Failures: 0, Errors: 0, Skipped: 0, Time elapsed: 0.131 s - in org.springframework.boot.test.autoconfigure.jdbc.TestDatabaseAutoConfigurationTests
20-Oct-2017 00:13:17 [INFO] Running org.springframework.boot.test.autoconfigure.jooq.JooqTestIntegrationTests
20-Oct-2017 00:13:18 [INFO] Tests run: 5, Failures: 0, Errors: 0, Skipped: 0, Time elapsed: 1.08 s - in org.springframework.boot.test.autoconfigure.jooq.JooqTestIntegrationTests
20-Oct-2017 00:13:18 [INFO] Running org.springframework.boot.test.autoconfigure.jooq.JooqTestWithAutoConfigureTestDatabaseIntegrationTests
20-Oct-2017 00:13:18 [INFO] Tests run: 1, Failures: 0, Errors: 0, Skipped: 0, Time elapsed: 0.258 s - in org.springframework.boot.test.autoconfigure.jooq.JooqTestWithAutoConfigureTestDatabaseIntegrationTests
20-Oct-2017 00:13:18 [INFO] Running org.springframework.boot.test.autoconfigure.json.JsonTestIntegrationTests
20-Oct-2017 00:13:19 [INFO] Tests run: 6, Failures: 0, Errors: 0, Skipped: 0, Time elapsed: 0.483 s - in org.springframework.boot.test.autoconfigure.json.JsonTestIntegrationTests
20-Oct-2017 00:13:19 [INFO] Running org.springframework.boot.test.autoconfigure.json.JsonTestWithAutoConfigureJsonTestersTests
20-Oct-2017 00:13:19 [INFO] Tests run: 4, Failures: 0, Errors: 0, Skipped: 0, Time elapsed: 0.153 s - in org.springframework.boot.test.autoconfigure.json.JsonTestWithAutoConfigureJsonTestersTests
20-Oct-2017 00:13:19 [INFO] Running org.springframework.boot.test.autoconfigure.json.SpringBootTestWithAutoConfigureJsonTestersTests
20-Oct-2017 00:13:22 [INFO] Tests run: 1, Failures: 0, Errors: 0, Skipped: 0, Time elapsed: 3.053 s - in org.springframework.boot.test.autoconfigure.json.SpringBootTestWithAutoConfigureJsonTestersTests
20-Oct-2017 00:13:22 [INFO] Running org.springframework.boot.test.autoconfigure.orm.jpa.DataJpaTestIntegrationTests
20-Oct-2017 00:13:23 [INFO] Tests run: 7, Failures: 0, Errors: 0, Skipped: 0, Time elapsed: 0.781 s - in org.springframework.boot.test.autoconfigure.orm.jpa.DataJpaTestIntegrationTests
20-Oct-2017 00:13:23 [INFO] Running org.springframework.boot.test.autoconfigure.orm.jpa.TestDatabaseAutoConfigurationNoEmbeddedTests
20-Oct-2017 00:13:24 [INFO] Tests run: 2, Failures: 0, Errors: 0, Skipped: 0, Time elapsed: 1.317 s - in org.springframework.boot.test.autoconfigure.orm.jpa.TestDatabaseAutoConfigurationNoEmbeddedTests
20-Oct-2017 00:13:24 [INFO] Running org.springframework.boot.test.autoconfigure.orm.jpa.TestEntityManagerTests
20-Oct-2017 00:13:24 [INFO] Tests run: 18, Failures: 0, Errors: 0, Skipped: 0, Time elapsed: 0.185 s - in org.springframework.boot.test.autoconfigure.orm.jpa.TestEntityManagerTests
20-Oct-2017 00:13:24 [INFO] Running org.springframework.boot.test.autoconfigure.properties.AnnotationsPropertySourceTests
20-Oct-2017 00:13:24 [INFO] Tests run: 18, Failures: 0, Errors: 0, Skipped: 0, Time elapsed: 0.035 s - in org.springframework.boot.test.autoconfigure.properties.AnnotationsPropertySourceTests
20-Oct-2017 00:13:24 [INFO] Running org.springframework.boot.test.autoconfigure.properties.PropertyMappingContextCustomizerFactoryTests
20-Oct-2017 00:13:25 [INFO] Tests run: 6, Failures: 0, Errors: 0, Skipped: 0, Time elapsed: 0.29 s - in org.springframework.boot.test.autoconfigure.properties.PropertyMappingContextCustomizerFactoryTests
20-Oct-2017 00:13:25 [INFO] Running org.springframework.boot.test.autoconfigure.properties.PropertyMappingTests
20-Oct-2017 00:13:25 [INFO] Tests run: 1, Failures: 0, Errors: 0, Skipped: 0, Time elapsed: 0.033 s - in org.springframework.boot.test.autoconfigure.properties.PropertyMappingTests
20-Oct-2017 00:13:25 [INFO] Running org.springframework.boot.test.autoconfigure.restdocs.MockMvcRestDocsAutoConfigurationAdvancedConfigurationIntegrationTests
20-Oct-2017 00:13:27 [INFO] Tests run: 1, Failures: 0, Errors: 0, Skipped: 0, Time elapsed: 1.769 s - in org.springframework.boot.test.autoconfigure.restdocs.MockMvcRestDocsAutoConfigurationAdvancedConfigurationIntegrationTests
20-Oct-2017 00:13:27 [INFO] Running org.springframework.boot.test.autoconfigure.restdocs.MockMvcRestDocsAutoConfigurationIntegrationTests
20-Oct-2017 00:13:27 [INFO] Tests run: 1, Failures: 0, Errors: 0, Skipped: 0, Time elapsed: 0.804 s - in org.springframework.boot.test.autoconfigure.restdocs.MockMvcRestDocsAutoConfigurationIntegrationTests
20-Oct-2017 00:13:27 [INFO] Running org.springframework.boot.test.autoconfigure.restdocs.RestAssuredRestDocsAutoConfigurationAdvancedConfigurationIntegrationTests
20-Oct-2017 00:13:30 [INFO] Tests run: 1, Failures: 0, Errors: 0, Skipped: 0, Time elapsed: 3.061 s - in org.springframework.boot.test.autoconfigure.restdocs.RestAssuredRestDocsAutoConfigurationAdvancedConfigurationIntegrationTests
20-Oct-2017 00:13:30 [INFO] Running org.springframework.boot.test.autoconfigure.restdocs.RestAssuredRestDocsAutoConfigurationIntegrationTests
20-Oct-2017 00:13:32 [INFO] Tests run: 1, Failures: 0, Errors: 0, Skipped: 0, Time elapsed: 1.792 s - in org.springframework.boot.test.autoconfigure.restdocs.RestAssuredRestDocsAutoConfigurationIntegrationTests
20-Oct-2017 00:13:32 [INFO] Running org.springframework.boot.test.autoconfigure.security.MockMvcSecurityAutoConfigurationIntegrationTests
20-Oct-2017 00:13:33 [INFO] Tests run: 3, Failures: 0, Errors: 0, Skipped: 0, Time elapsed: 0.712 s - in org.springframework.boot.test.autoconfigure.security.MockMvcSecurityAutoConfigurationIntegrationTests
20-Oct-2017 00:13:33 [INFO] Running org.springframework.boot.test.autoconfigure.web.client.AutoConfigureMockRestServiceServerEnabledFalseIntegrationTests
20-Oct-2017 00:13:33 [INFO] Tests run: 1, Failures: 0, Errors: 0, Skipped: 0, Time elapsed: 0.239 s - in org.springframework.boot.test.autoconfigure.web.client.AutoConfigureMockRestServiceServerEnabledFalseIntegrationTests
20-Oct-2017 00:13:33 [INFO] Running org.springframework.boot.test.autoconfigure.web.client.AutoConfigureWebClientWithRestTemplateIntegrationTests
20-Oct-2017 00:13:35 [INFO] Tests run: 1, Failures: 0, Errors: 0, Skipped: 0, Time elapsed: 1.869 s - in org.springframework.boot.test.autoconfigure.web.client.AutoConfigureWebClientWithRestTemplateIntegrationTests
20-Oct-2017 00:13:35 [INFO] Running org.springframework.boot.test.autoconfigure.web.client.RestClientRestIntegrationTests
20-Oct-2017 00:13:35 [INFO] Tests run: 3, Failures: 0, Errors: 0, Skipped: 0, Time elapsed: 0.235 s - in org.springframework.boot.test.autoconfigure.web.client.RestClientRestIntegrationTests
20-Oct-2017 00:13:35 [INFO] Running org.springframework.boot.test.autoconfigure.web.client.RestClientTestNoComponentIntegrationTests
20-Oct-2017 00:13:36 [INFO] Tests run: 2, Failures: 0, Errors: 0, Skipped: 0, Time elapsed: 0.359 s - in org.springframework.boot.test.autoconfigure.web.client.RestClientTestNoComponentIntegrationTests
20-Oct-2017 00:13:36 [INFO] Running org.springframework.boot.test.autoconfigure.web.client.RestClientTestTwoComponentsIntegrationTests
20-Oct-2017 00:13:36 [INFO] Tests run: 3, Failures: 0, Errors: 0, Skipped: 0, Time elapsed: 0.37 s - in org.springframework.boot.test.autoconfigure.web.client.RestClientTestTwoComponentsIntegrationTests
20-Oct-2017 00:13:36 [INFO] Running org.springframework.boot.test.autoconfigure.web.client.RestClientTestWithComponentIntegrationTests
20-Oct-2017 00:13:36 [INFO] Tests run: 1, Failures: 0, Errors: 0, Skipped: 0, Time elapsed: 0.008 s - in org.springframework.boot.test.autoconfigure.web.client.RestClientTestWithComponentIntegrationTests
20-Oct-2017 00:13:36 [INFO] Running org.springframework.boot.test.autoconfigure.web.client.RestClientTestWithoutJacksonIntegrationTests
20-Oct-2017 00:13:38 [INFO] Tests run: 1, Failures: 0, Errors: 0, Skipped: 0, Time elapsed: 2.469 s - in org.springframework.boot.test.autoconfigure.web.client.RestClientTestWithoutJacksonIntegrationTests
20-Oct-2017 00:13:38 [INFO] Running org.springframework.boot.test.autoconfigure.web.reactive.WebFluxTypeExcludeFilterTests
20-Oct-2017 00:13:38 [INFO] Tests run: 5, Failures: 0, Errors: 0, Skipped: 0, Time elapsed: 0.013 s - in org.springframework.boot.test.autoconfigure.web.reactive.WebFluxTypeExcludeFilterTests
20-Oct-2017 00:13:38 [INFO] Running org.springframework.boot.test.autoconfigure.web.reactive.WebTestClientAutoConfigurationTests
20-Oct-2017 00:13:39 [INFO] Tests run: 2, Failures: 0, Errors: 0, Skipped: 0, Time elapsed: 0.152 s - in org.springframework.boot.test.autoconfigure.web.reactive.WebTestClientAutoConfigurationTests
20-Oct-2017 00:13:39 [INFO] Running org.springframework.boot.test.autoconfigure.web.reactive.webclient.WebFluxTestAllControllersIntegrationTests
20-Oct-2017 00:13:39 [INFO] Tests run: 2, Failures: 0, Errors: 0, Skipped: 0, Time elapsed: 0.439 s - in org.springframework.boot.test.autoconfigure.web.reactive.webclient.WebFluxTestAllControllersIntegrationTests
20-Oct-2017 00:13:39 [INFO] Running org.springframework.boot.test.autoconfigure.web.reactive.webclient.WebFluxTestAutoConfigurationIntegrationTests
20-Oct-2017 00:13:39 [INFO] Tests run: 2, Failures: 0, Errors: 0, Skipped: 0, Time elapsed: 0.006 s - in org.springframework.boot.test.autoconfigure.web.reactive.webclient.WebFluxTestAutoConfigurationIntegrationTests
20-Oct-2017 00:13:39 [INFO] Running org.springframework.boot.test.autoconfigure.web.reactive.webclient.WebFluxTestMessageSourceIntegrationTests
20-Oct-2017 00:13:39 [INFO] Tests run: 1, Failures: 0, Errors: 0, Skipped: 0, Time elapsed: 0.289 s - in org.springframework.boot.test.autoconfigure.web.reactive.webclient.WebFluxTestMessageSourceIntegrationTests
20-Oct-2017 00:13:39 [INFO] Running org.springframework.boot.test.autoconfigure.web.reactive.webclient.WebFluxTestOneControllerIntegrationTests
20-Oct-2017 00:13:41 [INFO] Tests run: 2, Failures: 0, Errors: 0, Skipped: 0, Time elapsed: 1.345 s - in org.springframework.boot.test.autoconfigure.web.reactive.webclient.WebFluxTestOneControllerIntegrationTests
20-Oct-2017 00:13:41 [INFO] Running org.springframework.boot.test.autoconfigure.web.reactive.webclient.WebTestClientSpringBootTestIntegrationTests
20-Oct-2017 00:13:43 [ERROR] Tests run: 3, Failures: 2, Errors: 0, Skipped: 0, Time elapsed: 2.563 s <<< FAILURE! - in org.springframework.boot.test.autoconfigure.web.reactive.webclient.WebTestClientSpringBootTestIntegrationTests
20-Oct-2017 00:13:43 [ERROR] shouldFindController1(org.springframework.boot.test.autoconfigure.web.reactive.webclient.WebTestClientSpringBootTestIntegrationTests)  Time elapsed: 0.049 s  <<< FAILURE!
20-Oct-2017 00:13:43 java.lang.AssertionError:
20-Oct-2017 00:13:43 Status expected:<200> but was:<401>
20-Oct-2017 00:13:43
20-Oct-2017 00:13:43 > GET /one
20-Oct-2017 00:13:43 > WebTestClient-Request-Id: [1]
20-Oct-2017 00:13:43
20-Oct-2017 00:13:43 No content
20-Oct-2017 00:13:43
20-Oct-2017 00:13:43 < 401 Unauthorized
20-Oct-2017 00:13:43 < WWW-Authenticate: [Basic realm="Realm"]
20-Oct-2017 00:13:43 < Cache-Control: [no-cache, no-store, max-age=0, must-revalidate]
20-Oct-2017 00:13:43 < Pragma: [no-cache]
20-Oct-2017 00:13:43 < Expires: [0]
20-Oct-2017 00:13:43 < X-Content-Type-Options: [nosniff]
20-Oct-2017 00:13:43 < X-Frame-Options: [DENY]
20-Oct-2017 00:13:43 < X-XSS-Protection: [1 ; mode=block]
20-Oct-2017 00:13:43
20-Oct-2017 00:13:43 Content not available yet
20-Oct-2017 00:13:43
20-Oct-2017 00:13:43         at org.springframework.test.web.reactive.server.ExchangeResult.assertWithDiagnostics(ExchangeResult.java:183)
20-Oct-2017 00:13:43         at org.springframework.test.web.reactive.server.StatusAssertions.assertStatusAndReturn(StatusAssertions.java:194)
20-Oct-2017 00:13:43         at org.springframework.test.web.reactive.server.StatusAssertions.isOk(StatusAssertions.java:63)
20-Oct-2017 00:13:43         at org.springframework.boot.test.autoconfigure.web.reactive.webclient.WebTestClientSpringBootTestIntegrationTests.shouldFindController1(WebTestClientSpringBootTestIntegrationTests.java:50)
20-Oct-2017 00:13:43         at java.base/jdk.internal.reflect.NativeMethodAccessorImpl.invoke0(Native Method)
20-Oct-2017 00:13:43         at java.base/jdk.internal.reflect.NativeMethodAccessorImpl.invoke(NativeMethodAccessorImpl.java:62)
20-Oct-2017 00:13:43         at java.base/jdk.internal.reflect.DelegatingMethodAccessorImpl.invoke(DelegatingMethodAccessorImpl.java:43)
20-Oct-2017 00:13:43         at java.base/java.lang.reflect.Method.invoke(Method.java:564)
20-Oct-2017 00:13:43         at org.junit.runners.model.FrameworkMethod$1.runReflectiveCall(FrameworkMethod.java:50)
20-Oct-2017 00:13:43         at org.junit.internal.runners.model.ReflectiveCallable.run(ReflectiveCallable.java:12)
20-Oct-2017 00:13:43         at org.junit.runners.model.FrameworkMethod.invokeExplosively(FrameworkMethod.java:47)
20-Oct-2017 00:13:43         at org.junit.internal.runners.statements.InvokeMethod.evaluate(InvokeMethod.java:17)
20-Oct-2017 00:13:43         at org.springframework.test.context.junit4.statements.RunBeforeTestExecutionCallbacks.evaluate(RunBeforeTestExecutionCallbacks.java:73)
20-Oct-2017 00:13:43         at org.springframework.test.context.junit4.statements.RunAfterTestExecutionCallbacks.evaluate(RunAfterTestExecutionCallbacks.java:83)
20-Oct-2017 00:13:43         at org.springframework.test.context.junit4.statements.RunBeforeTestMethodCallbacks.evaluate(RunBeforeTestMethodCallbacks.java:75)
20-Oct-2017 00:13:43         at org.springframework.test.context.junit4.statements.RunAfterTestMethodCallbacks.evaluate(RunAfterTestMethodCallbacks.java:86)
20-Oct-2017 00:13:43         at org.springframework.test.context.junit4.statements.SpringRepeat.evaluate(SpringRepeat.java:84)
20-Oct-2017 00:13:43         at org.junit.runners.ParentRunner.runLeaf(ParentRunner.java:325)
20-Oct-2017 00:13:43         at org.springframework.test.context.junit4.SpringJUnit4ClassRunner.runChild(SpringJUnit4ClassRunner.java:251)
20-Oct-2017 00:13:43         at org.springframework.test.context.junit4.SpringJUnit4ClassRunner.runChild(SpringJUnit4ClassRunner.java:97)
20-Oct-2017 00:13:43         at org.junit.runners.ParentRunner$3.run(ParentRunner.java:290)
20-Oct-2017 00:13:43         at org.junit.runners.ParentRunner$1.schedule(ParentRunner.java:71)
20-Oct-2017 00:13:43         at org.junit.runners.ParentRunner.runChildren(ParentRunner.java:288)
20-Oct-2017 00:13:43         at org.junit.runners.ParentRunner.access$000(ParentRunner.java:58)
20-Oct-2017 00:13:43         at org.junit.runners.ParentRunner$2.evaluate(ParentRunner.java:268)
20-Oct-2017 00:13:43         at org.springframework.test.context.junit4.statements.RunBeforeTestClassCallbacks.evaluate(RunBeforeTestClassCallbacks.java:61)
20-Oct-2017 00:13:43         at org.springframework.test.context.junit4.statements.RunAfterTestClassCallbacks.evaluate(RunAfterTestClassCallbacks.java:70)
20-Oct-2017 00:13:43         at org.junit.runners.ParentRunner.run(ParentRunner.java:363)
20-Oct-2017 00:13:43         at org.springframework.test.context.junit4.SpringJUnit4ClassRunner.run(SpringJUnit4ClassRunner.java:190)
20-Oct-2017 00:13:43         at org.apache.maven.surefire.junit4.JUnit4Provider.execute(JUnit4Provider.java:369)
20-Oct-2017 00:13:43         at org.apache.maven.surefire.junit4.JUnit4Provider.executeWithRerun(JUnit4Provider.java:275)
20-Oct-2017 00:13:43         at org.apache.maven.surefire.junit4.JUnit4Provider.executeTestSet(JUnit4Provider.java:239)
20-Oct-2017 00:13:43         at org.apache.maven.surefire.junit4.JUnit4Provider.invoke(JUnit4Provider.java:160)
20-Oct-2017 00:13:43         at org.apache.maven.surefire.booter.ForkedBooter.invokeProviderInSameClassLoader(ForkedBooter.java:373)
20-Oct-2017 00:13:43         at org.apache.maven.surefire.booter.ForkedBooter.runSuitesInProcess(ForkedBooter.java:334)
20-Oct-2017 00:13:43         at org.apache.maven.surefire.booter.ForkedBooter.execute(ForkedBooter.java:119)
20-Oct-2017 00:13:43         at org.apache.maven.surefire.booter.ForkedBooter.main(ForkedBooter.java:407)
20-Oct-2017 00:13:43 Caused by: java.lang.AssertionError: Status expected:<200> but was:<401>
20-Oct-2017 00:13:43         at org.springframework.test.util.AssertionErrors.fail(AssertionErrors.java:55)
20-Oct-2017 00:13:43         at org.springframework.test.util.AssertionErrors.assertEquals(AssertionErrors.java:82)
20-Oct-2017 00:13:43         at org.springframework.test.web.reactive.server.StatusAssertions.lambda$assertStatusAndReturn$2(StatusAssertions.java:194)
20-Oct-2017 00:13:43         at org.springframework.test.web.reactive.server.ExchangeResult.assertWithDiagnostics(ExchangeResult.java:180)
20-Oct-2017 00:13:43         ... 36 more
20-Oct-2017 00:13:43
20-Oct-2017 00:13:43 [ERROR] shouldFindController2(org.springframework.boot.test.autoconfigure.web.reactive.webclient.WebTestClientSpringBootTestIntegrationTests)  Time elapsed: 0.003 s  <<< FAILURE!
20-Oct-2017 00:13:43 java.lang.AssertionError:
20-Oct-2017 00:13:43 Status expected:<200> but was:<401>
20-Oct-2017 00:13:43
20-Oct-2017 00:13:43 > GET /two
20-Oct-2017 00:13:43 > WebTestClient-Request-Id: [2]
20-Oct-2017 00:13:43
20-Oct-2017 00:13:43 No content
20-Oct-2017 00:13:43
20-Oct-2017 00:13:43 < 401 Unauthorized
20-Oct-2017 00:13:43 < WWW-Authenticate: [Basic realm="Realm"]
20-Oct-2017 00:13:43 < Cache-Control: [no-cache, no-store, max-age=0, must-revalidate]
20-Oct-2017 00:13:43 < Pragma: [no-cache]
20-Oct-2017 00:13:43 < Expires: [0]
20-Oct-2017 00:13:43 < X-Content-Type-Options: [nosniff]
20-Oct-2017 00:13:43 < X-Frame-Options: [DENY]
20-Oct-2017 00:13:43 < X-XSS-Protection: [1 ; mode=block]
20-Oct-2017 00:13:43
20-Oct-2017 00:13:43 Content not available yet
20-Oct-2017 00:13:43
20-Oct-2017 00:13:43         at org.springframework.test.web.reactive.server.ExchangeResult.assertWithDiagnostics(ExchangeResult.java:183)
20-Oct-2017 00:13:43         at org.springframework.test.web.reactive.server.StatusAssertions.assertStatusAndReturn(StatusAssertions.java:194)
20-Oct-2017 00:13:43         at org.springframework.test.web.reactive.server.StatusAssertions.isOk(StatusAssertions.java:63)
20-Oct-2017 00:13:43         at org.springframework.boot.test.autoconfigure.web.reactive.webclient.WebTestClientSpringBootTestIntegrationTests.shouldFindController2(WebTestClientSpringBootTestIntegrationTests.java:56)
20-Oct-2017 00:13:43         at java.base/jdk.internal.reflect.NativeMethodAccessorImpl.invoke0(Native Method)
20-Oct-2017 00:13:43         at java.base/jdk.internal.reflect.NativeMethodAccessorImpl.invoke(NativeMethodAccessorImpl.java:62)
20-Oct-2017 00:13:43         at java.base/jdk.internal.reflect.DelegatingMethodAccessorImpl.invoke(DelegatingMethodAccessorImpl.java:43)
20-Oct-2017 00:13:43         at java.base/java.lang.reflect.Method.invoke(Method.java:564)
20-Oct-2017 00:13:43         at org.junit.runners.model.FrameworkMethod$1.runReflectiveCall(FrameworkMethod.java:50)
20-Oct-2017 00:13:43         at org.junit.internal.runners.model.ReflectiveCallable.run(ReflectiveCallable.java:12)
20-Oct-2017 00:13:43         at org.junit.runners.model.FrameworkMethod.invokeExplosively(FrameworkMethod.java:47)
20-Oct-2017 00:13:43         at org.junit.internal.runners.statements.InvokeMethod.evaluate(InvokeMethod.java:17)
20-Oct-2017 00:13:43         at org.springframework.test.context.junit4.statements.RunBeforeTestExecutionCallbacks.evaluate(RunBeforeTestExecutionCallbacks.java:73)
20-Oct-2017 00:13:43         at org.springframework.test.context.junit4.statements.RunAfterTestExecutionCallbacks.evaluate(RunAfterTestExecutionCallbacks.java:83)
20-Oct-2017 00:13:43         at org.springframework.test.context.junit4.statements.RunBeforeTestMethodCallbacks.evaluate(RunBeforeTestMethodCallbacks.java:75)
20-Oct-2017 00:13:43         at org.springframework.test.context.junit4.statements.RunAfterTestMethodCallbacks.evaluate(RunAfterTestMethodCallbacks.java:86)
20-Oct-2017 00:13:43         at org.springframework.test.context.junit4.statements.SpringRepeat.evaluate(SpringRepeat.java:84)
20-Oct-2017 00:13:43         at org.junit.runners.ParentRunner.runLeaf(ParentRunner.java:325)
20-Oct-2017 00:13:43         at org.springframework.test.context.junit4.SpringJUnit4ClassRunner.runChild(SpringJUnit4ClassRunner.java:251)
20-Oct-2017 00:13:43         at org.springframework.test.context.junit4.SpringJUnit4ClassRunner.runChild(SpringJUnit4ClassRunner.java:97)
20-Oct-2017 00:13:43         at org.junit.runners.ParentRunner$3.run(ParentRunner.java:290)
20-Oct-2017 00:13:43         at org.junit.runners.ParentRunner$1.schedule(ParentRunner.java:71)
20-Oct-2017 00:13:43         at org.junit.runners.ParentRunner.runChildren(ParentRunner.java:288)
20-Oct-2017 00:13:43         at org.junit.runners.ParentRunner.access$000(ParentRunner.java:58)
20-Oct-2017 00:13:43         at org.junit.runners.ParentRunner$2.evaluate(ParentRunner.java:268)
20-Oct-2017 00:13:43         at org.springframework.test.context.junit4.statements.RunBeforeTestClassCallbacks.evaluate(RunBeforeTestClassCallbacks.java:61)
20-Oct-2017 00:13:43         at org.springframework.test.context.junit4.statements.RunAfterTestClassCallbacks.evaluate(RunAfterTestClassCallbacks.java:70)
20-Oct-2017 00:13:43         at org.junit.runners.ParentRunner.run(ParentRunner.java:363)
20-Oct-2017 00:13:43         at org.springframework.test.context.junit4.SpringJUnit4ClassRunner.run(SpringJUnit4ClassRunner.java:190)
20-Oct-2017 00:13:43         at org.apache.maven.surefire.junit4.JUnit4Provider.execute(JUnit4Provider.java:369)
20-Oct-2017 00:13:43         at org.apache.maven.surefire.junit4.JUnit4Provider.executeWithRerun(JUnit4Provider.java:275)
20-Oct-2017 00:13:43         at org.apache.maven.surefire.junit4.JUnit4Provider.executeTestSet(JUnit4Provider.java:239)
20-Oct-2017 00:13:43         at org.apache.maven.surefire.junit4.JUnit4Provider.invoke(JUnit4Provider.java:160)
20-Oct-2017 00:13:43         at org.apache.maven.surefire.booter.ForkedBooter.invokeProviderInSameClassLoader(ForkedBooter.java:373)
20-Oct-2017 00:13:43         at org.apache.maven.surefire.booter.ForkedBooter.runSuitesInProcess(ForkedBooter.java:334)
20-Oct-2017 00:13:43         at org.apache.maven.surefire.booter.ForkedBooter.execute(ForkedBooter.java:119)
20-Oct-2017 00:13:43         at org.apache.maven.surefire.booter.ForkedBooter.main(ForkedBooter.java:407)
20-Oct-2017 00:13:43 Caused by: java.lang.AssertionError: Status expected:<200> but was:<401>
20-Oct-2017 00:13:43         at org.springframework.test.util.AssertionErrors.fail(AssertionErrors.java:55)
20-Oct-2017 00:13:43         at org.springframework.test.util.AssertionErrors.assertEquals(AssertionErrors.java:82)
20-Oct-2017 00:13:43         at org.springframework.test.web.reactive.server.StatusAssertions.lambda$assertStatusAndReturn$2(StatusAssertions.java:194)
20-Oct-2017 00:13:43         at org.springframework.test.web.reactive.server.ExchangeResult.assertWithDiagnostics(ExchangeResult.java:180)
20-Oct-2017 00:13:43         ... 36 more
20-Oct-2017 00:13:43
20-Oct-2017 00:13:43 [INFO] Running org.springframework.boot.test.autoconfigure.web.servlet.WebMvcTestAutoConfigurationIntegrationTests
20-Oct-2017 00:13:44 [INFO] Tests run: 4, Failures: 0, Errors: 0, Skipped: 0, Time elapsed: 0.614 s - in org.springframework.boot.test.autoconfigure.web.servlet.WebMvcTestAutoConfigurationIntegrationTests
20-Oct-2017 00:13:44 [INFO] Running org.springframework.boot.test.autoconfigure.web.servlet.WebMvcTypeExcludeFilterTests
20-Oct-2017 00:13:44 [INFO] Tests run: 5, Failures: 0, Errors: 0, Skipped: 0, Time elapsed: 0.068 s - in org.springframework.boot.test.autoconfigure.web.servlet.WebMvcTypeExcludeFilterTests
20-Oct-2017 00:13:44 [INFO] Running org.springframework.boot.test.autoconfigure.web.servlet.mockmvc.MockMvcSpringBootTestIntegrationTests
20-Oct-2017 00:13:46 [INFO] Tests run: 4, Failures: 0, Errors: 0, Skipped: 0, Time elapsed: 1.995 s - in org.springframework.boot.test.autoconfigure.web.servlet.mockmvc.MockMvcSpringBootTestIntegrationTests
20-Oct-2017 00:13:46 [INFO] Running org.springframework.boot.test.autoconfigure.web.servlet.mockmvc.WebMvcTestAllControllersIntegrationTests
20-Oct-2017 00:13:47 [INFO] Tests run: 6, Failures: 0, Errors: 0, Skipped: 0, Time elapsed: 0.627 s - in org.springframework.boot.test.autoconfigure.web.servlet.mockmvc.WebMvcTestAllControllersIntegrationTests
20-Oct-2017 00:13:47 [INFO] Running org.springframework.boot.test.autoconfigure.web.servlet.mockmvc.WebMvcTestCustomDispatcherServletIntegrationTests
20-Oct-2017 00:13:47 [INFO] Tests run: 1, Failures: 0, Errors: 0, Skipped: 0, Time elapsed: 0.514 s - in org.springframework.boot.test.autoconfigure.web.servlet.mockmvc.WebMvcTestCustomDispatcherServletIntegrationTests
20-Oct-2017 00:13:47 [INFO] Running org.springframework.boot.test.autoconfigure.web.servlet.mockmvc.WebMvcTestHateoasIntegrationTests
20-Oct-2017 00:13:47 [INFO] Tests run: 2, Failures: 0, Errors: 0, Skipped: 0, Time elapsed: 0.064 s - in org.springframework.boot.test.autoconfigure.web.servlet.mockmvc.WebMvcTestHateoasIntegrationTests
20-Oct-2017 00:13:47 [INFO] Running org.springframework.boot.test.autoconfigure.web.servlet.mockmvc.WebMvcTestMessageSourceIntegrationTests
20-Oct-2017 00:13:48 [INFO] Tests run: 1, Failures: 0, Errors: 0, Skipped: 0, Time elapsed: 0.494 s - in org.springframework.boot.test.autoconfigure.web.servlet.mockmvc.WebMvcTestMessageSourceIntegrationTests
20-Oct-2017 00:13:48 [INFO] Running org.springframework.boot.test.autoconfigure.web.servlet.mockmvc.WebMvcTestOneControllerIntegrationTests
20-Oct-2017 00:13:48 [INFO] Tests run: 2, Failures: 0, Errors: 0, Skipped: 0, Time elapsed: 0.484 s - in org.springframework.boot.test.autoconfigure.web.servlet.mockmvc.WebMvcTestOneControllerIntegrationTests
20-Oct-2017 00:13:48 [INFO] Running org.springframework.boot.test.autoconfigure.web.servlet.mockmvc.WebMvcTestPrintAlwaysIntegrationTests
20-Oct-2017 00:13:49 [INFO] Tests run: 1, Failures: 0, Errors: 0, Skipped: 0, Time elapsed: 0.479 s - in org.springframework.boot.test.autoconfigure.web.servlet.mockmvc.WebMvcTestPrintAlwaysIntegrationTests
20-Oct-2017 00:13:49 [INFO] Running org.springframework.boot.test.autoconfigure.web.servlet.mockmvc.WebMvcTestPrintDefaultIntegrationTests
20-Oct-2017 00:13:49 [INFO] Tests run: 2, Failures: 0, Errors: 0, Skipped: 0, Time elapsed: 0.023 s - in org.springframework.boot.test.autoconfigure.web.servlet.mockmvc.WebMvcTestPrintDefaultIntegrationTests
20-Oct-2017 00:13:49 [INFO] Running org.springframework.boot.test.autoconfigure.web.servlet.mockmvc.WebMvcTestPrintDefaultOverrideIntegrationTests
20-Oct-2017 00:13:49 [INFO] Tests run: 1, Failures: 0, Errors: 0, Skipped: 0, Time elapsed: 0.468 s - in org.springframework.boot.test.autoconfigure.web.servlet.mockmvc.WebMvcTestPrintDefaultOverrideIntegrationTests
20-Oct-2017 00:13:49 [INFO] Running org.springframework.boot.test.autoconfigure.web.servlet.mockmvc.WebMvcTestPrintOverrideIntegrationTests
20-Oct-2017 00:13:50 [INFO] Tests run: 1, Failures: 0, Errors: 0, Skipped: 0, Time elapsed: 0.489 s - in org.springframework.boot.test.autoconfigure.web.servlet.mockmvc.WebMvcTestPrintOverrideIntegrationTests
20-Oct-2017 00:13:50 [INFO] Running org.springframework.boot.test.autoconfigure.web.servlet.mockmvc.WebMvcTestServletFilterIntegrationTests
20-Oct-2017 00:13:50 [INFO] Tests run: 1, Failures: 0, Errors: 0, Skipped: 0, Time elapsed: 0.612 s - in org.springframework.boot.test.autoconfigure.web.servlet.mockmvc.WebMvcTestServletFilterIntegrationTests
20-Oct-2017 00:13:50 [INFO] Running org.springframework.boot.test.autoconfigure.web.servlet.mockmvc.WebMvcTestWebClientIntegrationTests
20-Oct-2017 00:13:51 [INFO] Tests run: 1, Failures: 0, Errors: 0, Skipped: 0, Time elapsed: 0.231 s - in org.springframework.boot.test.autoconfigure.web.servlet.mockmvc.WebMvcTestWebClientIntegrationTests
20-Oct-2017 00:13:51 [INFO] Running org.springframework.boot.test.autoconfigure.web.servlet.mockmvc.WebMvcTestWebDriverCustomScopeIntegrationTests
20-Oct-2017 00:13:51 [INFO] Tests run: 2, Failures: 0, Errors: 0, Skipped: 0, Time elapsed: 0.486 s - in org.springframework.boot.test.autoconfigure.web.servlet.mockmvc.WebMvcTestWebDriverCustomScopeIntegrationTests
20-Oct-2017 00:13:51 [INFO] Running org.springframework.boot.test.autoconfigure.web.servlet.mockmvc.WebMvcTestWebDriverIntegrationTests
20-Oct-2017 00:13:51 [INFO] Tests run: 2, Failures: 0, Errors: 0, Skipped: 0, Time elapsed: 0.198 s - in org.springframework.boot.test.autoconfigure.web.servlet.mockmvc.WebMvcTestWebDriverIntegrationTests
20-Oct-2017 00:13:51 [INFO] Running org.springframework.boot.test.autoconfigure.web.servlet.mockmvc.WebMvcTestWithAutoConfigureMockMvcIntegrationTests
20-Oct-2017 00:13:52 [INFO] Tests run: 3, Failures: 0, Errors: 0, Skipped: 0, Time elapsed: 0.67 s - in org.springframework.boot.test.autoconfigure.web.servlet.mockmvc.WebMvcTestWithAutoConfigureMockMvcIntegrationTests
20-Oct-2017 00:13:53 [INFO]
20-Oct-2017 00:13:53 [INFO] Results:
20-Oct-2017 00:13:53 [INFO]
20-Oct-2017 00:13:53 [ERROR] Failures:
20-Oct-2017 00:13:53 [ERROR]   WebTestClientSpringBootTestIntegrationTests.shouldFindController1:50 Status expected:<200> but was:<401>
20-Oct-2017 00:13:53
20-Oct-2017 00:13:53 > GET /one
20-Oct-2017 00:13:53 > WebTestClient-Request-Id: [1]
20-Oct-2017 00:13:53
20-Oct-2017 00:13:53 No content
20-Oct-2017 00:13:53
20-Oct-2017 00:13:53 < 401 Unauthorized
20-Oct-2017 00:13:53 < WWW-Authenticate: [Basic realm="Realm"]
20-Oct-2017 00:13:53 < Cache-Control: [no-cache, no-store, max-age=0, must-revalidate]
20-Oct-2017 00:13:53 < Pragma: [no-cache]
20-Oct-2017 00:13:53 < Expires: [0]
20-Oct-2017 00:13:53 < X-Content-Type-Options: [nosniff]
20-Oct-2017 00:13:53 < X-Frame-Options: [DENY]
20-Oct-2017 00:13:53 < X-XSS-Protection: [1 ; mode=block]
20-Oct-2017 00:13:53
20-Oct-2017 00:13:53 Content not available yet
20-Oct-2017 00:13:53
20-Oct-2017 00:13:53 [ERROR]   WebTestClientSpringBootTestIntegrationTests.shouldFindController2:56 Status expected:<200> but was:<401>
20-Oct-2017 00:13:53
20-Oct-2017 00:13:53 > GET /two
20-Oct-2017 00:13:53 > WebTestClient-Request-Id: [2]
20-Oct-2017 00:13:53
20-Oct-2017 00:13:53 No content
20-Oct-2017 00:13:53
20-Oct-2017 00:13:53 < 401 Unauthorized
20-Oct-2017 00:13:53 < WWW-Authenticate: [Basic realm="Realm"]
20-Oct-2017 00:13:53 < Cache-Control: [no-cache, no-store, max-age=0, must-revalidate]
20-Oct-2017 00:13:53 < Pragma: [no-cache]
20-Oct-2017 00:13:53 < Expires: [0]
20-Oct-2017 00:13:53 < X-Content-Type-Options: [nosniff]
20-Oct-2017 00:13:53 < X-Frame-Options: [DENY]
20-Oct-2017 00:13:53 < X-XSS-Protection: [1 ; mode=block]
20-Oct-2017 00:13:53
20-Oct-2017 00:13:53 Content not available yet
20-Oct-2017 00:13:53
20-Oct-2017 00:13:53 [INFO]
20-Oct-2017 00:13:53 [ERROR] Tests run: 195, Failures: 2, Errors: 0, Skipped: 3
20-Oct-2017 00:13:53 [INFO]
20-Oct-2017 00:13:53 [INFO] ------------------------------------------------------------------------
20-Oct-2017 00:13:53 [INFO] Reactor Summary:
20-Oct-2017 00:13:53 [INFO]
20-Oct-2017 00:13:53 [INFO] Spring Boot Build .................................. SUCCESS [  0.288 s]
20-Oct-2017 00:13:53 [INFO] Spring Boot Dependencies ........................... SUCCESS [  5.117 s]
20-Oct-2017 00:13:53 [INFO] Spring Boot Parent ................................. SUCCESS [  7.214 s]
20-Oct-2017 00:13:53 [INFO] Spring Boot Tools .................................. SUCCESS [  0.525 s]
20-Oct-2017 00:13:53 [INFO] Spring Boot Testing Support ........................ SUCCESS [ 12.789 s]
20-Oct-2017 00:13:53 [INFO] Spring Boot Configuration Processor ................ SUCCESS [ 12.595 s]
20-Oct-2017 00:13:53 [INFO] Spring Boot ........................................ SUCCESS [02:11 min]
20-Oct-2017 00:13:53 [INFO] Spring Boot Test ................................... SUCCESS [ 34.813 s]
20-Oct-2017 00:13:53 [INFO] Spring Boot Auto-Configure Annotation Processor .... SUCCESS [  3.601 s]
20-Oct-2017 00:13:53 [INFO] Spring Boot AutoConfigure .......................... SUCCESS [06:38 min]
20-Oct-2017 00:13:53 [INFO] Spring Boot Actuator ............................... SUCCESS [01:00 min]
20-Oct-2017 00:13:53 [INFO] Spring Boot Test Auto-Configure .................... FAILURE [ 54.039 s]
20-Oct-2017 00:13:53 [INFO] Spring Boot Actuator AutoConfigure ................. SKIPPED
20-Oct-2017 00:13:53 [INFO] Spring Boot Developer Tools ........................ SKIPPED
20-Oct-2017 00:13:53 [INFO] Spring Boot Loader ................................. SKIPPED
20-Oct-2017 00:13:53 [INFO] Spring Boot Loader Tools ........................... SKIPPED
20-Oct-2017 00:13:53 [INFO] Spring Boot Antlib ................................. SKIPPED
20-Oct-2017 00:13:53 [INFO] Spring Boot Configuration Metadata ................. SKIPPED
20-Oct-2017 00:13:53 [INFO] Spring Boot Gradle Plugin .......................... SKIPPED
20-Oct-2017 00:13:53 [INFO] Spring Boot Maven Plugin ........................... SKIPPED
20-Oct-2017 00:13:53 [INFO] Spring Boot Starters ............................... SKIPPED
20-Oct-2017 00:13:53 [INFO] Spring Boot Logging Starter ........................ SKIPPED
20-Oct-2017 00:13:53 [INFO] Spring Boot Starter ................................ SKIPPED
20-Oct-2017 00:13:53 [INFO] Spring Boot ActiveMQ Starter ....................... SKIPPED
20-Oct-2017 00:13:53 [INFO] Spring Boot AMQP Starter ........................... SKIPPED
20-Oct-2017 00:13:53 [INFO] Spring Boot AOP Starter ............................ SKIPPED
20-Oct-2017 00:13:53 [INFO] Spring Boot Artemis Starter ........................ SKIPPED
20-Oct-2017 00:13:53 [INFO] Spring Boot JDBC Starter ........................... SKIPPED
20-Oct-2017 00:13:53 [INFO] Spring Boot Batch Starter .......................... SKIPPED
20-Oct-2017 00:13:53 [INFO] Spring Boot Cache Starter .......................... SKIPPED
20-Oct-2017 00:13:53 [INFO] Spring Boot Spring Cloud Connectors Starter ........ SKIPPED
20-Oct-2017 00:13:53 [INFO] Spring Boot Data Cassandra Starter ................. SKIPPED
20-Oct-2017 00:13:53 [INFO] Spring Boot Data Cassandra Reactive Starter ........ SKIPPED
20-Oct-2017 00:13:53 [INFO] Spring Boot Data Couchbase Starter ................. SKIPPED
20-Oct-2017 00:13:53 [INFO] Spring Boot Data Elasticsearch Starter ............. SKIPPED
20-Oct-2017 00:13:53 [INFO] Spring Boot Data JPA Starter ....................... SKIPPED
20-Oct-2017 00:13:53 [INFO] Spring Boot Data LDAP Starter ...................... SKIPPED
20-Oct-2017 00:13:53 [INFO] Spring Boot Data MongoDB Starter ................... SKIPPED
20-Oct-2017 00:13:53 [INFO] Spring Boot Data MongoDB Reactive Starter .......... SKIPPED
20-Oct-2017 00:13:53 [INFO] Spring Boot Data Neo4j Starter ..................... SKIPPED
20-Oct-2017 00:13:53 [INFO] Spring Boot Data Redis Starter ..................... SKIPPED
20-Oct-2017 00:13:53 [INFO] Spring Boot Json Starter ........................... SKIPPED
20-Oct-2017 00:13:53 [INFO] Spring Boot Tomcat Starter ......................... SKIPPED
20-Oct-2017 00:13:53 [INFO] Spring Boot Web Starter ............................ SKIPPED
20-Oct-2017 00:13:53 [INFO] Spring Boot Data REST Starter ...................... SKIPPED
20-Oct-2017 00:13:53 [INFO] Spring Boot Data Solr Starter ...................... SKIPPED
20-Oct-2017 00:13:53 [INFO] Spring Boot FreeMarker Starter ..................... SKIPPED
20-Oct-2017 00:13:53 [INFO] Spring Boot Groovy Templates Starter ............... SKIPPED
20-Oct-2017 00:13:53 [INFO] Spring Boot HATEOAS Starter ........................ SKIPPED
20-Oct-2017 00:13:53 [INFO] Spring Boot Integration Starter .................... SKIPPED
20-Oct-2017 00:13:53 [INFO] Spring Boot Validation Starter ..................... SKIPPED
20-Oct-2017 00:13:53 [INFO] Spring Boot Jersey Starter ......................... SKIPPED
20-Oct-2017 00:13:53 [INFO] Spring Boot Jetty Starter .......................... SKIPPED
20-Oct-2017 00:13:53 [INFO] Spring Boot JOOQ Starter ........................... SKIPPED
20-Oct-2017 00:13:53 [INFO] Spring Boot Atomikos JTA Starter ................... SKIPPED
20-Oct-2017 00:13:53 [INFO] Spring Boot Bitronix JTA Starter ................... SKIPPED
20-Oct-2017 00:13:53 [INFO] Spring Boot Narayana JTA Starter ................... SKIPPED
20-Oct-2017 00:13:53 [INFO] Spring Boot Log4j 2 Starter ........................ SKIPPED
20-Oct-2017 00:13:53 [INFO] Spring Boot Mail Starter ........................... SKIPPED
20-Oct-2017 00:13:53 [INFO] Spring Boot Mobile Starter ......................... SKIPPED
20-Oct-2017 00:13:53 [INFO] Spring Boot Mustache Starter ....................... SKIPPED
20-Oct-2017 00:13:53 [INFO] Spring Boot Actuator Starter ....................... SKIPPED
20-Oct-2017 00:13:53 [INFO] Spring Boot Starter Parent ......................... SKIPPED
20-Oct-2017 00:13:53 [INFO] Spring Boot Quartz Starter ......................... SKIPPED
20-Oct-2017 00:13:53 [INFO] Spring Boot Reactor Netty Starter .................. SKIPPED
20-Oct-2017 00:13:53 [INFO] Spring Boot Security Starter ....................... SKIPPED
20-Oct-2017 00:13:53 [INFO] Spring Boot Social Facebook Starter ................ SKIPPED
20-Oct-2017 00:13:53 [INFO] Spring Boot Social Twitter Starter ................. SKIPPED
20-Oct-2017 00:13:53 [INFO] Spring Boot Social LinkedIn Starter ................ SKIPPED
20-Oct-2017 00:13:53 [INFO] Spring Boot Test Starter ........................... SKIPPED
20-Oct-2017 00:13:53 [INFO] Spring Boot Thymeleaf Starter ...................... SKIPPED
20-Oct-2017 00:13:53 [INFO] Spring Boot Undertow Starter ....................... SKIPPED
20-Oct-2017 00:13:53 [INFO] Spring Boot WebFlux Starter ........................ SKIPPED
20-Oct-2017 00:13:53 [INFO] Spring Boot WebSocket Starter ...................... SKIPPED
20-Oct-2017 00:13:53 [INFO] Spring Boot Web Services Starter ................... SKIPPED
20-Oct-2017 00:13:53 [INFO] Spring Boot CLI .................................... SKIPPED
20-Oct-2017 00:13:53 [INFO] Spring Boot Docs ................................... SKIPPED
20-Oct-2017 00:13:53 [INFO] Spring Boot Build .................................. SKIPPED
20-Oct-2017 00:13:53 [INFO] Spring Boot Samples Invoker ........................ SKIPPED
20-Oct-2017 00:13:53 [INFO] Spring Boot Tests .................................. SKIPPED
20-Oct-2017 00:13:53 [INFO] Spring Boot Integration Tests ...................... SKIPPED
20-Oct-2017 00:13:53 [INFO] Spring Boot DevTools Tests ......................... SKIPPED
20-Oct-2017 00:13:53 [INFO] Spring Boot Server Tests ........................... SKIPPED
20-Oct-2017 00:13:53 [INFO] Spring Boot Launch Script Integration Tests ........ SKIPPED
20-Oct-2017 00:13:53 [INFO] Spring Boot Security Tests ......................... SKIPPED
20-Oct-2017 00:13:53 [INFO] Spring Boot Security Tests - Web Hello World ....... SKIPPED
20-Oct-2017 00:13:53 [INFO] ------------------------------------------------------------------------
20-Oct-2017 00:13:53 [INFO] BUILD FAILURE
20-Oct-2017 00:13:53 [INFO] ------------------------------------------------------------------------
20-Oct-2017 00:13:53 [INFO] Total time: 12:13 min
20-Oct-2017 00:13:53 [INFO] Finished at: 2017-10-20T00:13:53Z
20-Oct-2017 00:13:54 [INFO] Final Memory: 480M/863M
20-Oct-2017 00:13:54 [INFO] ------------------------------------------------------------------------
20-Oct-2017 00:13:54 [ERROR] Failed to execute goal org.apache.maven.plugins:maven-surefire-plugin:2.20.1:test (default-test) on project spring-boot-test-autoconfigure: There are test failures.
20-Oct-2017 00:13:54 [ERROR]
20-Oct-2017 00:13:54 [ERROR] Please refer to /opt/bamboo-home/xml-data/build-dir/BOOT-JDK9-JOB1/spring-boot-project/spring-boot-test-autoconfigure/target/surefire-reports for the individual test results.
20-Oct-2017 00:13:54 [ERROR] Please refer to dump files (if any exist) [date]-jvmRun[N].dump, [date].dumpstream and [date]-jvmRun[N].dumpstream.
20-Oct-2017 00:13:54 [ERROR] -> [Help 1]
20-Oct-2017 00:13:54 [ERROR]
20-Oct-2017 00:13:54 [ERROR] To see the full stack trace of the errors, re-run Maven with the -e switch.
20-Oct-2017 00:13:54 [ERROR] Re-run Maven using the -X switch to enable full debug logging.
20-Oct-2017 00:13:54 [ERROR]
20-Oct-2017 00:13:54 [ERROR] For more information about the errors and possible solutions, please read the following articles:
20-Oct-2017 00:13:54 [ERROR] [Help 1] http://cwiki.apache.org/confluence/display/MAVEN/MojoFailureException
20-Oct-2017 00:13:54 [ERROR]
20-Oct-2017 00:13:54 [ERROR] After correcting the problems, you can resume the build with the command
20-Oct-2017 00:13:54 [ERROR]   mvn <goals> -rf :spring-boot-test-autoconfigure
20-Oct-2017 00:13:54 Failing task since return code of [/opt/maven-3.5/bin/mvn --batch-mode -Djava.io.tmpdir=/tmp/BOOT-JDK9-JOB1 clean install -U] was 1 while expected 0
20-Oct-2017 00:13:54 Parsing test results under /opt/bamboo-home/xml-data/build-dir/BOOT-JDK9-JOB1...
20-Oct-2017 00:13:55 Finished task 'Full buil' with result: Failed
20-Oct-2017 00:13:55 Running post build plugin 'Docker Container Cleanup'
20-Oct-2017 00:13:55 Running post build plugin 'NCover Results Collector'
20-Oct-2017 00:13:55 Running post build plugin 'Artifactory Release Management Staging'
20-Oct-2017 00:13:55 Running post build plugin 'Artifactory Build Info Copier'
20-Oct-2017 00:13:55 Running post build plugin 'Artifactory Gradle Properties Info Copier'
20-Oct-2017 00:13:55 Running post build plugin 'Clover Results Collector'
20-Oct-2017 00:13:55 Running post build plugin 'npm Cache Cleanup'
20-Oct-2017 00:13:55 Running post build plugin 'Artifact Copier'
20-Oct-2017 00:13:55 Publishing an artifact: sample-build-logs
20-Oct-2017 00:13:55 Finished publishing of artifact Job artifact: [sample-build-logs], pattern: [**/build.log] anchored at: [spring-boot-samples] in 87.02 ms
20-Oct-2017 00:13:55 Successfully removed working directory at '/opt/bamboo-home/xml-data/build-dir/BOOT-JDK9-JOB1'
20-Oct-2017 00:13:55 Finalising the build...
20-Oct-2017 00:13:55 Stopping timer.
20-Oct-2017 00:13:55 Build BOOT-JDK9-JOB1-71 completed.
20-Oct-2017 00:13:56 Running on server: post build plugin 'NCover Results Collector'
20-Oct-2017 00:13:56 Running on server: post build plugin 'Build Hanging Detection Configuration'
20-Oct-2017 00:13:56 Running on server: post build plugin 'Clover Delta Calculator'
20-Oct-2017 00:13:56 Running on server: post build plugin 'Maven Dependencies Postprocessor'
20-Oct-2017 00:13:56 All post build plugins have finished
20-Oct-2017 00:13:56 Generating build results summary...
20-Oct-2017 00:13:59 Saving build results to disk...
20-Oct-2017 00:13:59 Logging substituted variables...
20-Oct-2017 00:13:59 Indexing build results...
20-Oct-2017 00:13:59 Finished building BOOT-JDK9-JOB1-71.