Build #1,291

Build: #1291 failed Scheduled with changes by 7 people

Logs

The following logs have been generated by the jobs in this plan.
  • Expand all
  • Collapse all
Job Logs
Collapse Default Job Default Stage Download or View
19-Jul-2019 00:19:41 [INFO]
19-Jul-2019 00:19:41 [ERROR] Errors:
19-Jul-2019 00:19:41 [ERROR]   SysVinitLaunchScriptIT.launchWithSingleCommandLineArgument:172->doLaunch:281->doTest:286->buildImage:376 » DockerClient
19-Jul-2019 00:19:41 [INFO]
19-Jul-2019 00:19:41 [ERROR] Tests run: 81, Failures: 0, Errors: 1, Skipped: 1
19-Jul-2019 00:19:41 [INFO]
19-Jul-2019 00:19:41 [INFO]
19-Jul-2019 00:19:41 [INFO] --- maven-failsafe-plugin:2.22.2:verify (default) @ spring-boot-launch-script-tests ---
19-Jul-2019 00:19:41 [INFO] ------------------------------------------------------------------------
19-Jul-2019 00:19:41 [INFO] BUILD FAILURE
19-Jul-2019 00:19:41 [INFO] ------------------------------------------------------------------------
19-Jul-2019 00:19:41 [INFO] Total time: 19:09 min
19-Jul-2019 00:19:41 [INFO] Finished at: 2019-07-19T00:19:41Z
19-Jul-2019 00:19:41 [INFO] ------------------------------------------------------------------------
19-Jul-2019 00:19:41 [ERROR] Failed to execute goal org.apache.maven.plugins:maven-failsafe-plugin:2.22.2:verify (default) on project spring-boot-launch-script-tests: There are test failures.
19-Jul-2019 00:19:41 [ERROR]
19-Jul-2019 00:19:41 [ERROR] Please refer to /opt/bamboo-home/xml-data/build-dir/BOOT-LSIT-JOB1/spring-boot-tests/spring-boot-integration-tests/spring-boot-launch-script-tests/target/failsafe-reports for the individual test results.
19-Jul-2019 00:19:41 [ERROR] Please refer to dump files (if any exist) [date].dump, [date]-jvmRun[N].dump and [date].dumpstream.
19-Jul-2019 00:19:41 [ERROR] -> [Help 1]
19-Jul-2019 00:19:41 [ERROR]
19-Jul-2019 00:19:41 [ERROR] To see the full stack trace of the errors, re-run Maven with the -e switch.
19-Jul-2019 00:19:41 [ERROR] Re-run Maven using the -X switch to enable full debug logging.
19-Jul-2019 00:19:41 [ERROR]
19-Jul-2019 00:19:41 [ERROR] For more information about the errors and possible solutions, please read the following articles:
19-Jul-2019 00:19:41 [ERROR] [Help 1] http://cwiki.apache.org/confluence/display/MAVEN/MojoFailureException