Build #1,602

Spring Boot on Windows

Build: #1602 failed Scheduled

Build result summary

Details

Completed
Duration
11 minutes
Labels
None
Revision
cce8c45ae63d2d10f781963e40b6a65c18abc112 cce8c45ae63d2d10f781963e40b6a65c18abc112
Total tests
6533
Failing since
#1592 (Scheduled with changes by Stéphane Nicoll)
Fixed in
#1630 (Manual run by Andy Wilkinson)

Tests

Responsible

Tests

Existing test failures 3
Status Test Failing since View job Duration
java.io.IOException: Failed to delete temp directory C:\Users\bamboo\AppData\Local\Temp\BOOT-WIN-JOB1\junit5816514418891534829. The following paths could not be deleted (see suppressed exceptions for details): 
	at org.junit.jupiter.engine.extension.TempDirectory$CloseablePath.createIOExceptionWithAttachedFailures(TempDirectory.java:211)
	at org.junit.jupiter.engine.extension.TempDirectory$CloseablePath.close(TempDirectory.java:168)
	at org.junit.platform.engine.support.hierarchical.ThrowableCollector.execute(ThrowableCollector.java:73)
	at org.junit.jupiter.engine.execution.ExtensionValuesStore.closeAllStoredCloseableValues(ExtensionValuesStore.java:61)
	at org.junit.jupiter.engine.descriptor.AbstractExtensionContext.close(AbstractExtensionContext.java:73)
	at org.junit.jupiter.engine.execution.JupiterEngineExecutionContext.close(JupiterEngineExecutionContext.java:53)
	at org.junit.jupiter.engine.descriptor.JupiterTestDescriptor.cleanUp(JupiterTestDescriptor.java:191)
(51 more lines...)
java.io.IOException: Failed to delete temp directory C:\Users\bamboo\AppData\Local\Temp\BOOT-WIN-JOB1\junit8705649065306243008. The following paths could not be deleted (see suppressed exceptions for details): 
	at org.junit.jupiter.engine.extension.TempDirectory$CloseablePath.createIOExceptionWithAttachedFailures(TempDirectory.java:211)
	at org.junit.jupiter.engine.extension.TempDirectory$CloseablePath.close(TempDirectory.java:168)
	at org.junit.platform.engine.support.hierarchical.ThrowableCollector.execute(ThrowableCollector.java:73)
	at org.junit.jupiter.engine.execution.ExtensionValuesStore.closeAllStoredCloseableValues(ExtensionValuesStore.java:61)
	at org.junit.jupiter.engine.descriptor.AbstractExtensionContext.close(AbstractExtensionContext.java:73)
	at org.junit.jupiter.engine.execution.JupiterEngineExecutionContext.close(JupiterEngineExecutionContext.java:53)
	at org.junit.jupiter.engine.descriptor.JupiterTestDescriptor.cleanUp(JupiterTestDescriptor.java:191)
(51 more lines...)
java.io.IOException: Failed to delete temp directory C:\Users\bamboo\AppData\Local\Temp\BOOT-WIN-JOB1\junit8108329904861987138. The following paths could not be deleted (see suppressed exceptions for details): 
	at org.junit.jupiter.engine.extension.TempDirectory$CloseablePath.createIOExceptionWithAttachedFailures(TempDirectory.java:211)
	at org.junit.jupiter.engine.extension.TempDirectory$CloseablePath.close(TempDirectory.java:168)
	at org.junit.platform.engine.support.hierarchical.ThrowableCollector.execute(ThrowableCollector.java:73)
	at org.junit.jupiter.engine.execution.ExtensionValuesStore.closeAllStoredCloseableValues(ExtensionValuesStore.java:61)
	at org.junit.jupiter.engine.descriptor.AbstractExtensionContext.close(AbstractExtensionContext.java:73)
	at org.junit.jupiter.engine.execution.JupiterEngineExecutionContext.close(JupiterEngineExecutionContext.java:53)
	at org.junit.jupiter.engine.descriptor.JupiterTestDescriptor.cleanUp(JupiterTestDescriptor.java:191)
(51 more lines...)