Build #1,635

Spring Boot on Windows

Build: #1635 failed Scheduled with changes by Phil Webb and Andy Wilkinson

Logs

The following logs have been generated by the jobs in this plan.
  • Expand all
  • Collapse all
Job Logs
Collapse Default Job Default Stage Download or View
18-Jun-2019 11:05:46 [INFO] Spring Boot Configuration Processor Tests .......... SKIPPED
18-Jun-2019 11:05:46 [INFO] Spring Boot DevTools Tests ......................... SKIPPED
18-Jun-2019 11:05:46 [INFO] Spring Boot Hibernate 5.2 tests .................... SKIPPED
18-Jun-2019 11:05:46 [INFO] Spring Boot Server Tests ........................... SKIPPED
18-Jun-2019 11:05:46 [INFO] Spring Boot Launch Script Integration Tests 2.2.0.BUILD-SNAPSHOT SKIPPED
18-Jun-2019 11:05:46 [INFO] ------------------------------------------------------------------------
18-Jun-2019 11:05:46 [INFO] BUILD FAILURE
18-Jun-2019 11:05:46 [INFO] ------------------------------------------------------------------------
18-Jun-2019 11:05:46 [INFO] Total time: 31:26 min
18-Jun-2019 11:05:46 [INFO] Finished at: 2019-06-18T11:05:46Z
18-Jun-2019 11:05:46 [INFO] ------------------------------------------------------------------------
18-Jun-2019 11:05:46 [ERROR] Failed to execute goal org.apache.maven.plugins:maven-surefire-plugin:2.22.2:test (default-test) on project spring-boot-loader: There are test failures.
18-Jun-2019 11:05:46 [ERROR]
18-Jun-2019 11:05:46 [ERROR] Please refer to C:\opt\bamboo-home\xml-data\build-dir\BOOT-WIN-JOB1\spring-boot-project\spring-boot-tools\spring-boot-loader\target\surefire-reports for the individual test results.
18-Jun-2019 11:05:46 [ERROR] Please refer to dump files (if any exist) [date].dump, [date]-jvmRun[N].dump and [date].dumpstream.
18-Jun-2019 11:05:46 [ERROR] -> [Help 1]
18-Jun-2019 11:05:46 [ERROR]
18-Jun-2019 11:05:46 [ERROR] To see the full stack trace of the errors, re-run Maven with the -e switch.
18-Jun-2019 11:05:46 [ERROR] Re-run Maven using the -X switch to enable full debug logging.
18-Jun-2019 11:05:46 [ERROR]
18-Jun-2019 11:05:46 [ERROR] For more information about the errors and possible solutions, please read the following articles:
18-Jun-2019 11:05:46 [ERROR] [Help 1] http://cwiki.apache.org/confluence/display/MAVEN/MojoFailureException
18-Jun-2019 11:05:46 [ERROR]
18-Jun-2019 11:05:46 [ERROR] After correcting the problems, you can resume the build with the command
18-Jun-2019 11:05:46 [ERROR]   mvn <goals> -rf :spring-boot-loader