Build #1,660

Spring Boot on Windows

Build: #1660 failed Scheduled with changes by 6 people

Logs

The following logs have been generated by the jobs in this plan.
  • Expand all
  • Collapse all
Job Logs
Collapse Default Job Default Stage Download or View
11-Jul-2019 11:44:41 [INFO] Spring Boot Configuration Processor Tests .......... SKIPPED
11-Jul-2019 11:44:41 [INFO] Spring Boot DevTools Tests ......................... SKIPPED
11-Jul-2019 11:44:41 [INFO] Spring Boot Server Tests ........................... SKIPPED
11-Jul-2019 11:44:41 [INFO] Spring Boot Launch Script Integration Tests 2.2.0.BUILD-SNAPSHOT SKIPPED
11-Jul-2019 11:44:41 [INFO] ------------------------------------------------------------------------
11-Jul-2019 11:44:41 [INFO] BUILD FAILURE
11-Jul-2019 11:44:41 [INFO] ------------------------------------------------------------------------
11-Jul-2019 11:44:41 [INFO] Total time: 11:07 min
11-Jul-2019 11:44:41 [INFO] Finished at: 2019-07-11T11:44:41Z
11-Jul-2019 11:44:41 [INFO] ------------------------------------------------------------------------
11-Jul-2019 11:44:41 [ERROR] Failed to execute goal org.apache.maven.plugins:maven-surefire-plugin:2.22.2:test (default-test) on project spring-boot-autoconfigure: There are test failures.
11-Jul-2019 11:44:41 [ERROR]
11-Jul-2019 11:44:41 [ERROR] Please refer to C:\opt\bamboo-home\xml-data\build-dir\BOOT-WIN-JOB1\spring-boot-project\spring-boot-autoconfigure\target\surefire-reports for the individual test results.
11-Jul-2019 11:44:41 [ERROR] Please refer to dump files (if any exist) [date].dump, [date]-jvmRun[N].dump and [date].dumpstream.
11-Jul-2019 11:44:41 [ERROR] -> [Help 1]
11-Jul-2019 11:44:41 [ERROR]
11-Jul-2019 11:44:41 [ERROR] To see the full stack trace of the errors, re-run Maven with the -e switch.
11-Jul-2019 11:44:41 [ERROR] Re-run Maven using the -X switch to enable full debug logging.
11-Jul-2019 11:44:41 [ERROR]
11-Jul-2019 11:44:41 [ERROR] For more information about the errors and possible solutions, please read the following articles:
11-Jul-2019 11:44:41 [ERROR] [Help 1] http://cwiki.apache.org/confluence/display/MAVEN/MojoFailureException
11-Jul-2019 11:44:41 [ERROR]
11-Jul-2019 11:44:41 [ERROR] After correcting the problems, you can resume the build with the command
11-Jul-2019 11:44:41 [ERROR]   mvn <goals> -rf :spring-boot-autoconfigure
11-Jul-2019 11:44:43 Unable to publish artifact [sample-build-logs]: the source directory C:\opt\bamboo-home\xml-data\build-dir\BOOT-WIN-JOB1\spring-boot-samples does not exist.