Build #1,660

Spring Boot on Windows

Build: #1660 failed Scheduled with changes by 6 people

Test results

  • 5,685 tests in total
  • 3 tests failed
  • 3 failures are new
  • 16 tests were quarantined / skipped
  • 5 minutes taken in total.
New test failures 3
Status Test View job Duration
Collapse Failed JdbcRepositoriesAutoConfigurationTests basicAutoConfiguration History
Default Job < 1 sec
java.lang.AssertionError: 
Expecting:
 <Unstarted application context org.springframework.boot.test.context.assertj.AssertableApplicationContext[startupFailure=org.springframework.beans.factory.UnsatisfiedDependencyException]>
to have a single bean of type:
 <org.springframework.data.jdbc.repository.config.AbstractJdbcConfiguration>:
but context failed to start:
 org.springframework.beans.factory.UnsatisfiedDependencyException: Error creating bean with name 'jdbcConverter' defined in org.springframework.boot.autoconfigure.data.jdbc.JdbcRepositoriesAutoConfiguration$SpringBootJdbcConfiguration: Unsatisfied dependency expressed through method 'jdbcConverter' parameter 4; nested exception is org.springframework.beans.factory.BeanCurrentlyInCreationException: Error creating bean with name 'jdbcConverter': Requested bean is currently in creation: Is there an unresolvable circular reference?
  at org.springframework.beans.factory.support.ConstructorResolver.createArgumentArray(ConstructorResolver.java:780)
(284 more lines...)
Collapse Failed JdbcRepositoriesAutoConfigurationTests honoursUsersEnableJdbcRepositoriesConfiguration History
Default Job < 1 sec
java.lang.AssertionError: 
Expecting:
 <Unstarted application context org.springframework.boot.test.context.assertj.AssertableApplicationContext[startupFailure=org.springframework.beans.factory.UnsatisfiedDependencyException]>
to have a single bean of type:
 <org.springframework.data.jdbc.repository.config.AbstractJdbcConfiguration>:
but context failed to start:
 org.springframework.beans.factory.UnsatisfiedDependencyException: Error creating bean with name 'cityRepository': Unsatisfied dependency expressed through method 'setConverter' parameter 0; nested exception is org.springframework.beans.factory.UnsatisfiedDependencyException: Error creating bean with name 'jdbcConverter' defined in org.springframework.boot.autoconfigure.data.jdbc.JdbcRepositoriesAutoConfiguration$SpringBootJdbcConfiguration: Unsatisfied dependency expressed through method 'jdbcConverter' parameter 4; nested exception is org.springframework.beans.factory.BeanCurrentlyInCreationException: Error creating bean with name 'jdbcConverter': Requested bean is currently in creation: Is there an unresolvable circular reference?
  at org.springframework.beans.factory.annotation.AutowiredAnnotationBeanPostProcessor$AutowiredMethodElement.inject(AutowiredAnnotationBeanPostProcessor.java:707)
(316 more lines...)
Collapse Failed JdbcRepositoriesAutoConfigurationTests autoConfigurationWithNoRepositories History
Default Job < 1 sec
java.lang.AssertionError: 
Expecting:
 <Unstarted application context org.springframework.boot.test.context.assertj.AssertableApplicationContext[startupFailure=org.springframework.beans.factory.UnsatisfiedDependencyException]>
to have a single bean of type:
 <org.springframework.data.jdbc.repository.config.AbstractJdbcConfiguration>:
but context failed to start:
 org.springframework.beans.factory.UnsatisfiedDependencyException: Error creating bean with name 'jdbcConverter' defined in org.springframework.boot.autoconfigure.data.jdbc.JdbcRepositoriesAutoConfiguration$SpringBootJdbcConfiguration: Unsatisfied dependency expressed through method 'jdbcConverter' parameter 4; nested exception is org.springframework.beans.factory.BeanCurrentlyInCreationException: Error creating bean with name 'jdbcConverter': Requested bean is currently in creation: Is there an unresolvable circular reference?
  at org.springframework.beans.factory.support.ConstructorResolver.createArgumentArray(ConstructorResolver.java:780)
(284 more lines...)
Skipped tests 16
Status Test Failing since View job
Skipped MessageSourceAutoConfigurationTests testMessageSourceFromPropertySourceAnnotation History
Default Job
Skipped CouchbaseAutoConfigurationIntegrationTests org.springframework.boot.autoconfigure.couchbase.CouchbaseAutoConfigurationIntegrationTests History
Default Job
Skipped CassandraDataAutoConfigurationIntegrationTests org.springframework.boot.autoconfigure.data.cassandra.CassandraDataAutoConfigurationIntegrationTests History
Default Job
Skipped ElasticsearchAutoConfigurationTests org.springframework.boot.autoconfigure.data.elasticsearch.ElasticsearchAutoConfigurationTests History
Default Job
Skipped ElasticsearchDataAutoConfigurationTests org.springframework.boot.autoconfigure.data.elasticsearch.ElasticsearchDataAutoConfigurationTests History
Default Job
Skipped ElasticsearchRepositoriesAutoConfigurationTests org.springframework.boot.autoconfigure.data.elasticsearch.ElasticsearchRepositoriesAutoConfigurationTests History
Default Job
Skipped ReactiveElasticsearchRepositoriesAutoConfigurationTests org.springframework.boot.autoconfigure.data.elasticsearch.ReactiveElasticsearchRepositoriesAutoConfigurationTests History
Default Job
Skipped ReactiveRestClientAutoConfigurationTests org.springframework.boot.autoconfigure.data.elasticsearch.ReactiveRestClientAutoConfigurationTests History
Default Job
Skipped MixedNeo4jRepositoriesAutoConfigurationTests testJpaRepositoryConfigurationWithNeo4jOverlap History
Default Job
Skipped RedisRepositoriesAutoConfigurationTests org.springframework.boot.autoconfigure.data.redis.RedisRepositoriesAutoConfigurationTests History
Default Job
Skipped JestAutoConfigurationTests org.springframework.boot.autoconfigure.elasticsearch.jest.JestAutoConfigurationTests History
Default Job
Skipped RestClientAutoConfigurationTests org.springframework.boot.autoconfigure.elasticsearch.rest.RestClientAutoConfigurationTests History
Default Job
Skipped SessionAutoConfigurationRedisTests org.springframework.boot.autoconfigure.session.SessionAutoConfigurationRedisTests History
Default Job
Skipped SpringBootContextLoaderTests environmentPropertiesNewLineInValue History
Default Job
Skipped UndertowServletWebServerFactoryTests jspServletIsNotInDevelopmentModeByDefault History
Default Job
Skipped UndertowServletWebServerFactoryTests jspServletInitParameters History
Default Job