Build #1,668

Spring Boot on Windows

Build: #1668 failed Scheduled with changes by 7 people

Build result summary

Details

Completed
Duration
183 minutes
Labels
None
Agent
bamboo-2k16-02
Revision
741d8735d28ad6d3c7708802e5620510287bbc49 741d8735d28ad6d3c7708802e5620510287bbc49
Total tests
9877
Fixed in
#1669 (Scheduled with changes by 3 people)

Tests

Responsible

Code commits

Author Commit Message Commit date
Andy Wilkinson Andy Wilkinson 741d8735d28ad6d3c7708802e5620510287bbc49 741d8735d28ad6d3c7708802e5620510287bbc49 Merge branch '2.1.x'
Closes gh-17576
Andy Wilkinson Andy Wilkinson ab364b07c78678f407d6810d65b404b6d3391534 m ab364b07c78678f407d6810d65b404b6d3391534 Merge pull request #17508 from dreis2211
* gh-17508:
  Remove unused java-statsd-client dependencies

Closes gh-17508
dreis2211 <christoph.dreis@freenet.de> dreis2211 <christoph.dreis@freenet.de> 43833c7bf0bb92743e217c0139a3889f16054fea m 43833c7bf0bb92743e217c0139a3889f16054fea Remove unused java-statsd-client dependencies
See gh-17508
Andy Wilkinson Andy Wilkinson bc14dce13c150f9011c6c9645a44a56ad39eaa90 bc14dce13c150f9011c6c9645a44a56ad39eaa90 Merge pull request #17049 from sbrannen
* gh-17049:
  Polish "Polish OutputCapture and its JUnit Jupiter extension"
  Polish OutputCapture and its JUnit Jupiter extension

Closes gh-17049
Andy Wilkinson Andy Wilkinson 41957ec2adf64824a49fc2a2f620eb89d9d00b36 41957ec2adf64824a49fc2a2f620eb89d9d00b36 Polish "Polish OutputCapture and its JUnit Jupiter extension"
See gh-17049

Tests

New test failures 108
Status Test View job Duration
Collapse Failed EmbeddedServletContainerJarDevelopmentIntegrationTests metaInfResourceFromDependencyIsAvailableViaHttp{RestTemplate}[1] History
Default Job 7 secs
org.junit.jupiter.api.extension.ParameterResolutionException: Failed to resolve parameter [org.springframework.web.client.RestTemplate rest] in method [public void org.springframework.boot.context.embedded.EmbeddedServletContainerJarDevelopmentIntegrationTests.metaInfResourceFromDependencyIsAvailableViaHttp(org.springframework.web.client.RestTemplate)]: org/springframework/http/client/ClientHttpRequestFactory
	at org.junit.jupiter.engine.execution.ExecutableInvoker.resolveParameter(ExecutableInvoker.java:239)
	at org.junit.jupiter.engine.execution.ExecutableInvoker.resolveParameters(ExecutableInvoker.java:183)
	at org.junit.jupiter.engine.execution.ExecutableInvoker.resolveParameters(ExecutableInvoker.java:144)
	at org.junit.jupiter.engine.execution.ExecutableInvoker.invoke(ExecutableInvoker.java:96)
	at org.junit.jupiter.engine.descriptor.TestMethodTestDescriptor.lambda$invokeTestMethod$6(TestMethodTestDescriptor.java:202)
	at org.junit.platform.engine.support.hierarchical.ThrowableCollector.execute(ThrowableCollector.java:73)
	at org.junit.jupiter.engine.descriptor.TestMethodTestDescriptor.invokeTestMethod(TestMethodTestDescriptor.java:198)
(100 more lines...)
Collapse Failed EmbeddedServletContainerJarDevelopmentIntegrationTests metaInfResourceFromDependencyIsAvailableViaServletContext{RestTemplate}[6] History
Default Job 13 secs
org.junit.jupiter.api.extension.ParameterResolutionException: Failed to resolve parameter [org.springframework.web.client.RestTemplate rest] in method [public void org.springframework.boot.context.embedded.EmbeddedServletContainerJarDevelopmentIntegrationTests.metaInfResourceFromDependencyIsAvailableViaServletContext(org.springframework.web.client.RestTemplate)]: org/springframework/http/client/ClientHttpRequestFactory
	at org.junit.jupiter.engine.execution.ExecutableInvoker.resolveParameter(ExecutableInvoker.java:239)
	at org.junit.jupiter.engine.execution.ExecutableInvoker.resolveParameters(ExecutableInvoker.java:183)
	at org.junit.jupiter.engine.execution.ExecutableInvoker.resolveParameters(ExecutableInvoker.java:144)
	at org.junit.jupiter.engine.execution.ExecutableInvoker.invoke(ExecutableInvoker.java:96)
	at org.junit.jupiter.engine.descriptor.TestMethodTestDescriptor.lambda$invokeTestMethod$6(TestMethodTestDescriptor.java:202)
	at org.junit.platform.engine.support.hierarchical.ThrowableCollector.execute(ThrowableCollector.java:73)
	at org.junit.jupiter.engine.descriptor.TestMethodTestDescriptor.invokeTestMethod(TestMethodTestDescriptor.java:198)
(100 more lines...)
Collapse Failed EmbeddedServletContainerJarDevelopmentIntegrationTests metaInfResourceFromDependencyIsAvailableViaServletContext{RestTemplate}[4] History
Default Job 7 secs
org.junit.jupiter.api.extension.ParameterResolutionException: Failed to resolve parameter [org.springframework.web.client.RestTemplate rest] in method [public void org.springframework.boot.context.embedded.EmbeddedServletContainerJarDevelopmentIntegrationTests.metaInfResourceFromDependencyIsAvailableViaServletContext(org.springframework.web.client.RestTemplate)]: org/springframework/http/client/ClientHttpRequestFactory
	at org.junit.jupiter.engine.execution.ExecutableInvoker.resolveParameter(ExecutableInvoker.java:239)
	at org.junit.jupiter.engine.execution.ExecutableInvoker.resolveParameters(ExecutableInvoker.java:183)
	at org.junit.jupiter.engine.execution.ExecutableInvoker.resolveParameters(ExecutableInvoker.java:144)
	at org.junit.jupiter.engine.execution.ExecutableInvoker.invoke(ExecutableInvoker.java:96)
	at org.junit.jupiter.engine.descriptor.TestMethodTestDescriptor.lambda$invokeTestMethod$6(TestMethodTestDescriptor.java:202)
	at org.junit.platform.engine.support.hierarchical.ThrowableCollector.execute(ThrowableCollector.java:73)
	at org.junit.jupiter.engine.descriptor.TestMethodTestDescriptor.invokeTestMethod(TestMethodTestDescriptor.java:198)
(100 more lines...)
Collapse Failed EmbeddedServletContainerJarDevelopmentIntegrationTests metaInfResourceFromDependencyIsAvailableViaHttp{RestTemplate}[2] History
Default Job 7 secs
org.junit.jupiter.api.extension.ParameterResolutionException: Failed to resolve parameter [org.springframework.web.client.RestTemplate rest] in method [public void org.springframework.boot.context.embedded.EmbeddedServletContainerJarDevelopmentIntegrationTests.metaInfResourceFromDependencyIsAvailableViaHttp(org.springframework.web.client.RestTemplate)]: org/springframework/http/client/ClientHttpRequestFactory
	at org.junit.jupiter.engine.execution.ExecutableInvoker.resolveParameter(ExecutableInvoker.java:239)
	at org.junit.jupiter.engine.execution.ExecutableInvoker.resolveParameters(ExecutableInvoker.java:183)
	at org.junit.jupiter.engine.execution.ExecutableInvoker.resolveParameters(ExecutableInvoker.java:144)
	at org.junit.jupiter.engine.execution.ExecutableInvoker.invoke(ExecutableInvoker.java:96)
	at org.junit.jupiter.engine.descriptor.TestMethodTestDescriptor.lambda$invokeTestMethod$6(TestMethodTestDescriptor.java:202)
	at org.junit.platform.engine.support.hierarchical.ThrowableCollector.execute(ThrowableCollector.java:73)
	at org.junit.jupiter.engine.descriptor.TestMethodTestDescriptor.invokeTestMethod(TestMethodTestDescriptor.java:198)
(100 more lines...)
Collapse Failed EmbeddedServletContainerJarDevelopmentIntegrationTests metaInfResourceFromDependencyIsAvailableViaServletContext{RestTemplate}[3] History
Default Job 12 secs
org.junit.jupiter.api.extension.ParameterResolutionException: Failed to resolve parameter [org.springframework.web.client.RestTemplate rest] in method [public void org.springframework.boot.context.embedded.EmbeddedServletContainerJarDevelopmentIntegrationTests.metaInfResourceFromDependencyIsAvailableViaServletContext(org.springframework.web.client.RestTemplate)]: org/springframework/http/client/ClientHttpRequestFactory
	at org.junit.jupiter.engine.execution.ExecutableInvoker.resolveParameter(ExecutableInvoker.java:239)
	at org.junit.jupiter.engine.execution.ExecutableInvoker.resolveParameters(ExecutableInvoker.java:183)
	at org.junit.jupiter.engine.execution.ExecutableInvoker.resolveParameters(ExecutableInvoker.java:144)
	at org.junit.jupiter.engine.execution.ExecutableInvoker.invoke(ExecutableInvoker.java:96)
	at org.junit.jupiter.engine.descriptor.TestMethodTestDescriptor.lambda$invokeTestMethod$6(TestMethodTestDescriptor.java:202)
	at org.junit.platform.engine.support.hierarchical.ThrowableCollector.execute(ThrowableCollector.java:73)
	at org.junit.jupiter.engine.descriptor.TestMethodTestDescriptor.invokeTestMethod(TestMethodTestDescriptor.java:198)
(100 more lines...)
Collapse Failed EmbeddedServletContainerJarDevelopmentIntegrationTests metaInfResourceFromDependencyIsAvailableViaHttp{RestTemplate}[5] History
Default Job 13 secs
org.junit.jupiter.api.extension.ParameterResolutionException: Failed to resolve parameter [org.springframework.web.client.RestTemplate rest] in method [public void org.springframework.boot.context.embedded.EmbeddedServletContainerJarDevelopmentIntegrationTests.metaInfResourceFromDependencyIsAvailableViaHttp(org.springframework.web.client.RestTemplate)]: org/springframework/http/client/ClientHttpRequestFactory
	at org.junit.jupiter.engine.execution.ExecutableInvoker.resolveParameter(ExecutableInvoker.java:239)
	at org.junit.jupiter.engine.execution.ExecutableInvoker.resolveParameters(ExecutableInvoker.java:183)
	at org.junit.jupiter.engine.execution.ExecutableInvoker.resolveParameters(ExecutableInvoker.java:144)
	at org.junit.jupiter.engine.execution.ExecutableInvoker.invoke(ExecutableInvoker.java:96)
	at org.junit.jupiter.engine.descriptor.TestMethodTestDescriptor.lambda$invokeTestMethod$6(TestMethodTestDescriptor.java:202)
	at org.junit.platform.engine.support.hierarchical.ThrowableCollector.execute(ThrowableCollector.java:73)
	at org.junit.jupiter.engine.descriptor.TestMethodTestDescriptor.invokeTestMethod(TestMethodTestDescriptor.java:198)
(100 more lines...)
Collapse Failed EmbeddedServletContainerJarDevelopmentIntegrationTests metaInfResourceFromDependencyIsAvailableViaServletContext{RestTemplate}[1] History
Default Job 19 secs
org.junit.jupiter.api.extension.ParameterResolutionException: Failed to resolve parameter [org.springframework.web.client.RestTemplate rest] in method [public void org.springframework.boot.context.embedded.EmbeddedServletContainerJarDevelopmentIntegrationTests.metaInfResourceFromDependencyIsAvailableViaServletContext(org.springframework.web.client.RestTemplate)]: org/springframework/http/client/ClientHttpRequestFactory
	at org.junit.jupiter.engine.execution.ExecutableInvoker.resolveParameter(ExecutableInvoker.java:239)
	at org.junit.jupiter.engine.execution.ExecutableInvoker.resolveParameters(ExecutableInvoker.java:183)
	at org.junit.jupiter.engine.execution.ExecutableInvoker.resolveParameters(ExecutableInvoker.java:144)
	at org.junit.jupiter.engine.execution.ExecutableInvoker.invoke(ExecutableInvoker.java:96)
	at org.junit.jupiter.engine.descriptor.TestMethodTestDescriptor.lambda$invokeTestMethod$6(TestMethodTestDescriptor.java:202)
	at org.junit.platform.engine.support.hierarchical.ThrowableCollector.execute(ThrowableCollector.java:73)
	at org.junit.jupiter.engine.descriptor.TestMethodTestDescriptor.invokeTestMethod(TestMethodTestDescriptor.java:198)
(100 more lines...)
Collapse Failed EmbeddedServletContainerJarDevelopmentIntegrationTests metaInfResourceFromDependencyIsAvailableViaHttp{RestTemplate}[4] History
Default Job 7 secs
org.junit.jupiter.api.extension.ParameterResolutionException: Failed to resolve parameter [org.springframework.web.client.RestTemplate rest] in method [public void org.springframework.boot.context.embedded.EmbeddedServletContainerJarDevelopmentIntegrationTests.metaInfResourceFromDependencyIsAvailableViaHttp(org.springframework.web.client.RestTemplate)]: org/springframework/http/client/ClientHttpRequestFactory
	at org.junit.jupiter.engine.execution.ExecutableInvoker.resolveParameter(ExecutableInvoker.java:239)
	at org.junit.jupiter.engine.execution.ExecutableInvoker.resolveParameters(ExecutableInvoker.java:183)
	at org.junit.jupiter.engine.execution.ExecutableInvoker.resolveParameters(ExecutableInvoker.java:144)
	at org.junit.jupiter.engine.execution.ExecutableInvoker.invoke(ExecutableInvoker.java:96)
	at org.junit.jupiter.engine.descriptor.TestMethodTestDescriptor.lambda$invokeTestMethod$6(TestMethodTestDescriptor.java:202)
	at org.junit.platform.engine.support.hierarchical.ThrowableCollector.execute(ThrowableCollector.java:73)
	at org.junit.jupiter.engine.descriptor.TestMethodTestDescriptor.invokeTestMethod(TestMethodTestDescriptor.java:198)
(100 more lines...)
Collapse Failed EmbeddedServletContainerJarDevelopmentIntegrationTests metaInfResourceFromDependencyIsAvailableViaServletContext{RestTemplate}[2] History
Default Job 8 secs
org.junit.jupiter.api.extension.ParameterResolutionException: Failed to resolve parameter [org.springframework.web.client.RestTemplate rest] in method [public void org.springframework.boot.context.embedded.EmbeddedServletContainerJarDevelopmentIntegrationTests.metaInfResourceFromDependencyIsAvailableViaServletContext(org.springframework.web.client.RestTemplate)]: org/springframework/http/client/ClientHttpRequestFactory
	at org.junit.jupiter.engine.execution.ExecutableInvoker.resolveParameter(ExecutableInvoker.java:239)
	at org.junit.jupiter.engine.execution.ExecutableInvoker.resolveParameters(ExecutableInvoker.java:183)
	at org.junit.jupiter.engine.execution.ExecutableInvoker.resolveParameters(ExecutableInvoker.java:144)
	at org.junit.jupiter.engine.execution.ExecutableInvoker.invoke(ExecutableInvoker.java:96)
	at org.junit.jupiter.engine.descriptor.TestMethodTestDescriptor.lambda$invokeTestMethod$6(TestMethodTestDescriptor.java:202)
	at org.junit.platform.engine.support.hierarchical.ThrowableCollector.execute(ThrowableCollector.java:73)
	at org.junit.jupiter.engine.descriptor.TestMethodTestDescriptor.invokeTestMethod(TestMethodTestDescriptor.java:198)
(100 more lines...)
Collapse Failed EmbeddedServletContainerJarDevelopmentIntegrationTests metaInfResourceFromDependencyIsAvailableViaHttp{RestTemplate}[3] History
Default Job 7 secs
org.junit.jupiter.api.extension.ParameterResolutionException: Failed to resolve parameter [org.springframework.web.client.RestTemplate rest] in method [public void org.springframework.boot.context.embedded.EmbeddedServletContainerJarDevelopmentIntegrationTests.metaInfResourceFromDependencyIsAvailableViaHttp(org.springframework.web.client.RestTemplate)]: org/springframework/http/client/ClientHttpRequestFactory
	at org.junit.jupiter.engine.execution.ExecutableInvoker.resolveParameter(ExecutableInvoker.java:239)
	at org.junit.jupiter.engine.execution.ExecutableInvoker.resolveParameters(ExecutableInvoker.java:183)
	at org.junit.jupiter.engine.execution.ExecutableInvoker.resolveParameters(ExecutableInvoker.java:144)
	at org.junit.jupiter.engine.execution.ExecutableInvoker.invoke(ExecutableInvoker.java:96)
	at org.junit.jupiter.engine.descriptor.TestMethodTestDescriptor.lambda$invokeTestMethod$6(TestMethodTestDescriptor.java:202)
	at org.junit.platform.engine.support.hierarchical.ThrowableCollector.execute(ThrowableCollector.java:73)
	at org.junit.jupiter.engine.descriptor.TestMethodTestDescriptor.invokeTestMethod(TestMethodTestDescriptor.java:198)
(100 more lines...)
Collapse Failed EmbeddedServletContainerJarDevelopmentIntegrationTests metaInfResourceFromDependencyIsAvailableViaServletContext{RestTemplate}[5] History
Default Job 19 secs
org.junit.jupiter.api.extension.ParameterResolutionException: Failed to resolve parameter [org.springframework.web.client.RestTemplate rest] in method [public void org.springframework.boot.context.embedded.EmbeddedServletContainerJarDevelopmentIntegrationTests.metaInfResourceFromDependencyIsAvailableViaServletContext(org.springframework.web.client.RestTemplate)]: org/springframework/http/client/ClientHttpRequestFactory
	at org.junit.jupiter.engine.execution.ExecutableInvoker.resolveParameter(ExecutableInvoker.java:239)
	at org.junit.jupiter.engine.execution.ExecutableInvoker.resolveParameters(ExecutableInvoker.java:183)
	at org.junit.jupiter.engine.execution.ExecutableInvoker.resolveParameters(ExecutableInvoker.java:144)
	at org.junit.jupiter.engine.execution.ExecutableInvoker.invoke(ExecutableInvoker.java:96)
	at org.junit.jupiter.engine.descriptor.TestMethodTestDescriptor.lambda$invokeTestMethod$6(TestMethodTestDescriptor.java:202)
	at org.junit.platform.engine.support.hierarchical.ThrowableCollector.execute(ThrowableCollector.java:73)
	at org.junit.jupiter.engine.descriptor.TestMethodTestDescriptor.invokeTestMethod(TestMethodTestDescriptor.java:198)
(100 more lines...)
Collapse Failed EmbeddedServletContainerJarDevelopmentIntegrationTests metaInfResourceFromDependencyIsAvailableViaHttp{RestTemplate}[6] History
Default Job 13 secs
org.junit.jupiter.api.extension.ParameterResolutionException: Failed to resolve parameter [org.springframework.web.client.RestTemplate rest] in method [public void org.springframework.boot.context.embedded.EmbeddedServletContainerJarDevelopmentIntegrationTests.metaInfResourceFromDependencyIsAvailableViaHttp(org.springframework.web.client.RestTemplate)]: org/springframework/http/client/ClientHttpRequestFactory
	at org.junit.jupiter.engine.execution.ExecutableInvoker.resolveParameter(ExecutableInvoker.java:239)
	at org.junit.jupiter.engine.execution.ExecutableInvoker.resolveParameters(ExecutableInvoker.java:183)
	at org.junit.jupiter.engine.execution.ExecutableInvoker.resolveParameters(ExecutableInvoker.java:144)
	at org.junit.jupiter.engine.execution.ExecutableInvoker.invoke(ExecutableInvoker.java:96)
	at org.junit.jupiter.engine.descriptor.TestMethodTestDescriptor.lambda$invokeTestMethod$6(TestMethodTestDescriptor.java:202)
	at org.junit.platform.engine.support.hierarchical.ThrowableCollector.execute(ThrowableCollector.java:73)
	at org.junit.jupiter.engine.descriptor.TestMethodTestDescriptor.invokeTestMethod(TestMethodTestDescriptor.java:198)
(100 more lines...)
Collapse Failed EmbeddedServletContainerJarPackagingIntegrationTests nestedMetaInfResourceIsAvailableViaServletContext{RestTemplate}[6] History
Default Job 8 secs
org.junit.jupiter.api.extension.ParameterResolutionException: Failed to resolve parameter [org.springframework.web.client.RestTemplate rest] in method [public void org.springframework.boot.context.embedded.EmbeddedServletContainerJarPackagingIntegrationTests.nestedMetaInfResourceIsAvailableViaServletContext(org.springframework.web.client.RestTemplate)]: org/springframework/http/client/ClientHttpRequestFactory
	at org.junit.jupiter.engine.execution.ExecutableInvoker.resolveParameter(ExecutableInvoker.java:239)
	at org.junit.jupiter.engine.execution.ExecutableInvoker.resolveParameters(ExecutableInvoker.java:183)
	at org.junit.jupiter.engine.execution.ExecutableInvoker.resolveParameters(ExecutableInvoker.java:144)
	at org.junit.jupiter.engine.execution.ExecutableInvoker.invoke(ExecutableInvoker.java:96)
	at org.junit.jupiter.engine.descriptor.TestMethodTestDescriptor.lambda$invokeTestMethod$6(TestMethodTestDescriptor.java:202)
	at org.junit.platform.engine.support.hierarchical.ThrowableCollector.execute(ThrowableCollector.java:73)
	at org.junit.jupiter.engine.descriptor.TestMethodTestDescriptor.invokeTestMethod(TestMethodTestDescriptor.java:198)
(100 more lines...)
Collapse Failed EmbeddedServletContainerJarPackagingIntegrationTests nestedMetaInfResourceIsAvailableViaHttp{RestTemplate}[3] History
Default Job 1 sec
org.junit.jupiter.api.extension.ParameterResolutionException: Failed to resolve parameter [org.springframework.web.client.RestTemplate rest] in method [public void org.springframework.boot.context.embedded.EmbeddedServletContainerJarPackagingIntegrationTests.nestedMetaInfResourceIsAvailableViaHttp(org.springframework.web.client.RestTemplate)]: org/springframework/http/client/ClientHttpRequestFactory
	at org.junit.jupiter.engine.execution.ExecutableInvoker.resolveParameter(ExecutableInvoker.java:239)
	at org.junit.jupiter.engine.execution.ExecutableInvoker.resolveParameters(ExecutableInvoker.java:183)
	at org.junit.jupiter.engine.execution.ExecutableInvoker.resolveParameters(ExecutableInvoker.java:144)
	at org.junit.jupiter.engine.execution.ExecutableInvoker.invoke(ExecutableInvoker.java:96)
	at org.junit.jupiter.engine.descriptor.TestMethodTestDescriptor.lambda$invokeTestMethod$6(TestMethodTestDescriptor.java:202)
	at org.junit.platform.engine.support.hierarchical.ThrowableCollector.execute(ThrowableCollector.java:73)
	at org.junit.jupiter.engine.descriptor.TestMethodTestDescriptor.invokeTestMethod(TestMethodTestDescriptor.java:198)
(100 more lines...)
Collapse Failed EmbeddedServletContainerJarPackagingIntegrationTests nestedMetaInfResourceIsAvailableViaHttp{RestTemplate}[2] History
Default Job 5 secs
org.junit.jupiter.api.extension.ParameterResolutionException: Failed to resolve parameter [org.springframework.web.client.RestTemplate rest] in method [public void org.springframework.boot.context.embedded.EmbeddedServletContainerJarPackagingIntegrationTests.nestedMetaInfResourceIsAvailableViaHttp(org.springframework.web.client.RestTemplate)]: org/springframework/http/client/ClientHttpRequestFactory
	at org.junit.jupiter.engine.execution.ExecutableInvoker.resolveParameter(ExecutableInvoker.java:239)
	at org.junit.jupiter.engine.execution.ExecutableInvoker.resolveParameters(ExecutableInvoker.java:183)
	at org.junit.jupiter.engine.execution.ExecutableInvoker.resolveParameters(ExecutableInvoker.java:144)
	at org.junit.jupiter.engine.execution.ExecutableInvoker.invoke(ExecutableInvoker.java:96)
	at org.junit.jupiter.engine.descriptor.TestMethodTestDescriptor.lambda$invokeTestMethod$6(TestMethodTestDescriptor.java:202)
	at org.junit.platform.engine.support.hierarchical.ThrowableCollector.execute(ThrowableCollector.java:73)
	at org.junit.jupiter.engine.descriptor.TestMethodTestDescriptor.invokeTestMethod(TestMethodTestDescriptor.java:198)
(100 more lines...)
Collapse Failed EmbeddedServletContainerJarPackagingIntegrationTests nestedMetaInfResourceIsAvailableViaServletContext{RestTemplate}[5] History
Default Job 7 secs
org.junit.jupiter.api.extension.ParameterResolutionException: Failed to resolve parameter [org.springframework.web.client.RestTemplate rest] in method [public void org.springframework.boot.context.embedded.EmbeddedServletContainerJarPackagingIntegrationTests.nestedMetaInfResourceIsAvailableViaServletContext(org.springframework.web.client.RestTemplate)]: org/springframework/http/client/ClientHttpRequestFactory
	at org.junit.jupiter.engine.execution.ExecutableInvoker.resolveParameter(ExecutableInvoker.java:239)
	at org.junit.jupiter.engine.execution.ExecutableInvoker.resolveParameters(ExecutableInvoker.java:183)
	at org.junit.jupiter.engine.execution.ExecutableInvoker.resolveParameters(ExecutableInvoker.java:144)
	at org.junit.jupiter.engine.execution.ExecutableInvoker.invoke(ExecutableInvoker.java:96)
	at org.junit.jupiter.engine.descriptor.TestMethodTestDescriptor.lambda$invokeTestMethod$6(TestMethodTestDescriptor.java:202)
	at org.junit.platform.engine.support.hierarchical.ThrowableCollector.execute(ThrowableCollector.java:73)
	at org.junit.jupiter.engine.descriptor.TestMethodTestDescriptor.invokeTestMethod(TestMethodTestDescriptor.java:198)
(100 more lines...)
Collapse Failed EmbeddedServletContainerJarPackagingIntegrationTests launcherIsNotAvailableViaHttp{RestTemplate}[4] History
Default Job 4 secs
org.junit.jupiter.api.extension.ParameterResolutionException: Failed to resolve parameter [org.springframework.web.client.RestTemplate rest] in method [public void org.springframework.boot.context.embedded.EmbeddedServletContainerJarPackagingIntegrationTests.launcherIsNotAvailableViaHttp(org.springframework.web.client.RestTemplate)]: org/springframework/http/client/ClientHttpRequestFactory
	at org.junit.jupiter.engine.execution.ExecutableInvoker.resolveParameter(ExecutableInvoker.java:239)
	at org.junit.jupiter.engine.execution.ExecutableInvoker.resolveParameters(ExecutableInvoker.java:183)
	at org.junit.jupiter.engine.execution.ExecutableInvoker.resolveParameters(ExecutableInvoker.java:144)
	at org.junit.jupiter.engine.execution.ExecutableInvoker.invoke(ExecutableInvoker.java:96)
	at org.junit.jupiter.engine.descriptor.TestMethodTestDescriptor.lambda$invokeTestMethod$6(TestMethodTestDescriptor.java:202)
	at org.junit.platform.engine.support.hierarchical.ThrowableCollector.execute(ThrowableCollector.java:73)
	at org.junit.jupiter.engine.descriptor.TestMethodTestDescriptor.invokeTestMethod(TestMethodTestDescriptor.java:198)
(100 more lines...)
Collapse Failed EmbeddedServletContainerJarPackagingIntegrationTests applicationClassesAreNotAvailableViaHttp{RestTemplate}[4] History
Default Job 4 secs
org.junit.jupiter.api.extension.ParameterResolutionException: Failed to resolve parameter [org.springframework.web.client.RestTemplate rest] in method [public void org.springframework.boot.context.embedded.EmbeddedServletContainerJarPackagingIntegrationTests.applicationClassesAreNotAvailableViaHttp(org.springframework.web.client.RestTemplate)]: org/springframework/http/client/ClientHttpRequestFactory
	at org.junit.jupiter.engine.execution.ExecutableInvoker.resolveParameter(ExecutableInvoker.java:239)
	at org.junit.jupiter.engine.execution.ExecutableInvoker.resolveParameters(ExecutableInvoker.java:183)
	at org.junit.jupiter.engine.execution.ExecutableInvoker.resolveParameters(ExecutableInvoker.java:144)
	at org.junit.jupiter.engine.execution.ExecutableInvoker.invoke(ExecutableInvoker.java:96)
	at org.junit.jupiter.engine.descriptor.TestMethodTestDescriptor.lambda$invokeTestMethod$6(TestMethodTestDescriptor.java:202)
	at org.junit.platform.engine.support.hierarchical.ThrowableCollector.execute(ThrowableCollector.java:73)
	at org.junit.jupiter.engine.descriptor.TestMethodTestDescriptor.invokeTestMethod(TestMethodTestDescriptor.java:198)
(100 more lines...)
Collapse Failed EmbeddedServletContainerJarPackagingIntegrationTests launcherIsNotAvailableViaHttp{RestTemplate}[2] History
Default Job 5 secs
org.junit.jupiter.api.extension.ParameterResolutionException: Failed to resolve parameter [org.springframework.web.client.RestTemplate rest] in method [public void org.springframework.boot.context.embedded.EmbeddedServletContainerJarPackagingIntegrationTests.launcherIsNotAvailableViaHttp(org.springframework.web.client.RestTemplate)]: org/springframework/http/client/ClientHttpRequestFactory
	at org.junit.jupiter.engine.execution.ExecutableInvoker.resolveParameter(ExecutableInvoker.java:239)
	at org.junit.jupiter.engine.execution.ExecutableInvoker.resolveParameters(ExecutableInvoker.java:183)
	at org.junit.jupiter.engine.execution.ExecutableInvoker.resolveParameters(ExecutableInvoker.java:144)
	at org.junit.jupiter.engine.execution.ExecutableInvoker.invoke(ExecutableInvoker.java:96)
	at org.junit.jupiter.engine.descriptor.TestMethodTestDescriptor.lambda$invokeTestMethod$6(TestMethodTestDescriptor.java:202)
	at org.junit.platform.engine.support.hierarchical.ThrowableCollector.execute(ThrowableCollector.java:73)
	at org.junit.jupiter.engine.descriptor.TestMethodTestDescriptor.invokeTestMethod(TestMethodTestDescriptor.java:198)
(100 more lines...)
Collapse Failed EmbeddedServletContainerJarPackagingIntegrationTests nestedMetaInfResourceIsAvailableViaHttp{RestTemplate}[1] History
Default Job 1 sec
org.junit.jupiter.api.extension.ParameterResolutionException: Failed to resolve parameter [org.springframework.web.client.RestTemplate rest] in method [public void org.springframework.boot.context.embedded.EmbeddedServletContainerJarPackagingIntegrationTests.nestedMetaInfResourceIsAvailableViaHttp(org.springframework.web.client.RestTemplate)]: org/springframework/http/client/ClientHttpRequestFactory
	at org.junit.jupiter.engine.execution.ExecutableInvoker.resolveParameter(ExecutableInvoker.java:239)
	at org.junit.jupiter.engine.execution.ExecutableInvoker.resolveParameters(ExecutableInvoker.java:183)
	at org.junit.jupiter.engine.execution.ExecutableInvoker.resolveParameters(ExecutableInvoker.java:144)
	at org.junit.jupiter.engine.execution.ExecutableInvoker.invoke(ExecutableInvoker.java:96)
	at org.junit.jupiter.engine.descriptor.TestMethodTestDescriptor.lambda$invokeTestMethod$6(TestMethodTestDescriptor.java:202)
	at org.junit.platform.engine.support.hierarchical.ThrowableCollector.execute(ThrowableCollector.java:73)
	at org.junit.jupiter.engine.descriptor.TestMethodTestDescriptor.invokeTestMethod(TestMethodTestDescriptor.java:198)
(100 more lines...)
Collapse Failed EmbeddedServletContainerJarPackagingIntegrationTests nestedMetaInfResourceIsAvailableViaServletContext{RestTemplate}[3] History
Default Job 6 secs
org.junit.jupiter.api.extension.ParameterResolutionException: Failed to resolve parameter [org.springframework.web.client.RestTemplate rest] in method [public void org.springframework.boot.context.embedded.EmbeddedServletContainerJarPackagingIntegrationTests.nestedMetaInfResourceIsAvailableViaServletContext(org.springframework.web.client.RestTemplate)]: org/springframework/http/client/ClientHttpRequestFactory
	at org.junit.jupiter.engine.execution.ExecutableInvoker.resolveParameter(ExecutableInvoker.java:239)
	at org.junit.jupiter.engine.execution.ExecutableInvoker.resolveParameters(ExecutableInvoker.java:183)
	at org.junit.jupiter.engine.execution.ExecutableInvoker.resolveParameters(ExecutableInvoker.java:144)
	at org.junit.jupiter.engine.execution.ExecutableInvoker.invoke(ExecutableInvoker.java:96)
	at org.junit.jupiter.engine.descriptor.TestMethodTestDescriptor.lambda$invokeTestMethod$6(TestMethodTestDescriptor.java:202)
	at org.junit.platform.engine.support.hierarchical.ThrowableCollector.execute(ThrowableCollector.java:73)
	at org.junit.jupiter.engine.descriptor.TestMethodTestDescriptor.invokeTestMethod(TestMethodTestDescriptor.java:198)
(100 more lines...)
Collapse Failed EmbeddedServletContainerJarPackagingIntegrationTests applicationClassesAreNotAvailableViaHttp{RestTemplate}[3] History
Default Job 1 sec
org.junit.jupiter.api.extension.ParameterResolutionException: Failed to resolve parameter [org.springframework.web.client.RestTemplate rest] in method [public void org.springframework.boot.context.embedded.EmbeddedServletContainerJarPackagingIntegrationTests.applicationClassesAreNotAvailableViaHttp(org.springframework.web.client.RestTemplate)]: org/springframework/http/client/ClientHttpRequestFactory
	at org.junit.jupiter.engine.execution.ExecutableInvoker.resolveParameter(ExecutableInvoker.java:239)
	at org.junit.jupiter.engine.execution.ExecutableInvoker.resolveParameters(ExecutableInvoker.java:183)
	at org.junit.jupiter.engine.execution.ExecutableInvoker.resolveParameters(ExecutableInvoker.java:144)
	at org.junit.jupiter.engine.execution.ExecutableInvoker.invoke(ExecutableInvoker.java:96)
	at org.junit.jupiter.engine.descriptor.TestMethodTestDescriptor.lambda$invokeTestMethod$6(TestMethodTestDescriptor.java:202)
	at org.junit.platform.engine.support.hierarchical.ThrowableCollector.execute(ThrowableCollector.java:73)
	at org.junit.jupiter.engine.descriptor.TestMethodTestDescriptor.invokeTestMethod(TestMethodTestDescriptor.java:198)
(100 more lines...)
Collapse Failed EmbeddedServletContainerJarPackagingIntegrationTests launcherIsNotAvailableViaHttp{RestTemplate}[1] History
Default Job 1 sec
org.junit.jupiter.api.extension.ParameterResolutionException: Failed to resolve parameter [org.springframework.web.client.RestTemplate rest] in method [public void org.springframework.boot.context.embedded.EmbeddedServletContainerJarPackagingIntegrationTests.launcherIsNotAvailableViaHttp(org.springframework.web.client.RestTemplate)]: org/springframework/http/client/ClientHttpRequestFactory
	at org.junit.jupiter.engine.execution.ExecutableInvoker.resolveParameter(ExecutableInvoker.java:239)
	at org.junit.jupiter.engine.execution.ExecutableInvoker.resolveParameters(ExecutableInvoker.java:183)
	at org.junit.jupiter.engine.execution.ExecutableInvoker.resolveParameters(ExecutableInvoker.java:144)
	at org.junit.jupiter.engine.execution.ExecutableInvoker.invoke(ExecutableInvoker.java:96)
	at org.junit.jupiter.engine.descriptor.TestMethodTestDescriptor.lambda$invokeTestMethod$6(TestMethodTestDescriptor.java:202)
	at org.junit.platform.engine.support.hierarchical.ThrowableCollector.execute(ThrowableCollector.java:73)
	at org.junit.jupiter.engine.descriptor.TestMethodTestDescriptor.invokeTestMethod(TestMethodTestDescriptor.java:198)
(100 more lines...)
Collapse Failed EmbeddedServletContainerJarPackagingIntegrationTests nestedJarIsNotAvailableViaHttp{RestTemplate}[6] History
Default Job 8 secs
org.junit.jupiter.api.extension.ParameterResolutionException: Failed to resolve parameter [org.springframework.web.client.RestTemplate rest] in method [public void org.springframework.boot.context.embedded.EmbeddedServletContainerJarPackagingIntegrationTests.nestedJarIsNotAvailableViaHttp(org.springframework.web.client.RestTemplate)]: org/springframework/http/client/ClientHttpRequestFactory
	at org.junit.jupiter.engine.execution.ExecutableInvoker.resolveParameter(ExecutableInvoker.java:239)
	at org.junit.jupiter.engine.execution.ExecutableInvoker.resolveParameters(ExecutableInvoker.java:183)
	at org.junit.jupiter.engine.execution.ExecutableInvoker.resolveParameters(ExecutableInvoker.java:144)
	at org.junit.jupiter.engine.execution.ExecutableInvoker.invoke(ExecutableInvoker.java:96)
	at org.junit.jupiter.engine.descriptor.TestMethodTestDescriptor.lambda$invokeTestMethod$6(TestMethodTestDescriptor.java:202)
	at org.junit.platform.engine.support.hierarchical.ThrowableCollector.execute(ThrowableCollector.java:73)
	at org.junit.jupiter.engine.descriptor.TestMethodTestDescriptor.invokeTestMethod(TestMethodTestDescriptor.java:198)
(100 more lines...)
Collapse Failed EmbeddedServletContainerJarPackagingIntegrationTests nestedMetaInfResourceIsAvailableViaServletContext{RestTemplate}[4] History
Default Job 4 secs
org.junit.jupiter.api.extension.ParameterResolutionException: Failed to resolve parameter [org.springframework.web.client.RestTemplate rest] in method [public void org.springframework.boot.context.embedded.EmbeddedServletContainerJarPackagingIntegrationTests.nestedMetaInfResourceIsAvailableViaServletContext(org.springframework.web.client.RestTemplate)]: org/springframework/http/client/ClientHttpRequestFactory
	at org.junit.jupiter.engine.execution.ExecutableInvoker.resolveParameter(ExecutableInvoker.java:239)
	at org.junit.jupiter.engine.execution.ExecutableInvoker.resolveParameters(ExecutableInvoker.java:183)
	at org.junit.jupiter.engine.execution.ExecutableInvoker.resolveParameters(ExecutableInvoker.java:144)
	at org.junit.jupiter.engine.execution.ExecutableInvoker.invoke(ExecutableInvoker.java:96)
	at org.junit.jupiter.engine.descriptor.TestMethodTestDescriptor.lambda$invokeTestMethod$6(TestMethodTestDescriptor.java:202)
	at org.junit.platform.engine.support.hierarchical.ThrowableCollector.execute(ThrowableCollector.java:73)
	at org.junit.jupiter.engine.descriptor.TestMethodTestDescriptor.invokeTestMethod(TestMethodTestDescriptor.java:198)
(100 more lines...)
Collapse Failed EmbeddedServletContainerJarPackagingIntegrationTests applicationClassesAreNotAvailableViaHttp{RestTemplate}[5] History
Default Job 1 sec
org.junit.jupiter.api.extension.ParameterResolutionException: Failed to resolve parameter [org.springframework.web.client.RestTemplate rest] in method [public void org.springframework.boot.context.embedded.EmbeddedServletContainerJarPackagingIntegrationTests.applicationClassesAreNotAvailableViaHttp(org.springframework.web.client.RestTemplate)]: org/springframework/http/client/ClientHttpRequestFactory
	at org.junit.jupiter.engine.execution.ExecutableInvoker.resolveParameter(ExecutableInvoker.java:239)
	at org.junit.jupiter.engine.execution.ExecutableInvoker.resolveParameters(ExecutableInvoker.java:183)
	at org.junit.jupiter.engine.execution.ExecutableInvoker.resolveParameters(ExecutableInvoker.java:144)
	at org.junit.jupiter.engine.execution.ExecutableInvoker.invoke(ExecutableInvoker.java:96)
	at org.junit.jupiter.engine.descriptor.TestMethodTestDescriptor.lambda$invokeTestMethod$6(TestMethodTestDescriptor.java:202)
	at org.junit.platform.engine.support.hierarchical.ThrowableCollector.execute(ThrowableCollector.java:73)
	at org.junit.jupiter.engine.descriptor.TestMethodTestDescriptor.invokeTestMethod(TestMethodTestDescriptor.java:198)
(100 more lines...)
Collapse Failed EmbeddedServletContainerJarPackagingIntegrationTests nestedMetaInfResourceIsAvailableViaServletContext{RestTemplate}[1] History
Default Job 7 secs
org.junit.jupiter.api.extension.ParameterResolutionException: Failed to resolve parameter [org.springframework.web.client.RestTemplate rest] in method [public void org.springframework.boot.context.embedded.EmbeddedServletContainerJarPackagingIntegrationTests.nestedMetaInfResourceIsAvailableViaServletContext(org.springframework.web.client.RestTemplate)]: org/springframework/http/client/ClientHttpRequestFactory
	at org.junit.jupiter.engine.execution.ExecutableInvoker.resolveParameter(ExecutableInvoker.java:239)
	at org.junit.jupiter.engine.execution.ExecutableInvoker.resolveParameters(ExecutableInvoker.java:183)
	at org.junit.jupiter.engine.execution.ExecutableInvoker.resolveParameters(ExecutableInvoker.java:144)
	at org.junit.jupiter.engine.execution.ExecutableInvoker.invoke(ExecutableInvoker.java:96)
	at org.junit.jupiter.engine.descriptor.TestMethodTestDescriptor.lambda$invokeTestMethod$6(TestMethodTestDescriptor.java:202)
	at org.junit.platform.engine.support.hierarchical.ThrowableCollector.execute(ThrowableCollector.java:73)
	at org.junit.jupiter.engine.descriptor.TestMethodTestDescriptor.invokeTestMethod(TestMethodTestDescriptor.java:198)
(100 more lines...)
Collapse Failed EmbeddedServletContainerJarPackagingIntegrationTests launcherIsNotAvailableViaHttp{RestTemplate}[3] History
Default Job 1 sec
org.junit.jupiter.api.extension.ParameterResolutionException: Failed to resolve parameter [org.springframework.web.client.RestTemplate rest] in method [public void org.springframework.boot.context.embedded.EmbeddedServletContainerJarPackagingIntegrationTests.launcherIsNotAvailableViaHttp(org.springframework.web.client.RestTemplate)]: org/springframework/http/client/ClientHttpRequestFactory
	at org.junit.jupiter.engine.execution.ExecutableInvoker.resolveParameter(ExecutableInvoker.java:239)
	at org.junit.jupiter.engine.execution.ExecutableInvoker.resolveParameters(ExecutableInvoker.java:183)
	at org.junit.jupiter.engine.execution.ExecutableInvoker.resolveParameters(ExecutableInvoker.java:144)
	at org.junit.jupiter.engine.execution.ExecutableInvoker.invoke(ExecutableInvoker.java:96)
	at org.junit.jupiter.engine.descriptor.TestMethodTestDescriptor.lambda$invokeTestMethod$6(TestMethodTestDescriptor.java:202)
	at org.junit.platform.engine.support.hierarchical.ThrowableCollector.execute(ThrowableCollector.java:73)
	at org.junit.jupiter.engine.descriptor.TestMethodTestDescriptor.invokeTestMethod(TestMethodTestDescriptor.java:198)
(100 more lines...)
Collapse Failed EmbeddedServletContainerJarPackagingIntegrationTests nestedMetaInfResourceIsAvailableViaHttp{RestTemplate}[5] History
Default Job 2 secs
org.junit.jupiter.api.extension.ParameterResolutionException: Failed to resolve parameter [org.springframework.web.client.RestTemplate rest] in method [public void org.springframework.boot.context.embedded.EmbeddedServletContainerJarPackagingIntegrationTests.nestedMetaInfResourceIsAvailableViaHttp(org.springframework.web.client.RestTemplate)]: org/springframework/http/client/ClientHttpRequestFactory
	at org.junit.jupiter.engine.execution.ExecutableInvoker.resolveParameter(ExecutableInvoker.java:239)
	at org.junit.jupiter.engine.execution.ExecutableInvoker.resolveParameters(ExecutableInvoker.java:183)
	at org.junit.jupiter.engine.execution.ExecutableInvoker.resolveParameters(ExecutableInvoker.java:144)
	at org.junit.jupiter.engine.execution.ExecutableInvoker.invoke(ExecutableInvoker.java:96)
	at org.junit.jupiter.engine.descriptor.TestMethodTestDescriptor.lambda$invokeTestMethod$6(TestMethodTestDescriptor.java:202)
	at org.junit.platform.engine.support.hierarchical.ThrowableCollector.execute(ThrowableCollector.java:73)
	at org.junit.jupiter.engine.descriptor.TestMethodTestDescriptor.invokeTestMethod(TestMethodTestDescriptor.java:198)
(100 more lines...)
Collapse Failed EmbeddedServletContainerJarPackagingIntegrationTests nestedJarIsNotAvailableViaHttp{RestTemplate}[4] History
Default Job 4 secs
org.junit.jupiter.api.extension.ParameterResolutionException: Failed to resolve parameter [org.springframework.web.client.RestTemplate rest] in method [public void org.springframework.boot.context.embedded.EmbeddedServletContainerJarPackagingIntegrationTests.nestedJarIsNotAvailableViaHttp(org.springframework.web.client.RestTemplate)]: org/springframework/http/client/ClientHttpRequestFactory
	at org.junit.jupiter.engine.execution.ExecutableInvoker.resolveParameter(ExecutableInvoker.java:239)
	at org.junit.jupiter.engine.execution.ExecutableInvoker.resolveParameters(ExecutableInvoker.java:183)
	at org.junit.jupiter.engine.execution.ExecutableInvoker.resolveParameters(ExecutableInvoker.java:144)
	at org.junit.jupiter.engine.execution.ExecutableInvoker.invoke(ExecutableInvoker.java:96)
	at org.junit.jupiter.engine.descriptor.TestMethodTestDescriptor.lambda$invokeTestMethod$6(TestMethodTestDescriptor.java:202)
	at org.junit.platform.engine.support.hierarchical.ThrowableCollector.execute(ThrowableCollector.java:73)
	at org.junit.jupiter.engine.descriptor.TestMethodTestDescriptor.invokeTestMethod(TestMethodTestDescriptor.java:198)
(100 more lines...)
Collapse Failed EmbeddedServletContainerJarPackagingIntegrationTests applicationClassesAreNotAvailableViaHttp{RestTemplate}[6] History
Default Job 7 secs
org.junit.jupiter.api.extension.ParameterResolutionException: Failed to resolve parameter [org.springframework.web.client.RestTemplate rest] in method [public void org.springframework.boot.context.embedded.EmbeddedServletContainerJarPackagingIntegrationTests.applicationClassesAreNotAvailableViaHttp(org.springframework.web.client.RestTemplate)]: org/springframework/http/client/ClientHttpRequestFactory
	at org.junit.jupiter.engine.execution.ExecutableInvoker.resolveParameter(ExecutableInvoker.java:239)
	at org.junit.jupiter.engine.execution.ExecutableInvoker.resolveParameters(ExecutableInvoker.java:183)
	at org.junit.jupiter.engine.execution.ExecutableInvoker.resolveParameters(ExecutableInvoker.java:144)
	at org.junit.jupiter.engine.execution.ExecutableInvoker.invoke(ExecutableInvoker.java:96)
	at org.junit.jupiter.engine.descriptor.TestMethodTestDescriptor.lambda$invokeTestMethod$6(TestMethodTestDescriptor.java:202)
	at org.junit.platform.engine.support.hierarchical.ThrowableCollector.execute(ThrowableCollector.java:73)
	at org.junit.jupiter.engine.descriptor.TestMethodTestDescriptor.invokeTestMethod(TestMethodTestDescriptor.java:198)
(100 more lines...)
Collapse Failed EmbeddedServletContainerJarPackagingIntegrationTests launcherIsNotAvailableViaHttp{RestTemplate}[5] History
Default Job 1 sec
org.junit.jupiter.api.extension.ParameterResolutionException: Failed to resolve parameter [org.springframework.web.client.RestTemplate rest] in method [public void org.springframework.boot.context.embedded.EmbeddedServletContainerJarPackagingIntegrationTests.launcherIsNotAvailableViaHttp(org.springframework.web.client.RestTemplate)]: org/springframework/http/client/ClientHttpRequestFactory
	at org.junit.jupiter.engine.execution.ExecutableInvoker.resolveParameter(ExecutableInvoker.java:239)
	at org.junit.jupiter.engine.execution.ExecutableInvoker.resolveParameters(ExecutableInvoker.java:183)
	at org.junit.jupiter.engine.execution.ExecutableInvoker.resolveParameters(ExecutableInvoker.java:144)
	at org.junit.jupiter.engine.execution.ExecutableInvoker.invoke(ExecutableInvoker.java:96)
	at org.junit.jupiter.engine.descriptor.TestMethodTestDescriptor.lambda$invokeTestMethod$6(TestMethodTestDescriptor.java:202)
	at org.junit.platform.engine.support.hierarchical.ThrowableCollector.execute(ThrowableCollector.java:73)
	at org.junit.jupiter.engine.descriptor.TestMethodTestDescriptor.invokeTestMethod(TestMethodTestDescriptor.java:198)
(100 more lines...)
Collapse Failed EmbeddedServletContainerJarPackagingIntegrationTests nestedMetaInfResourceIsAvailableViaHttp{RestTemplate}[4] History
Default Job 4 secs
org.junit.jupiter.api.extension.ParameterResolutionException: Failed to resolve parameter [org.springframework.web.client.RestTemplate rest] in method [public void org.springframework.boot.context.embedded.EmbeddedServletContainerJarPackagingIntegrationTests.nestedMetaInfResourceIsAvailableViaHttp(org.springframework.web.client.RestTemplate)]: org/springframework/http/client/ClientHttpRequestFactory
	at org.junit.jupiter.engine.execution.ExecutableInvoker.resolveParameter(ExecutableInvoker.java:239)
	at org.junit.jupiter.engine.execution.ExecutableInvoker.resolveParameters(ExecutableInvoker.java:183)
	at org.junit.jupiter.engine.execution.ExecutableInvoker.resolveParameters(ExecutableInvoker.java:144)
	at org.junit.jupiter.engine.execution.ExecutableInvoker.invoke(ExecutableInvoker.java:96)
	at org.junit.jupiter.engine.descriptor.TestMethodTestDescriptor.lambda$invokeTestMethod$6(TestMethodTestDescriptor.java:202)
	at org.junit.platform.engine.support.hierarchical.ThrowableCollector.execute(ThrowableCollector.java:73)
	at org.junit.jupiter.engine.descriptor.TestMethodTestDescriptor.invokeTestMethod(TestMethodTestDescriptor.java:198)
(100 more lines...)
Collapse Failed EmbeddedServletContainerJarPackagingIntegrationTests applicationClassesAreNotAvailableViaHttp{RestTemplate}[1] History
Default Job 1 sec
org.junit.jupiter.api.extension.ParameterResolutionException: Failed to resolve parameter [org.springframework.web.client.RestTemplate rest] in method [public void org.springframework.boot.context.embedded.EmbeddedServletContainerJarPackagingIntegrationTests.applicationClassesAreNotAvailableViaHttp(org.springframework.web.client.RestTemplate)]: org/springframework/http/client/ClientHttpRequestFactory
	at org.junit.jupiter.engine.execution.ExecutableInvoker.resolveParameter(ExecutableInvoker.java:239)
	at org.junit.jupiter.engine.execution.ExecutableInvoker.resolveParameters(ExecutableInvoker.java:183)
	at org.junit.jupiter.engine.execution.ExecutableInvoker.resolveParameters(ExecutableInvoker.java:144)
	at org.junit.jupiter.engine.execution.ExecutableInvoker.invoke(ExecutableInvoker.java:96)
	at org.junit.jupiter.engine.descriptor.TestMethodTestDescriptor.lambda$invokeTestMethod$6(TestMethodTestDescriptor.java:202)
	at org.junit.platform.engine.support.hierarchical.ThrowableCollector.execute(ThrowableCollector.java:73)
	at org.junit.jupiter.engine.descriptor.TestMethodTestDescriptor.invokeTestMethod(TestMethodTestDescriptor.java:198)
(100 more lines...)
Collapse Failed EmbeddedServletContainerJarPackagingIntegrationTests nestedJarIsNotAvailableViaHttp{RestTemplate}[2] History
Default Job 5 secs
org.junit.jupiter.api.extension.ParameterResolutionException: Failed to resolve parameter [org.springframework.web.client.RestTemplate rest] in method [public void org.springframework.boot.context.embedded.EmbeddedServletContainerJarPackagingIntegrationTests.nestedJarIsNotAvailableViaHttp(org.springframework.web.client.RestTemplate)]: org/springframework/http/client/ClientHttpRequestFactory
	at org.junit.jupiter.engine.execution.ExecutableInvoker.resolveParameter(ExecutableInvoker.java:239)
	at org.junit.jupiter.engine.execution.ExecutableInvoker.resolveParameters(ExecutableInvoker.java:183)
	at org.junit.jupiter.engine.execution.ExecutableInvoker.resolveParameters(ExecutableInvoker.java:144)
	at org.junit.jupiter.engine.execution.ExecutableInvoker.invoke(ExecutableInvoker.java:96)
	at org.junit.jupiter.engine.descriptor.TestMethodTestDescriptor.lambda$invokeTestMethod$6(TestMethodTestDescriptor.java:202)
	at org.junit.platform.engine.support.hierarchical.ThrowableCollector.execute(ThrowableCollector.java:73)
	at org.junit.jupiter.engine.descriptor.TestMethodTestDescriptor.invokeTestMethod(TestMethodTestDescriptor.java:198)
(100 more lines...)
Collapse Failed EmbeddedServletContainerJarPackagingIntegrationTests launcherIsNotAvailableViaHttp{RestTemplate}[6] History
Default Job 8 secs
org.junit.jupiter.api.extension.ParameterResolutionException: Failed to resolve parameter [org.springframework.web.client.RestTemplate rest] in method [public void org.springframework.boot.context.embedded.EmbeddedServletContainerJarPackagingIntegrationTests.launcherIsNotAvailableViaHttp(org.springframework.web.client.RestTemplate)]: org/springframework/http/client/ClientHttpRequestFactory
	at org.junit.jupiter.engine.execution.ExecutableInvoker.resolveParameter(ExecutableInvoker.java:239)
	at org.junit.jupiter.engine.execution.ExecutableInvoker.resolveParameters(ExecutableInvoker.java:183)
	at org.junit.jupiter.engine.execution.ExecutableInvoker.resolveParameters(ExecutableInvoker.java:144)
	at org.junit.jupiter.engine.execution.ExecutableInvoker.invoke(ExecutableInvoker.java:96)
	at org.junit.jupiter.engine.descriptor.TestMethodTestDescriptor.lambda$invokeTestMethod$6(TestMethodTestDescriptor.java:202)
	at org.junit.platform.engine.support.hierarchical.ThrowableCollector.execute(ThrowableCollector.java:73)
	at org.junit.jupiter.engine.descriptor.TestMethodTestDescriptor.invokeTestMethod(TestMethodTestDescriptor.java:198)
(100 more lines...)
Collapse Failed EmbeddedServletContainerJarPackagingIntegrationTests nestedJarIsNotAvailableViaHttp{RestTemplate}[1] History
Default Job 1 sec
org.junit.jupiter.api.extension.ParameterResolutionException: Failed to resolve parameter [org.springframework.web.client.RestTemplate rest] in method [public void org.springframework.boot.context.embedded.EmbeddedServletContainerJarPackagingIntegrationTests.nestedJarIsNotAvailableViaHttp(org.springframework.web.client.RestTemplate)]: org/springframework/http/client/ClientHttpRequestFactory
	at org.junit.jupiter.engine.execution.ExecutableInvoker.resolveParameter(ExecutableInvoker.java:239)
	at org.junit.jupiter.engine.execution.ExecutableInvoker.resolveParameters(ExecutableInvoker.java:183)
	at org.junit.jupiter.engine.execution.ExecutableInvoker.resolveParameters(ExecutableInvoker.java:144)
	at org.junit.jupiter.engine.execution.ExecutableInvoker.invoke(ExecutableInvoker.java:96)
	at org.junit.jupiter.engine.descriptor.TestMethodTestDescriptor.lambda$invokeTestMethod$6(TestMethodTestDescriptor.java:202)
	at org.junit.platform.engine.support.hierarchical.ThrowableCollector.execute(ThrowableCollector.java:73)
	at org.junit.jupiter.engine.descriptor.TestMethodTestDescriptor.invokeTestMethod(TestMethodTestDescriptor.java:198)
(100 more lines...)
Collapse Failed EmbeddedServletContainerJarPackagingIntegrationTests nestedMetaInfResourceIsAvailableViaHttp{RestTemplate}[6] History
Default Job 8 secs
org.junit.jupiter.api.extension.ParameterResolutionException: Failed to resolve parameter [org.springframework.web.client.RestTemplate rest] in method [public void org.springframework.boot.context.embedded.EmbeddedServletContainerJarPackagingIntegrationTests.nestedMetaInfResourceIsAvailableViaHttp(org.springframework.web.client.RestTemplate)]: org/springframework/http/client/ClientHttpRequestFactory
	at org.junit.jupiter.engine.execution.ExecutableInvoker.resolveParameter(ExecutableInvoker.java:239)
	at org.junit.jupiter.engine.execution.ExecutableInvoker.resolveParameters(ExecutableInvoker.java:183)
	at org.junit.jupiter.engine.execution.ExecutableInvoker.resolveParameters(ExecutableInvoker.java:144)
	at org.junit.jupiter.engine.execution.ExecutableInvoker.invoke(ExecutableInvoker.java:96)
	at org.junit.jupiter.engine.descriptor.TestMethodTestDescriptor.lambda$invokeTestMethod$6(TestMethodTestDescriptor.java:202)
	at org.junit.platform.engine.support.hierarchical.ThrowableCollector.execute(ThrowableCollector.java:73)
	at org.junit.jupiter.engine.descriptor.TestMethodTestDescriptor.invokeTestMethod(TestMethodTestDescriptor.java:198)
(100 more lines...)
Collapse Failed EmbeddedServletContainerJarPackagingIntegrationTests nestedMetaInfResourceIsAvailableViaServletContext{RestTemplate}[2] History
Default Job 5 secs
org.junit.jupiter.api.extension.ParameterResolutionException: Failed to resolve parameter [org.springframework.web.client.RestTemplate rest] in method [public void org.springframework.boot.context.embedded.EmbeddedServletContainerJarPackagingIntegrationTests.nestedMetaInfResourceIsAvailableViaServletContext(org.springframework.web.client.RestTemplate)]: org/springframework/http/client/ClientHttpRequestFactory
	at org.junit.jupiter.engine.execution.ExecutableInvoker.resolveParameter(ExecutableInvoker.java:239)
	at org.junit.jupiter.engine.execution.ExecutableInvoker.resolveParameters(ExecutableInvoker.java:183)
	at org.junit.jupiter.engine.execution.ExecutableInvoker.resolveParameters(ExecutableInvoker.java:144)
	at org.junit.jupiter.engine.execution.ExecutableInvoker.invoke(ExecutableInvoker.java:96)
	at org.junit.jupiter.engine.descriptor.TestMethodTestDescriptor.lambda$invokeTestMethod$6(TestMethodTestDescriptor.java:202)
	at org.junit.platform.engine.support.hierarchical.ThrowableCollector.execute(ThrowableCollector.java:73)
	at org.junit.jupiter.engine.descriptor.TestMethodTestDescriptor.invokeTestMethod(TestMethodTestDescriptor.java:198)
(100 more lines...)
Collapse Failed EmbeddedServletContainerJarPackagingIntegrationTests nestedJarIsNotAvailableViaHttp{RestTemplate}[3] History
Default Job 1 sec
org.junit.jupiter.api.extension.ParameterResolutionException: Failed to resolve parameter [org.springframework.web.client.RestTemplate rest] in method [public void org.springframework.boot.context.embedded.EmbeddedServletContainerJarPackagingIntegrationTests.nestedJarIsNotAvailableViaHttp(org.springframework.web.client.RestTemplate)]: org/springframework/http/client/ClientHttpRequestFactory
	at org.junit.jupiter.engine.execution.ExecutableInvoker.resolveParameter(ExecutableInvoker.java:239)
	at org.junit.jupiter.engine.execution.ExecutableInvoker.resolveParameters(ExecutableInvoker.java:183)
	at org.junit.jupiter.engine.execution.ExecutableInvoker.resolveParameters(ExecutableInvoker.java:144)
	at org.junit.jupiter.engine.execution.ExecutableInvoker.invoke(ExecutableInvoker.java:96)
	at org.junit.jupiter.engine.descriptor.TestMethodTestDescriptor.lambda$invokeTestMethod$6(TestMethodTestDescriptor.java:202)
	at org.junit.platform.engine.support.hierarchical.ThrowableCollector.execute(ThrowableCollector.java:73)
	at org.junit.jupiter.engine.descriptor.TestMethodTestDescriptor.invokeTestMethod(TestMethodTestDescriptor.java:198)
(100 more lines...)
Collapse Failed EmbeddedServletContainerJarPackagingIntegrationTests applicationClassesAreNotAvailableViaHttp{RestTemplate}[2] History
Default Job 5 secs
org.junit.jupiter.api.extension.ParameterResolutionException: Failed to resolve parameter [org.springframework.web.client.RestTemplate rest] in method [public void org.springframework.boot.context.embedded.EmbeddedServletContainerJarPackagingIntegrationTests.applicationClassesAreNotAvailableViaHttp(org.springframework.web.client.RestTemplate)]: org/springframework/http/client/ClientHttpRequestFactory
	at org.junit.jupiter.engine.execution.ExecutableInvoker.resolveParameter(ExecutableInvoker.java:239)
	at org.junit.jupiter.engine.execution.ExecutableInvoker.resolveParameters(ExecutableInvoker.java:183)
	at org.junit.jupiter.engine.execution.ExecutableInvoker.resolveParameters(ExecutableInvoker.java:144)
	at org.junit.jupiter.engine.execution.ExecutableInvoker.invoke(ExecutableInvoker.java:96)
	at org.junit.jupiter.engine.descriptor.TestMethodTestDescriptor.lambda$invokeTestMethod$6(TestMethodTestDescriptor.java:202)
	at org.junit.platform.engine.support.hierarchical.ThrowableCollector.execute(ThrowableCollector.java:73)
	at org.junit.jupiter.engine.descriptor.TestMethodTestDescriptor.invokeTestMethod(TestMethodTestDescriptor.java:198)
(100 more lines...)
Collapse Failed EmbeddedServletContainerJarPackagingIntegrationTests nestedJarIsNotAvailableViaHttp{RestTemplate}[5] History
Default Job 2 secs
org.junit.jupiter.api.extension.ParameterResolutionException: Failed to resolve parameter [org.springframework.web.client.RestTemplate rest] in method [public void org.springframework.boot.context.embedded.EmbeddedServletContainerJarPackagingIntegrationTests.nestedJarIsNotAvailableViaHttp(org.springframework.web.client.RestTemplate)]: org/springframework/http/client/ClientHttpRequestFactory
	at org.junit.jupiter.engine.execution.ExecutableInvoker.resolveParameter(ExecutableInvoker.java:239)
	at org.junit.jupiter.engine.execution.ExecutableInvoker.resolveParameters(ExecutableInvoker.java:183)
	at org.junit.jupiter.engine.execution.ExecutableInvoker.resolveParameters(ExecutableInvoker.java:144)
	at org.junit.jupiter.engine.execution.ExecutableInvoker.invoke(ExecutableInvoker.java:96)
	at org.junit.jupiter.engine.descriptor.TestMethodTestDescriptor.lambda$invokeTestMethod$6(TestMethodTestDescriptor.java:202)
	at org.junit.platform.engine.support.hierarchical.ThrowableCollector.execute(ThrowableCollector.java:73)
	at org.junit.jupiter.engine.descriptor.TestMethodTestDescriptor.invokeTestMethod(TestMethodTestDescriptor.java:198)
(100 more lines...)
Collapse Failed EmbeddedServletContainerWarDevelopmentIntegrationTests metaInfResourceFromDependencyIsAvailableViaServletContext{RestTemplate}[6] History
Default Job 13 secs
org.junit.jupiter.api.extension.ParameterResolutionException: Failed to resolve parameter [org.springframework.web.client.RestTemplate rest] in method [public void org.springframework.boot.context.embedded.EmbeddedServletContainerWarDevelopmentIntegrationTests.metaInfResourceFromDependencyIsAvailableViaServletContext(org.springframework.web.client.RestTemplate)]: org/springframework/http/client/ClientHttpRequestFactory
	at org.junit.jupiter.engine.execution.ExecutableInvoker.resolveParameter(ExecutableInvoker.java:239)
	at org.junit.jupiter.engine.execution.ExecutableInvoker.resolveParameters(ExecutableInvoker.java:183)
	at org.junit.jupiter.engine.execution.ExecutableInvoker.resolveParameters(ExecutableInvoker.java:144)
	at org.junit.jupiter.engine.execution.ExecutableInvoker.invoke(ExecutableInvoker.java:96)
	at org.junit.jupiter.engine.descriptor.TestMethodTestDescriptor.lambda$invokeTestMethod$6(TestMethodTestDescriptor.java:202)
	at org.junit.platform.engine.support.hierarchical.ThrowableCollector.execute(ThrowableCollector.java:73)
	at org.junit.jupiter.engine.descriptor.TestMethodTestDescriptor.invokeTestMethod(TestMethodTestDescriptor.java:198)
(100 more lines...)
Collapse Failed EmbeddedServletContainerWarDevelopmentIntegrationTests loaderClassesAreNotAvailableViaResourcePaths{RestTemplate}[4] History
Default Job 7 secs
org.junit.jupiter.api.extension.ParameterResolutionException: Failed to resolve parameter [org.springframework.web.client.RestTemplate rest] in method [public void org.springframework.boot.context.embedded.EmbeddedServletContainerWarDevelopmentIntegrationTests.loaderClassesAreNotAvailableViaResourcePaths(org.springframework.web.client.RestTemplate)]: org/springframework/http/client/ClientHttpRequestFactory
	at org.junit.jupiter.engine.execution.ExecutableInvoker.resolveParameter(ExecutableInvoker.java:239)
	at org.junit.jupiter.engine.execution.ExecutableInvoker.resolveParameters(ExecutableInvoker.java:183)
	at org.junit.jupiter.engine.execution.ExecutableInvoker.resolveParameters(ExecutableInvoker.java:144)
	at org.junit.jupiter.engine.execution.ExecutableInvoker.invoke(ExecutableInvoker.java:96)
	at org.junit.jupiter.engine.descriptor.TestMethodTestDescriptor.lambda$invokeTestMethod$6(TestMethodTestDescriptor.java:202)
	at org.junit.platform.engine.support.hierarchical.ThrowableCollector.execute(ThrowableCollector.java:73)
	at org.junit.jupiter.engine.descriptor.TestMethodTestDescriptor.invokeTestMethod(TestMethodTestDescriptor.java:198)
(100 more lines...)
Collapse Failed EmbeddedServletContainerWarDevelopmentIntegrationTests metaInfResourceFromDependencyIsAvailableViaHttp{RestTemplate}[1] History
Default Job 7 secs
org.junit.jupiter.api.extension.ParameterResolutionException: Failed to resolve parameter [org.springframework.web.client.RestTemplate rest] in method [public void org.springframework.boot.context.embedded.EmbeddedServletContainerWarDevelopmentIntegrationTests.metaInfResourceFromDependencyIsAvailableViaHttp(org.springframework.web.client.RestTemplate)]: org/springframework/http/client/ClientHttpRequestFactory
	at org.junit.jupiter.engine.execution.ExecutableInvoker.resolveParameter(ExecutableInvoker.java:239)
	at org.junit.jupiter.engine.execution.ExecutableInvoker.resolveParameters(ExecutableInvoker.java:183)
	at org.junit.jupiter.engine.execution.ExecutableInvoker.resolveParameters(ExecutableInvoker.java:144)
	at org.junit.jupiter.engine.execution.ExecutableInvoker.invoke(ExecutableInvoker.java:96)
	at org.junit.jupiter.engine.descriptor.TestMethodTestDescriptor.lambda$invokeTestMethod$6(TestMethodTestDescriptor.java:202)
	at org.junit.platform.engine.support.hierarchical.ThrowableCollector.execute(ThrowableCollector.java:73)
	at org.junit.jupiter.engine.descriptor.TestMethodTestDescriptor.invokeTestMethod(TestMethodTestDescriptor.java:198)
(100 more lines...)
Collapse Failed EmbeddedServletContainerWarDevelopmentIntegrationTests webappResourcesAreAvailableViaHttp{RestTemplate}[6] History
Default Job 13 secs
org.junit.jupiter.api.extension.ParameterResolutionException: Failed to resolve parameter [org.springframework.web.client.RestTemplate rest] in method [public void org.springframework.boot.context.embedded.EmbeddedServletContainerWarDevelopmentIntegrationTests.webappResourcesAreAvailableViaHttp(org.springframework.web.client.RestTemplate)]: org/springframework/http/client/ClientHttpRequestFactory
	at org.junit.jupiter.engine.execution.ExecutableInvoker.resolveParameter(ExecutableInvoker.java:239)
	at org.junit.jupiter.engine.execution.ExecutableInvoker.resolveParameters(ExecutableInvoker.java:183)
	at org.junit.jupiter.engine.execution.ExecutableInvoker.resolveParameters(ExecutableInvoker.java:144)
	at org.junit.jupiter.engine.execution.ExecutableInvoker.invoke(ExecutableInvoker.java:96)
	at org.junit.jupiter.engine.descriptor.TestMethodTestDescriptor.lambda$invokeTestMethod$6(TestMethodTestDescriptor.java:202)
	at org.junit.platform.engine.support.hierarchical.ThrowableCollector.execute(ThrowableCollector.java:73)
	at org.junit.jupiter.engine.descriptor.TestMethodTestDescriptor.invokeTestMethod(TestMethodTestDescriptor.java:198)
(100 more lines...)
Collapse Failed EmbeddedServletContainerWarDevelopmentIntegrationTests metaInfResourceFromDependencyIsAvailableViaServletContext{RestTemplate}[5] History
Default Job 13 secs
org.junit.jupiter.api.extension.ParameterResolutionException: Failed to resolve parameter [org.springframework.web.client.RestTemplate rest] in method [public void org.springframework.boot.context.embedded.EmbeddedServletContainerWarDevelopmentIntegrationTests.metaInfResourceFromDependencyIsAvailableViaServletContext(org.springframework.web.client.RestTemplate)]: org/springframework/http/client/ClientHttpRequestFactory
	at org.junit.jupiter.engine.execution.ExecutableInvoker.resolveParameter(ExecutableInvoker.java:239)
	at org.junit.jupiter.engine.execution.ExecutableInvoker.resolveParameters(ExecutableInvoker.java:183)
	at org.junit.jupiter.engine.execution.ExecutableInvoker.resolveParameters(ExecutableInvoker.java:144)
	at org.junit.jupiter.engine.execution.ExecutableInvoker.invoke(ExecutableInvoker.java:96)
	at org.junit.jupiter.engine.descriptor.TestMethodTestDescriptor.lambda$invokeTestMethod$6(TestMethodTestDescriptor.java:202)
	at org.junit.platform.engine.support.hierarchical.ThrowableCollector.execute(ThrowableCollector.java:73)
	at org.junit.jupiter.engine.descriptor.TestMethodTestDescriptor.invokeTestMethod(TestMethodTestDescriptor.java:198)
(100 more lines...)
Collapse Failed EmbeddedServletContainerWarDevelopmentIntegrationTests loaderClassesAreNotAvailableViaResourcePaths{RestTemplate}[3] History
Default Job 7 secs
org.junit.jupiter.api.extension.ParameterResolutionException: Failed to resolve parameter [org.springframework.web.client.RestTemplate rest] in method [public void org.springframework.boot.context.embedded.EmbeddedServletContainerWarDevelopmentIntegrationTests.loaderClassesAreNotAvailableViaResourcePaths(org.springframework.web.client.RestTemplate)]: org/springframework/http/client/ClientHttpRequestFactory
	at org.junit.jupiter.engine.execution.ExecutableInvoker.resolveParameter(ExecutableInvoker.java:239)
	at org.junit.jupiter.engine.execution.ExecutableInvoker.resolveParameters(ExecutableInvoker.java:183)
	at org.junit.jupiter.engine.execution.ExecutableInvoker.resolveParameters(ExecutableInvoker.java:144)
	at org.junit.jupiter.engine.execution.ExecutableInvoker.invoke(ExecutableInvoker.java:96)
	at org.junit.jupiter.engine.descriptor.TestMethodTestDescriptor.lambda$invokeTestMethod$6(TestMethodTestDescriptor.java:202)
	at org.junit.platform.engine.support.hierarchical.ThrowableCollector.execute(ThrowableCollector.java:73)
	at org.junit.jupiter.engine.descriptor.TestMethodTestDescriptor.invokeTestMethod(TestMethodTestDescriptor.java:198)
(100 more lines...)
Collapse Failed EmbeddedServletContainerWarDevelopmentIntegrationTests loaderClassesAreNotAvailableViaResourcePaths{RestTemplate}[5] History
Default Job 13 secs
org.junit.jupiter.api.extension.ParameterResolutionException: Failed to resolve parameter [org.springframework.web.client.RestTemplate rest] in method [public void org.springframework.boot.context.embedded.EmbeddedServletContainerWarDevelopmentIntegrationTests.loaderClassesAreNotAvailableViaResourcePaths(org.springframework.web.client.RestTemplate)]: org/springframework/http/client/ClientHttpRequestFactory
	at org.junit.jupiter.engine.execution.ExecutableInvoker.resolveParameter(ExecutableInvoker.java:239)
	at org.junit.jupiter.engine.execution.ExecutableInvoker.resolveParameters(ExecutableInvoker.java:183)
	at org.junit.jupiter.engine.execution.ExecutableInvoker.resolveParameters(ExecutableInvoker.java:144)
	at org.junit.jupiter.engine.execution.ExecutableInvoker.invoke(ExecutableInvoker.java:96)
	at org.junit.jupiter.engine.descriptor.TestMethodTestDescriptor.lambda$invokeTestMethod$6(TestMethodTestDescriptor.java:202)
	at org.junit.platform.engine.support.hierarchical.ThrowableCollector.execute(ThrowableCollector.java:73)
	at org.junit.jupiter.engine.descriptor.TestMethodTestDescriptor.invokeTestMethod(TestMethodTestDescriptor.java:198)
(100 more lines...)
Collapse Failed EmbeddedServletContainerWarDevelopmentIntegrationTests metaInfResourceFromDependencyIsAvailableViaHttp{RestTemplate}[6] History
Default Job 13 secs
org.junit.jupiter.api.extension.ParameterResolutionException: Failed to resolve parameter [org.springframework.web.client.RestTemplate rest] in method [public void org.springframework.boot.context.embedded.EmbeddedServletContainerWarDevelopmentIntegrationTests.metaInfResourceFromDependencyIsAvailableViaHttp(org.springframework.web.client.RestTemplate)]: org/springframework/http/client/ClientHttpRequestFactory
	at org.junit.jupiter.engine.execution.ExecutableInvoker.resolveParameter(ExecutableInvoker.java:239)
	at org.junit.jupiter.engine.execution.ExecutableInvoker.resolveParameters(ExecutableInvoker.java:183)
	at org.junit.jupiter.engine.execution.ExecutableInvoker.resolveParameters(ExecutableInvoker.java:144)
	at org.junit.jupiter.engine.execution.ExecutableInvoker.invoke(ExecutableInvoker.java:96)
	at org.junit.jupiter.engine.descriptor.TestMethodTestDescriptor.lambda$invokeTestMethod$6(TestMethodTestDescriptor.java:202)
	at org.junit.platform.engine.support.hierarchical.ThrowableCollector.execute(ThrowableCollector.java:73)
	at org.junit.jupiter.engine.descriptor.TestMethodTestDescriptor.invokeTestMethod(TestMethodTestDescriptor.java:198)
(100 more lines...)