Build #1,680

Spring Boot on Windows

Build: #1680 failed Scheduled with changes by 5 people

Build result summary

Details

Completed
Duration
301 minutes
Labels
None
Agent
bamboo-2k16-02
Revision
b444c3c545eae18f5227b15fc8564eb7db7882b9 b444c3c545eae18f5227b15fc8564eb7db7882b9
Total tests
9940
Fixed in
#1682 (Scheduled with changes by 4 people)

Tests

Responsible

Code commits

Author Commit Message Commit date
Madhura Bhave Madhura Bhave b444c3c545eae18f5227b15fc8564eb7db7882b9 b444c3c545eae18f5227b15fc8564eb7db7882b9 Fix asciidoc section ids
Madhura Bhave Madhura Bhave 2964286275aaa3cb3e888b0b2ae393ba0a1da23b 2964286275aaa3cb3e888b0b2ae393ba0a1da23b Merge branch '2.1.x'
Madhura Bhave Madhura Bhave d906f962582301d421222bb83cdf679172eb55e0 m d906f962582301d421222bb83cdf679172eb55e0 Always get latest snapshots for windows build
Phil Webb Phil Webb ea5b624a39ced1c52573e84efc4fe0227f42789c ea5b624a39ced1c52573e84efc4fe0227f42789c Polish
Madhura Bhave Madhura Bhave 6e1fb5a1c69ed760b99b69fca70ea2e20d2d8e75 6e1fb5a1c69ed760b99b69fca70ea2e20d2d8e75 Merge pull request #17515 from htztomic
* pr/17515:
  Polish "Add support for configuring logging groups"
  Add support for configuring logging groups via endpoint

Closes gh-17515

Tests

New test failures 112
Status Test View job Duration
Collapse Failed EmbeddedServletContainerJarDevelopmentIntegrationTests metaInfResourceFromDependencyIsAvailableViaHttp{RestTemplate}[1] History
Default Job < 1 sec
java.lang.NoClassDefFoundError: org/springframework/util/FileSystemUtils
	at org.springframework.boot.context.embedded.BootRunApplicationLauncher.explodeArchive(BootRunApplicationLauncher.java:119)
	at org.springframework.boot.context.embedded.BootRunApplicationLauncher.getArguments(BootRunApplicationLauncher.java:54)
	at org.springframework.boot.context.embedded.AbstractApplicationLauncher.startApplication(AbstractApplicationLauncher.java:83)
	at org.springframework.boot.context.embedded.AbstractApplicationLauncher.beforeEach(AbstractApplicationLauncher.java:63)
	at org.junit.jupiter.engine.descriptor.TestMethodTestDescriptor.lambda$invokeBeforeEachCallbacks$1(TestMethodTestDescriptor.java:151)
	at org.junit.jupiter.engine.descriptor.TestMethodTestDescriptor.lambda$invokeBeforeMethodsOrCallbacksUntilExceptionOccurs$5(TestMethodTestDescriptor.java:187)
	at org.junit.platform.engine.support.hierarchical.ThrowableCollector.execute(ThrowableCollector.java:73)
(103 more lines...)
Collapse Failed EmbeddedServletContainerJarDevelopmentIntegrationTests metaInfResourceFromDependencyIsAvailableViaServletContext{RestTemplate}[1] History
Default Job 14 secs
java.lang.NoClassDefFoundError: org/springframework/util/FileSystemUtils
	at org.springframework.boot.context.embedded.BootRunApplicationLauncher.explodeArchive(BootRunApplicationLauncher.java:119)
	at org.springframework.boot.context.embedded.BootRunApplicationLauncher.getArguments(BootRunApplicationLauncher.java:54)
	at org.springframework.boot.context.embedded.AbstractApplicationLauncher.startApplication(AbstractApplicationLauncher.java:83)
	at org.springframework.boot.context.embedded.AbstractApplicationLauncher.beforeEach(AbstractApplicationLauncher.java:63)
	at org.junit.jupiter.engine.descriptor.TestMethodTestDescriptor.lambda$invokeBeforeEachCallbacks$1(TestMethodTestDescriptor.java:151)
	at org.junit.jupiter.engine.descriptor.TestMethodTestDescriptor.lambda$invokeBeforeMethodsOrCallbacksUntilExceptionOccurs$5(TestMethodTestDescriptor.java:187)
	at org.junit.platform.engine.support.hierarchical.ThrowableCollector.execute(ThrowableCollector.java:73)
(109 more lines...)
Collapse Failed EmbeddedServletContainerJarDevelopmentIntegrationTests metaInfResourceFromDependencyIsAvailableViaServletContext{RestTemplate}[2] History
Default Job < 1 sec
java.lang.NoClassDefFoundError: org/springframework/util/FileSystemUtils
	at org.springframework.boot.context.embedded.IdeApplicationLauncher.explodeArchive(IdeApplicationLauncher.java:139)
	at org.springframework.boot.context.embedded.IdeApplicationLauncher.getArguments(IdeApplicationLauncher.java:64)
	at org.springframework.boot.context.embedded.AbstractApplicationLauncher.startApplication(AbstractApplicationLauncher.java:83)
	at org.springframework.boot.context.embedded.AbstractApplicationLauncher.beforeEach(AbstractApplicationLauncher.java:63)
	at org.junit.jupiter.engine.descriptor.TestMethodTestDescriptor.lambda$invokeBeforeEachCallbacks$1(TestMethodTestDescriptor.java:151)
	at org.junit.jupiter.engine.descriptor.TestMethodTestDescriptor.lambda$invokeBeforeMethodsOrCallbacksUntilExceptionOccurs$5(TestMethodTestDescriptor.java:187)
	at org.junit.platform.engine.support.hierarchical.ThrowableCollector.execute(ThrowableCollector.java:73)
(109 more lines...)
Collapse Failed EmbeddedServletContainerJarDevelopmentIntegrationTests metaInfResourceFromDependencyIsAvailableViaServletContext{RestTemplate}[5] History
Default Job 5 secs
java.lang.NoClassDefFoundError: org/springframework/util/FileSystemUtils
	at org.springframework.boot.context.embedded.BootRunApplicationLauncher.explodeArchive(BootRunApplicationLauncher.java:119)
	at org.springframework.boot.context.embedded.BootRunApplicationLauncher.getArguments(BootRunApplicationLauncher.java:54)
	at org.springframework.boot.context.embedded.AbstractApplicationLauncher.startApplication(AbstractApplicationLauncher.java:83)
	at org.springframework.boot.context.embedded.AbstractApplicationLauncher.beforeEach(AbstractApplicationLauncher.java:63)
	at org.junit.jupiter.engine.descriptor.TestMethodTestDescriptor.lambda$invokeBeforeEachCallbacks$1(TestMethodTestDescriptor.java:151)
	at org.junit.jupiter.engine.descriptor.TestMethodTestDescriptor.lambda$invokeBeforeMethodsOrCallbacksUntilExceptionOccurs$5(TestMethodTestDescriptor.java:187)
	at org.junit.platform.engine.support.hierarchical.ThrowableCollector.execute(ThrowableCollector.java:73)
(103 more lines...)
Collapse Failed EmbeddedServletContainerJarDevelopmentIntegrationTests metaInfResourceFromDependencyIsAvailableViaHttp{RestTemplate}[5] History
Default Job < 1 sec
java.lang.NoClassDefFoundError: org/springframework/util/FileSystemUtils
	at org.springframework.boot.context.embedded.BootRunApplicationLauncher.explodeArchive(BootRunApplicationLauncher.java:119)
	at org.springframework.boot.context.embedded.BootRunApplicationLauncher.getArguments(BootRunApplicationLauncher.java:54)
	at org.springframework.boot.context.embedded.AbstractApplicationLauncher.startApplication(AbstractApplicationLauncher.java:83)
	at org.springframework.boot.context.embedded.AbstractApplicationLauncher.beforeEach(AbstractApplicationLauncher.java:63)
	at org.junit.jupiter.engine.descriptor.TestMethodTestDescriptor.lambda$invokeBeforeEachCallbacks$1(TestMethodTestDescriptor.java:151)
	at org.junit.jupiter.engine.descriptor.TestMethodTestDescriptor.lambda$invokeBeforeMethodsOrCallbacksUntilExceptionOccurs$5(TestMethodTestDescriptor.java:187)
	at org.junit.platform.engine.support.hierarchical.ThrowableCollector.execute(ThrowableCollector.java:73)
(103 more lines...)
Collapse Failed EmbeddedServletContainerJarDevelopmentIntegrationTests metaInfResourceFromDependencyIsAvailableViaHttp{RestTemplate}[6] History
Default Job < 1 sec
java.lang.NoClassDefFoundError: org/springframework/util/FileSystemUtils
	at org.springframework.boot.context.embedded.IdeApplicationLauncher.explodeArchive(IdeApplicationLauncher.java:139)
	at org.springframework.boot.context.embedded.IdeApplicationLauncher.getArguments(IdeApplicationLauncher.java:64)
	at org.springframework.boot.context.embedded.AbstractApplicationLauncher.startApplication(AbstractApplicationLauncher.java:83)
	at org.springframework.boot.context.embedded.AbstractApplicationLauncher.beforeEach(AbstractApplicationLauncher.java:63)
	at org.junit.jupiter.engine.descriptor.TestMethodTestDescriptor.lambda$invokeBeforeEachCallbacks$1(TestMethodTestDescriptor.java:151)
	at org.junit.jupiter.engine.descriptor.TestMethodTestDescriptor.lambda$invokeBeforeMethodsOrCallbacksUntilExceptionOccurs$5(TestMethodTestDescriptor.java:187)
	at org.junit.platform.engine.support.hierarchical.ThrowableCollector.execute(ThrowableCollector.java:73)
(103 more lines...)
Collapse Failed EmbeddedServletContainerJarDevelopmentIntegrationTests metaInfResourceFromDependencyIsAvailableViaServletContext{RestTemplate}[6] History
Default Job < 1 sec
java.lang.NoClassDefFoundError: org/springframework/util/FileSystemUtils
	at org.springframework.boot.context.embedded.IdeApplicationLauncher.explodeArchive(IdeApplicationLauncher.java:139)
	at org.springframework.boot.context.embedded.IdeApplicationLauncher.getArguments(IdeApplicationLauncher.java:64)
	at org.springframework.boot.context.embedded.AbstractApplicationLauncher.startApplication(AbstractApplicationLauncher.java:83)
	at org.springframework.boot.context.embedded.AbstractApplicationLauncher.beforeEach(AbstractApplicationLauncher.java:63)
	at org.junit.jupiter.engine.descriptor.TestMethodTestDescriptor.lambda$invokeBeforeEachCallbacks$1(TestMethodTestDescriptor.java:151)
	at org.junit.jupiter.engine.descriptor.TestMethodTestDescriptor.lambda$invokeBeforeMethodsOrCallbacksUntilExceptionOccurs$5(TestMethodTestDescriptor.java:187)
	at org.junit.platform.engine.support.hierarchical.ThrowableCollector.execute(ThrowableCollector.java:73)
(103 more lines...)
Collapse Failed EmbeddedServletContainerJarDevelopmentIntegrationTests metaInfResourceFromDependencyIsAvailableViaServletContext{RestTemplate}[3] History
Default Job 5 secs
java.lang.NoClassDefFoundError: org/springframework/util/FileSystemUtils
	at org.springframework.boot.context.embedded.BootRunApplicationLauncher.explodeArchive(BootRunApplicationLauncher.java:119)
	at org.springframework.boot.context.embedded.BootRunApplicationLauncher.getArguments(BootRunApplicationLauncher.java:54)
	at org.springframework.boot.context.embedded.AbstractApplicationLauncher.startApplication(AbstractApplicationLauncher.java:83)
	at org.springframework.boot.context.embedded.AbstractApplicationLauncher.beforeEach(AbstractApplicationLauncher.java:63)
	at org.junit.jupiter.engine.descriptor.TestMethodTestDescriptor.lambda$invokeBeforeEachCallbacks$1(TestMethodTestDescriptor.java:151)
	at org.junit.jupiter.engine.descriptor.TestMethodTestDescriptor.lambda$invokeBeforeMethodsOrCallbacksUntilExceptionOccurs$5(TestMethodTestDescriptor.java:187)
	at org.junit.platform.engine.support.hierarchical.ThrowableCollector.execute(ThrowableCollector.java:73)
(103 more lines...)
Collapse Failed EmbeddedServletContainerJarDevelopmentIntegrationTests metaInfResourceFromDependencyIsAvailableViaHttp{RestTemplate}[2] History
Default Job < 1 sec
java.lang.NoClassDefFoundError: org/springframework/util/FileSystemUtils
	at org.springframework.boot.context.embedded.IdeApplicationLauncher.explodeArchive(IdeApplicationLauncher.java:139)
	at org.springframework.boot.context.embedded.IdeApplicationLauncher.getArguments(IdeApplicationLauncher.java:64)
	at org.springframework.boot.context.embedded.AbstractApplicationLauncher.startApplication(AbstractApplicationLauncher.java:83)
	at org.springframework.boot.context.embedded.AbstractApplicationLauncher.beforeEach(AbstractApplicationLauncher.java:63)
	at org.junit.jupiter.engine.descriptor.TestMethodTestDescriptor.lambda$invokeBeforeEachCallbacks$1(TestMethodTestDescriptor.java:151)
	at org.junit.jupiter.engine.descriptor.TestMethodTestDescriptor.lambda$invokeBeforeMethodsOrCallbacksUntilExceptionOccurs$5(TestMethodTestDescriptor.java:187)
	at org.junit.platform.engine.support.hierarchical.ThrowableCollector.execute(ThrowableCollector.java:73)
(103 more lines...)
Collapse Failed EmbeddedServletContainerJarDevelopmentIntegrationTests metaInfResourceFromDependencyIsAvailableViaHttp{RestTemplate}[4] History
Default Job < 1 sec
java.lang.NoClassDefFoundError: org/springframework/util/FileSystemUtils
	at org.springframework.boot.context.embedded.IdeApplicationLauncher.explodeArchive(IdeApplicationLauncher.java:139)
	at org.springframework.boot.context.embedded.IdeApplicationLauncher.getArguments(IdeApplicationLauncher.java:64)
	at org.springframework.boot.context.embedded.AbstractApplicationLauncher.startApplication(AbstractApplicationLauncher.java:83)
	at org.springframework.boot.context.embedded.AbstractApplicationLauncher.beforeEach(AbstractApplicationLauncher.java:63)
	at org.junit.jupiter.engine.descriptor.TestMethodTestDescriptor.lambda$invokeBeforeEachCallbacks$1(TestMethodTestDescriptor.java:151)
	at org.junit.jupiter.engine.descriptor.TestMethodTestDescriptor.lambda$invokeBeforeMethodsOrCallbacksUntilExceptionOccurs$5(TestMethodTestDescriptor.java:187)
	at org.junit.platform.engine.support.hierarchical.ThrowableCollector.execute(ThrowableCollector.java:73)
(103 more lines...)
Collapse Failed EmbeddedServletContainerJarDevelopmentIntegrationTests metaInfResourceFromDependencyIsAvailableViaServletContext{RestTemplate}[4] History
Default Job < 1 sec
java.lang.NoClassDefFoundError: org/springframework/util/FileSystemUtils
	at org.springframework.boot.context.embedded.IdeApplicationLauncher.explodeArchive(IdeApplicationLauncher.java:139)
	at org.springframework.boot.context.embedded.IdeApplicationLauncher.getArguments(IdeApplicationLauncher.java:64)
	at org.springframework.boot.context.embedded.AbstractApplicationLauncher.startApplication(AbstractApplicationLauncher.java:83)
	at org.springframework.boot.context.embedded.AbstractApplicationLauncher.beforeEach(AbstractApplicationLauncher.java:63)
	at org.junit.jupiter.engine.descriptor.TestMethodTestDescriptor.lambda$invokeBeforeEachCallbacks$1(TestMethodTestDescriptor.java:151)
	at org.junit.jupiter.engine.descriptor.TestMethodTestDescriptor.lambda$invokeBeforeMethodsOrCallbacksUntilExceptionOccurs$5(TestMethodTestDescriptor.java:187)
	at org.junit.platform.engine.support.hierarchical.ThrowableCollector.execute(ThrowableCollector.java:73)
(103 more lines...)
Collapse Failed EmbeddedServletContainerJarDevelopmentIntegrationTests metaInfResourceFromDependencyIsAvailableViaHttp{RestTemplate}[3] History
Default Job < 1 sec
java.lang.NoClassDefFoundError: org/springframework/util/FileSystemUtils
	at org.springframework.boot.context.embedded.BootRunApplicationLauncher.explodeArchive(BootRunApplicationLauncher.java:119)
	at org.springframework.boot.context.embedded.BootRunApplicationLauncher.getArguments(BootRunApplicationLauncher.java:54)
	at org.springframework.boot.context.embedded.AbstractApplicationLauncher.startApplication(AbstractApplicationLauncher.java:83)
	at org.springframework.boot.context.embedded.AbstractApplicationLauncher.beforeEach(AbstractApplicationLauncher.java:63)
	at org.junit.jupiter.engine.descriptor.TestMethodTestDescriptor.lambda$invokeBeforeEachCallbacks$1(TestMethodTestDescriptor.java:151)
	at org.junit.jupiter.engine.descriptor.TestMethodTestDescriptor.lambda$invokeBeforeMethodsOrCallbacksUntilExceptionOccurs$5(TestMethodTestDescriptor.java:187)
	at org.junit.platform.engine.support.hierarchical.ThrowableCollector.execute(ThrowableCollector.java:73)
(103 more lines...)
Collapse Failed EmbeddedServletContainerJarDevelopmentIntegrationTests org.springframework.boot.context.embedded.EmbeddedServletContainerJarDevelopmentIntegrationTests History
Default Job < 1 sec
java.lang.NoClassDefFoundError: org/springframework/util/FileSystemUtils
	at org.springframework.boot.context.embedded.EmbeddedServerContainerInvocationContextProvider.afterAll(EmbeddedServerContainerInvocationContextProvider.java:93)
	at org.junit.jupiter.engine.descriptor.ClassBasedTestDescriptor.lambda$invokeAfterAllCallbacks$13(ClassBasedTestDescriptor.java:421)
	at org.junit.platform.engine.support.hierarchical.ThrowableCollector.execute(ThrowableCollector.java:73)
	at org.junit.jupiter.engine.descriptor.ClassBasedTestDescriptor.lambda$invokeAfterAllCallbacks$14(ClassBasedTestDescriptor.java:421)
	at java.util.ArrayList.forEach(ArrayList.java:1257)
	at org.junit.jupiter.engine.descriptor.ClassBasedTestDescriptor.invokeAfterAllCallbacks(ClassBasedTestDescriptor.java:421)
	at org.junit.jupiter.engine.descriptor.ClassBasedTestDescriptor.after(ClassBasedTestDescriptor.java:213)
(39 more lines...)
Collapse Failed EmbeddedServletContainerJarPackagingIntegrationTests applicationClassesAreNotAvailableViaHttp{RestTemplate}[5] History
Default Job 1 sec
org.junit.jupiter.api.extension.ParameterResolutionException: Failed to resolve parameter [org.springframework.web.client.RestTemplate rest] in method [public void org.springframework.boot.context.embedded.EmbeddedServletContainerJarPackagingIntegrationTests.applicationClassesAreNotAvailableViaHttp(org.springframework.web.client.RestTemplate)]: org/springframework/core/NestedRuntimeException
	at org.junit.jupiter.engine.execution.ExecutableInvoker.resolveParameter(ExecutableInvoker.java:239)
	at org.junit.jupiter.engine.execution.ExecutableInvoker.resolveParameters(ExecutableInvoker.java:183)
	at org.junit.jupiter.engine.execution.ExecutableInvoker.resolveParameters(ExecutableInvoker.java:144)
	at org.junit.jupiter.engine.execution.ExecutableInvoker.invoke(ExecutableInvoker.java:96)
	at org.junit.jupiter.engine.descriptor.TestMethodTestDescriptor.lambda$invokeTestMethod$6(TestMethodTestDescriptor.java:202)
	at org.junit.platform.engine.support.hierarchical.ThrowableCollector.execute(ThrowableCollector.java:73)
	at org.junit.jupiter.engine.descriptor.TestMethodTestDescriptor.invokeTestMethod(TestMethodTestDescriptor.java:198)
(124 more lines...)
Collapse Failed EmbeddedServletContainerJarPackagingIntegrationTests launcherIsNotAvailableViaHttp{RestTemplate}[4] History
Default Job < 1 sec
java.lang.NoClassDefFoundError: org/springframework/util/FileSystemUtils
	at org.springframework.boot.context.embedded.ExplodedApplicationLauncher.explodeArchive(ExplodedApplicationLauncher.java:73)
	at org.springframework.boot.context.embedded.ExplodedApplicationLauncher.getArguments(ExplodedApplicationLauncher.java:63)
	at org.springframework.boot.context.embedded.AbstractApplicationLauncher.startApplication(AbstractApplicationLauncher.java:83)
	at org.springframework.boot.context.embedded.AbstractApplicationLauncher.beforeEach(AbstractApplicationLauncher.java:63)
	at org.junit.jupiter.engine.descriptor.TestMethodTestDescriptor.lambda$invokeBeforeEachCallbacks$1(TestMethodTestDescriptor.java:151)
	at org.junit.jupiter.engine.descriptor.TestMethodTestDescriptor.lambda$invokeBeforeMethodsOrCallbacksUntilExceptionOccurs$5(TestMethodTestDescriptor.java:187)
	at org.junit.platform.engine.support.hierarchical.ThrowableCollector.execute(ThrowableCollector.java:73)
(103 more lines...)
Collapse Failed EmbeddedServletContainerJarPackagingIntegrationTests nestedMetaInfResourceIsAvailableViaHttp{RestTemplate}[3] History
Default Job 1 sec
org.junit.jupiter.api.extension.ParameterResolutionException: Failed to resolve parameter [org.springframework.web.client.RestTemplate rest] in method [public void org.springframework.boot.context.embedded.EmbeddedServletContainerJarPackagingIntegrationTests.nestedMetaInfResourceIsAvailableViaHttp(org.springframework.web.client.RestTemplate)]: org/springframework/core/NestedRuntimeException
	at org.junit.jupiter.engine.execution.ExecutableInvoker.resolveParameter(ExecutableInvoker.java:239)
	at org.junit.jupiter.engine.execution.ExecutableInvoker.resolveParameters(ExecutableInvoker.java:183)
	at org.junit.jupiter.engine.execution.ExecutableInvoker.resolveParameters(ExecutableInvoker.java:144)
	at org.junit.jupiter.engine.execution.ExecutableInvoker.invoke(ExecutableInvoker.java:96)
	at org.junit.jupiter.engine.descriptor.TestMethodTestDescriptor.lambda$invokeTestMethod$6(TestMethodTestDescriptor.java:202)
	at org.junit.platform.engine.support.hierarchical.ThrowableCollector.execute(ThrowableCollector.java:73)
	at org.junit.jupiter.engine.descriptor.TestMethodTestDescriptor.invokeTestMethod(TestMethodTestDescriptor.java:198)
(124 more lines...)
Collapse Failed EmbeddedServletContainerJarPackagingIntegrationTests launcherIsNotAvailableViaHttp{RestTemplate}[3] History
Default Job 1 sec
org.junit.jupiter.api.extension.ParameterResolutionException: Failed to resolve parameter [org.springframework.web.client.RestTemplate rest] in method [public void org.springframework.boot.context.embedded.EmbeddedServletContainerJarPackagingIntegrationTests.launcherIsNotAvailableViaHttp(org.springframework.web.client.RestTemplate)]: org/springframework/core/NestedRuntimeException
	at org.junit.jupiter.engine.execution.ExecutableInvoker.resolveParameter(ExecutableInvoker.java:239)
	at org.junit.jupiter.engine.execution.ExecutableInvoker.resolveParameters(ExecutableInvoker.java:183)
	at org.junit.jupiter.engine.execution.ExecutableInvoker.resolveParameters(ExecutableInvoker.java:144)
	at org.junit.jupiter.engine.execution.ExecutableInvoker.invoke(ExecutableInvoker.java:96)
	at org.junit.jupiter.engine.descriptor.TestMethodTestDescriptor.lambda$invokeTestMethod$6(TestMethodTestDescriptor.java:202)
	at org.junit.platform.engine.support.hierarchical.ThrowableCollector.execute(ThrowableCollector.java:73)
	at org.junit.jupiter.engine.descriptor.TestMethodTestDescriptor.invokeTestMethod(TestMethodTestDescriptor.java:198)
(124 more lines...)
Collapse Failed EmbeddedServletContainerJarPackagingIntegrationTests nestedMetaInfResourceIsAvailableViaServletContext{RestTemplate}[5] History
Default Job 8 secs
org.junit.jupiter.api.extension.ParameterResolutionException: Failed to resolve parameter [org.springframework.web.client.RestTemplate rest] in method [public void org.springframework.boot.context.embedded.EmbeddedServletContainerJarPackagingIntegrationTests.nestedMetaInfResourceIsAvailableViaServletContext(org.springframework.web.client.RestTemplate)]: org/springframework/core/NestedRuntimeException
	at org.junit.jupiter.engine.execution.ExecutableInvoker.resolveParameter(ExecutableInvoker.java:239)
	at org.junit.jupiter.engine.execution.ExecutableInvoker.resolveParameters(ExecutableInvoker.java:183)
	at org.junit.jupiter.engine.execution.ExecutableInvoker.resolveParameters(ExecutableInvoker.java:144)
	at org.junit.jupiter.engine.execution.ExecutableInvoker.invoke(ExecutableInvoker.java:96)
	at org.junit.jupiter.engine.descriptor.TestMethodTestDescriptor.lambda$invokeTestMethod$6(TestMethodTestDescriptor.java:202)
	at org.junit.platform.engine.support.hierarchical.ThrowableCollector.execute(ThrowableCollector.java:73)
	at org.junit.jupiter.engine.descriptor.TestMethodTestDescriptor.invokeTestMethod(TestMethodTestDescriptor.java:198)
(124 more lines...)
Collapse Failed EmbeddedServletContainerJarPackagingIntegrationTests nestedMetaInfResourceIsAvailableViaServletContext{RestTemplate}[4] History
Default Job < 1 sec
java.lang.NoClassDefFoundError: org/springframework/util/FileSystemUtils
	at org.springframework.boot.context.embedded.ExplodedApplicationLauncher.explodeArchive(ExplodedApplicationLauncher.java:73)
	at org.springframework.boot.context.embedded.ExplodedApplicationLauncher.getArguments(ExplodedApplicationLauncher.java:63)
	at org.springframework.boot.context.embedded.AbstractApplicationLauncher.startApplication(AbstractApplicationLauncher.java:83)
	at org.springframework.boot.context.embedded.AbstractApplicationLauncher.beforeEach(AbstractApplicationLauncher.java:63)
	at org.junit.jupiter.engine.descriptor.TestMethodTestDescriptor.lambda$invokeBeforeEachCallbacks$1(TestMethodTestDescriptor.java:151)
	at org.junit.jupiter.engine.descriptor.TestMethodTestDescriptor.lambda$invokeBeforeMethodsOrCallbacksUntilExceptionOccurs$5(TestMethodTestDescriptor.java:187)
	at org.junit.platform.engine.support.hierarchical.ThrowableCollector.execute(ThrowableCollector.java:73)
(103 more lines...)
Collapse Failed EmbeddedServletContainerJarPackagingIntegrationTests nestedJarIsNotAvailableViaHttp{RestTemplate}[6] History
Default Job < 1 sec
java.lang.NoClassDefFoundError: org/springframework/util/FileSystemUtils
	at org.springframework.boot.context.embedded.ExplodedApplicationLauncher.explodeArchive(ExplodedApplicationLauncher.java:73)
	at org.springframework.boot.context.embedded.ExplodedApplicationLauncher.getArguments(ExplodedApplicationLauncher.java:63)
	at org.springframework.boot.context.embedded.AbstractApplicationLauncher.startApplication(AbstractApplicationLauncher.java:83)
	at org.springframework.boot.context.embedded.AbstractApplicationLauncher.beforeEach(AbstractApplicationLauncher.java:63)
	at org.junit.jupiter.engine.descriptor.TestMethodTestDescriptor.lambda$invokeBeforeEachCallbacks$1(TestMethodTestDescriptor.java:151)
	at org.junit.jupiter.engine.descriptor.TestMethodTestDescriptor.lambda$invokeBeforeMethodsOrCallbacksUntilExceptionOccurs$5(TestMethodTestDescriptor.java:187)
	at org.junit.platform.engine.support.hierarchical.ThrowableCollector.execute(ThrowableCollector.java:73)
(103 more lines...)
Collapse Failed EmbeddedServletContainerJarPackagingIntegrationTests nestedMetaInfResourceIsAvailableViaServletContext{RestTemplate}[3] History
Default Job 8 secs
org.junit.jupiter.api.extension.ParameterResolutionException: Failed to resolve parameter [org.springframework.web.client.RestTemplate rest] in method [public void org.springframework.boot.context.embedded.EmbeddedServletContainerJarPackagingIntegrationTests.nestedMetaInfResourceIsAvailableViaServletContext(org.springframework.web.client.RestTemplate)]: org/springframework/core/NestedRuntimeException
	at org.junit.jupiter.engine.execution.ExecutableInvoker.resolveParameter(ExecutableInvoker.java:239)
	at org.junit.jupiter.engine.execution.ExecutableInvoker.resolveParameters(ExecutableInvoker.java:183)
	at org.junit.jupiter.engine.execution.ExecutableInvoker.resolveParameters(ExecutableInvoker.java:144)
	at org.junit.jupiter.engine.execution.ExecutableInvoker.invoke(ExecutableInvoker.java:96)
	at org.junit.jupiter.engine.descriptor.TestMethodTestDescriptor.lambda$invokeTestMethod$6(TestMethodTestDescriptor.java:202)
	at org.junit.platform.engine.support.hierarchical.ThrowableCollector.execute(ThrowableCollector.java:73)
	at org.junit.jupiter.engine.descriptor.TestMethodTestDescriptor.invokeTestMethod(TestMethodTestDescriptor.java:198)
(124 more lines...)
Collapse Failed EmbeddedServletContainerJarPackagingIntegrationTests launcherIsNotAvailableViaHttp{RestTemplate}[2] History
Default Job < 1 sec
java.lang.NoClassDefFoundError: org/springframework/util/FileSystemUtils
	at org.springframework.boot.context.embedded.ExplodedApplicationLauncher.explodeArchive(ExplodedApplicationLauncher.java:73)
	at org.springframework.boot.context.embedded.ExplodedApplicationLauncher.getArguments(ExplodedApplicationLauncher.java:63)
	at org.springframework.boot.context.embedded.AbstractApplicationLauncher.startApplication(AbstractApplicationLauncher.java:83)
	at org.springframework.boot.context.embedded.AbstractApplicationLauncher.beforeEach(AbstractApplicationLauncher.java:63)
	at org.junit.jupiter.engine.descriptor.TestMethodTestDescriptor.lambda$invokeBeforeEachCallbacks$1(TestMethodTestDescriptor.java:151)
	at org.junit.jupiter.engine.descriptor.TestMethodTestDescriptor.lambda$invokeBeforeMethodsOrCallbacksUntilExceptionOccurs$5(TestMethodTestDescriptor.java:187)
	at org.junit.platform.engine.support.hierarchical.ThrowableCollector.execute(ThrowableCollector.java:73)
(103 more lines...)
Collapse Failed EmbeddedServletContainerJarPackagingIntegrationTests launcherIsNotAvailableViaHttp{RestTemplate}[1] History
Default Job 1 sec
org.junit.jupiter.api.extension.ParameterResolutionException: Failed to resolve parameter [org.springframework.web.client.RestTemplate rest] in method [public void org.springframework.boot.context.embedded.EmbeddedServletContainerJarPackagingIntegrationTests.launcherIsNotAvailableViaHttp(org.springframework.web.client.RestTemplate)]: org/springframework/core/NestedRuntimeException
	at org.junit.jupiter.engine.execution.ExecutableInvoker.resolveParameter(ExecutableInvoker.java:239)
	at org.junit.jupiter.engine.execution.ExecutableInvoker.resolveParameters(ExecutableInvoker.java:183)
	at org.junit.jupiter.engine.execution.ExecutableInvoker.resolveParameters(ExecutableInvoker.java:144)
	at org.junit.jupiter.engine.execution.ExecutableInvoker.invoke(ExecutableInvoker.java:96)
	at org.junit.jupiter.engine.descriptor.TestMethodTestDescriptor.lambda$invokeTestMethod$6(TestMethodTestDescriptor.java:202)
	at org.junit.platform.engine.support.hierarchical.ThrowableCollector.execute(ThrowableCollector.java:73)
	at org.junit.jupiter.engine.descriptor.TestMethodTestDescriptor.invokeTestMethod(TestMethodTestDescriptor.java:198)
(124 more lines...)
Collapse Failed EmbeddedServletContainerJarPackagingIntegrationTests applicationClassesAreNotAvailableViaHttp{RestTemplate}[1] History
Default Job 1 sec
org.junit.jupiter.api.extension.ParameterResolutionException: Failed to resolve parameter [org.springframework.web.client.RestTemplate rest] in method [public void org.springframework.boot.context.embedded.EmbeddedServletContainerJarPackagingIntegrationTests.applicationClassesAreNotAvailableViaHttp(org.springframework.web.client.RestTemplate)]: org/springframework/core/NestedRuntimeException
	at org.junit.jupiter.engine.execution.ExecutableInvoker.resolveParameter(ExecutableInvoker.java:239)
	at org.junit.jupiter.engine.execution.ExecutableInvoker.resolveParameters(ExecutableInvoker.java:183)
	at org.junit.jupiter.engine.execution.ExecutableInvoker.resolveParameters(ExecutableInvoker.java:144)
	at org.junit.jupiter.engine.execution.ExecutableInvoker.invoke(ExecutableInvoker.java:96)
	at org.junit.jupiter.engine.descriptor.TestMethodTestDescriptor.lambda$invokeTestMethod$6(TestMethodTestDescriptor.java:202)
	at org.junit.platform.engine.support.hierarchical.ThrowableCollector.execute(ThrowableCollector.java:73)
	at org.junit.jupiter.engine.descriptor.TestMethodTestDescriptor.invokeTestMethod(TestMethodTestDescriptor.java:198)
(124 more lines...)
Collapse Failed EmbeddedServletContainerJarPackagingIntegrationTests applicationClassesAreNotAvailableViaHttp{RestTemplate}[2] History
Default Job < 1 sec
java.lang.NoClassDefFoundError: org/springframework/util/FileSystemUtils
	at org.springframework.boot.context.embedded.ExplodedApplicationLauncher.explodeArchive(ExplodedApplicationLauncher.java:73)
	at org.springframework.boot.context.embedded.ExplodedApplicationLauncher.getArguments(ExplodedApplicationLauncher.java:63)
	at org.springframework.boot.context.embedded.AbstractApplicationLauncher.startApplication(AbstractApplicationLauncher.java:83)
	at org.springframework.boot.context.embedded.AbstractApplicationLauncher.beforeEach(AbstractApplicationLauncher.java:63)
	at org.junit.jupiter.engine.descriptor.TestMethodTestDescriptor.lambda$invokeBeforeEachCallbacks$1(TestMethodTestDescriptor.java:151)
	at org.junit.jupiter.engine.descriptor.TestMethodTestDescriptor.lambda$invokeBeforeMethodsOrCallbacksUntilExceptionOccurs$5(TestMethodTestDescriptor.java:187)
	at org.junit.platform.engine.support.hierarchical.ThrowableCollector.execute(ThrowableCollector.java:73)
(103 more lines...)
Collapse Failed EmbeddedServletContainerJarPackagingIntegrationTests nestedMetaInfResourceIsAvailableViaHttp{RestTemplate}[2] History
Default Job < 1 sec
java.lang.NoClassDefFoundError: org/springframework/util/FileSystemUtils
	at org.springframework.boot.context.embedded.ExplodedApplicationLauncher.explodeArchive(ExplodedApplicationLauncher.java:73)
	at org.springframework.boot.context.embedded.ExplodedApplicationLauncher.getArguments(ExplodedApplicationLauncher.java:63)
	at org.springframework.boot.context.embedded.AbstractApplicationLauncher.startApplication(AbstractApplicationLauncher.java:83)
	at org.springframework.boot.context.embedded.AbstractApplicationLauncher.beforeEach(AbstractApplicationLauncher.java:63)
	at org.junit.jupiter.engine.descriptor.TestMethodTestDescriptor.lambda$invokeBeforeEachCallbacks$1(TestMethodTestDescriptor.java:151)
	at org.junit.jupiter.engine.descriptor.TestMethodTestDescriptor.lambda$invokeBeforeMethodsOrCallbacksUntilExceptionOccurs$5(TestMethodTestDescriptor.java:187)
	at org.junit.platform.engine.support.hierarchical.ThrowableCollector.execute(ThrowableCollector.java:73)
(103 more lines...)
Collapse Failed EmbeddedServletContainerJarPackagingIntegrationTests applicationClassesAreNotAvailableViaHttp{RestTemplate}[3] History
Default Job 1 sec
org.junit.jupiter.api.extension.ParameterResolutionException: Failed to resolve parameter [org.springframework.web.client.RestTemplate rest] in method [public void org.springframework.boot.context.embedded.EmbeddedServletContainerJarPackagingIntegrationTests.applicationClassesAreNotAvailableViaHttp(org.springframework.web.client.RestTemplate)]: org/springframework/core/NestedRuntimeException
	at org.junit.jupiter.engine.execution.ExecutableInvoker.resolveParameter(ExecutableInvoker.java:239)
	at org.junit.jupiter.engine.execution.ExecutableInvoker.resolveParameters(ExecutableInvoker.java:183)
	at org.junit.jupiter.engine.execution.ExecutableInvoker.resolveParameters(ExecutableInvoker.java:144)
	at org.junit.jupiter.engine.execution.ExecutableInvoker.invoke(ExecutableInvoker.java:96)
	at org.junit.jupiter.engine.descriptor.TestMethodTestDescriptor.lambda$invokeTestMethod$6(TestMethodTestDescriptor.java:202)
	at org.junit.platform.engine.support.hierarchical.ThrowableCollector.execute(ThrowableCollector.java:73)
	at org.junit.jupiter.engine.descriptor.TestMethodTestDescriptor.invokeTestMethod(TestMethodTestDescriptor.java:198)
(124 more lines...)
Collapse Failed EmbeddedServletContainerJarPackagingIntegrationTests nestedMetaInfResourceIsAvailableViaServletContext{RestTemplate}[6] History
Default Job < 1 sec
java.lang.NoClassDefFoundError: org/springframework/util/FileSystemUtils
	at org.springframework.boot.context.embedded.ExplodedApplicationLauncher.explodeArchive(ExplodedApplicationLauncher.java:73)
	at org.springframework.boot.context.embedded.ExplodedApplicationLauncher.getArguments(ExplodedApplicationLauncher.java:63)
	at org.springframework.boot.context.embedded.AbstractApplicationLauncher.startApplication(AbstractApplicationLauncher.java:83)
	at org.springframework.boot.context.embedded.AbstractApplicationLauncher.beforeEach(AbstractApplicationLauncher.java:63)
	at org.junit.jupiter.engine.descriptor.TestMethodTestDescriptor.lambda$invokeBeforeEachCallbacks$1(TestMethodTestDescriptor.java:151)
	at org.junit.jupiter.engine.descriptor.TestMethodTestDescriptor.lambda$invokeBeforeMethodsOrCallbacksUntilExceptionOccurs$5(TestMethodTestDescriptor.java:187)
	at org.junit.platform.engine.support.hierarchical.ThrowableCollector.execute(ThrowableCollector.java:73)
(103 more lines...)
Collapse Failed EmbeddedServletContainerJarPackagingIntegrationTests nestedJarIsNotAvailableViaHttp{RestTemplate}[5] History
Default Job 1 sec
org.junit.jupiter.api.extension.ParameterResolutionException: Failed to resolve parameter [org.springframework.web.client.RestTemplate rest] in method [public void org.springframework.boot.context.embedded.EmbeddedServletContainerJarPackagingIntegrationTests.nestedJarIsNotAvailableViaHttp(org.springframework.web.client.RestTemplate)]: org/springframework/core/NestedRuntimeException
	at org.junit.jupiter.engine.execution.ExecutableInvoker.resolveParameter(ExecutableInvoker.java:239)
	at org.junit.jupiter.engine.execution.ExecutableInvoker.resolveParameters(ExecutableInvoker.java:183)
	at org.junit.jupiter.engine.execution.ExecutableInvoker.resolveParameters(ExecutableInvoker.java:144)
	at org.junit.jupiter.engine.execution.ExecutableInvoker.invoke(ExecutableInvoker.java:96)
	at org.junit.jupiter.engine.descriptor.TestMethodTestDescriptor.lambda$invokeTestMethod$6(TestMethodTestDescriptor.java:202)
	at org.junit.platform.engine.support.hierarchical.ThrowableCollector.execute(ThrowableCollector.java:73)
	at org.junit.jupiter.engine.descriptor.TestMethodTestDescriptor.invokeTestMethod(TestMethodTestDescriptor.java:198)
(124 more lines...)
Collapse Failed EmbeddedServletContainerJarPackagingIntegrationTests applicationClassesAreNotAvailableViaHttp{RestTemplate}[4] History
Default Job < 1 sec
java.lang.NoClassDefFoundError: org/springframework/util/FileSystemUtils
	at org.springframework.boot.context.embedded.ExplodedApplicationLauncher.explodeArchive(ExplodedApplicationLauncher.java:73)
	at org.springframework.boot.context.embedded.ExplodedApplicationLauncher.getArguments(ExplodedApplicationLauncher.java:63)
	at org.springframework.boot.context.embedded.AbstractApplicationLauncher.startApplication(AbstractApplicationLauncher.java:83)
	at org.springframework.boot.context.embedded.AbstractApplicationLauncher.beforeEach(AbstractApplicationLauncher.java:63)
	at org.junit.jupiter.engine.descriptor.TestMethodTestDescriptor.lambda$invokeBeforeEachCallbacks$1(TestMethodTestDescriptor.java:151)
	at org.junit.jupiter.engine.descriptor.TestMethodTestDescriptor.lambda$invokeBeforeMethodsOrCallbacksUntilExceptionOccurs$5(TestMethodTestDescriptor.java:187)
	at org.junit.platform.engine.support.hierarchical.ThrowableCollector.execute(ThrowableCollector.java:73)
(103 more lines...)
Collapse Failed EmbeddedServletContainerJarPackagingIntegrationTests nestedJarIsNotAvailableViaHttp{RestTemplate}[1] History
Default Job 1 sec
org.junit.jupiter.api.extension.ParameterResolutionException: Failed to resolve parameter [org.springframework.web.client.RestTemplate rest] in method [public void org.springframework.boot.context.embedded.EmbeddedServletContainerJarPackagingIntegrationTests.nestedJarIsNotAvailableViaHttp(org.springframework.web.client.RestTemplate)]: org/springframework/core/NestedRuntimeException
	at org.junit.jupiter.engine.execution.ExecutableInvoker.resolveParameter(ExecutableInvoker.java:239)
	at org.junit.jupiter.engine.execution.ExecutableInvoker.resolveParameters(ExecutableInvoker.java:183)
	at org.junit.jupiter.engine.execution.ExecutableInvoker.resolveParameters(ExecutableInvoker.java:144)
	at org.junit.jupiter.engine.execution.ExecutableInvoker.invoke(ExecutableInvoker.java:96)
	at org.junit.jupiter.engine.descriptor.TestMethodTestDescriptor.lambda$invokeTestMethod$6(TestMethodTestDescriptor.java:202)
	at org.junit.platform.engine.support.hierarchical.ThrowableCollector.execute(ThrowableCollector.java:73)
	at org.junit.jupiter.engine.descriptor.TestMethodTestDescriptor.invokeTestMethod(TestMethodTestDescriptor.java:198)
(124 more lines...)
Collapse Failed EmbeddedServletContainerJarPackagingIntegrationTests launcherIsNotAvailableViaHttp{RestTemplate}[5] History
Default Job 1 sec
org.junit.jupiter.api.extension.ParameterResolutionException: Failed to resolve parameter [org.springframework.web.client.RestTemplate rest] in method [public void org.springframework.boot.context.embedded.EmbeddedServletContainerJarPackagingIntegrationTests.launcherIsNotAvailableViaHttp(org.springframework.web.client.RestTemplate)]: org/springframework/core/NestedRuntimeException
	at org.junit.jupiter.engine.execution.ExecutableInvoker.resolveParameter(ExecutableInvoker.java:239)
	at org.junit.jupiter.engine.execution.ExecutableInvoker.resolveParameters(ExecutableInvoker.java:183)
	at org.junit.jupiter.engine.execution.ExecutableInvoker.resolveParameters(ExecutableInvoker.java:144)
	at org.junit.jupiter.engine.execution.ExecutableInvoker.invoke(ExecutableInvoker.java:96)
	at org.junit.jupiter.engine.descriptor.TestMethodTestDescriptor.lambda$invokeTestMethod$6(TestMethodTestDescriptor.java:202)
	at org.junit.platform.engine.support.hierarchical.ThrowableCollector.execute(ThrowableCollector.java:73)
	at org.junit.jupiter.engine.descriptor.TestMethodTestDescriptor.invokeTestMethod(TestMethodTestDescriptor.java:198)
(124 more lines...)
Collapse Failed EmbeddedServletContainerJarPackagingIntegrationTests nestedJarIsNotAvailableViaHttp{RestTemplate}[2] History
Default Job < 1 sec
java.lang.NoClassDefFoundError: org/springframework/util/FileSystemUtils
	at org.springframework.boot.context.embedded.ExplodedApplicationLauncher.explodeArchive(ExplodedApplicationLauncher.java:73)
	at org.springframework.boot.context.embedded.ExplodedApplicationLauncher.getArguments(ExplodedApplicationLauncher.java:63)
	at org.springframework.boot.context.embedded.AbstractApplicationLauncher.startApplication(AbstractApplicationLauncher.java:83)
	at org.springframework.boot.context.embedded.AbstractApplicationLauncher.beforeEach(AbstractApplicationLauncher.java:63)
	at org.junit.jupiter.engine.descriptor.TestMethodTestDescriptor.lambda$invokeBeforeEachCallbacks$1(TestMethodTestDescriptor.java:151)
	at org.junit.jupiter.engine.descriptor.TestMethodTestDescriptor.lambda$invokeBeforeMethodsOrCallbacksUntilExceptionOccurs$5(TestMethodTestDescriptor.java:187)
	at org.junit.platform.engine.support.hierarchical.ThrowableCollector.execute(ThrowableCollector.java:73)
(103 more lines...)
Collapse Failed EmbeddedServletContainerJarPackagingIntegrationTests nestedMetaInfResourceIsAvailableViaHttp{RestTemplate}[6] History
Default Job < 1 sec
java.lang.NoClassDefFoundError: org/springframework/util/FileSystemUtils
	at org.springframework.boot.context.embedded.ExplodedApplicationLauncher.explodeArchive(ExplodedApplicationLauncher.java:73)
	at org.springframework.boot.context.embedded.ExplodedApplicationLauncher.getArguments(ExplodedApplicationLauncher.java:63)
	at org.springframework.boot.context.embedded.AbstractApplicationLauncher.startApplication(AbstractApplicationLauncher.java:83)
	at org.springframework.boot.context.embedded.AbstractApplicationLauncher.beforeEach(AbstractApplicationLauncher.java:63)
	at org.junit.jupiter.engine.descriptor.TestMethodTestDescriptor.lambda$invokeBeforeEachCallbacks$1(TestMethodTestDescriptor.java:151)
	at org.junit.jupiter.engine.descriptor.TestMethodTestDescriptor.lambda$invokeBeforeMethodsOrCallbacksUntilExceptionOccurs$5(TestMethodTestDescriptor.java:187)
	at org.junit.platform.engine.support.hierarchical.ThrowableCollector.execute(ThrowableCollector.java:73)
(103 more lines...)
Collapse Failed EmbeddedServletContainerJarPackagingIntegrationTests applicationClassesAreNotAvailableViaHttp{RestTemplate}[6] History
Default Job < 1 sec
java.lang.NoClassDefFoundError: org/springframework/util/FileSystemUtils
	at org.springframework.boot.context.embedded.ExplodedApplicationLauncher.explodeArchive(ExplodedApplicationLauncher.java:73)
	at org.springframework.boot.context.embedded.ExplodedApplicationLauncher.getArguments(ExplodedApplicationLauncher.java:63)
	at org.springframework.boot.context.embedded.AbstractApplicationLauncher.startApplication(AbstractApplicationLauncher.java:83)
	at org.springframework.boot.context.embedded.AbstractApplicationLauncher.beforeEach(AbstractApplicationLauncher.java:63)
	at org.junit.jupiter.engine.descriptor.TestMethodTestDescriptor.lambda$invokeBeforeEachCallbacks$1(TestMethodTestDescriptor.java:151)
	at org.junit.jupiter.engine.descriptor.TestMethodTestDescriptor.lambda$invokeBeforeMethodsOrCallbacksUntilExceptionOccurs$5(TestMethodTestDescriptor.java:187)
	at org.junit.platform.engine.support.hierarchical.ThrowableCollector.execute(ThrowableCollector.java:73)
(103 more lines...)
Collapse Failed EmbeddedServletContainerJarPackagingIntegrationTests nestedMetaInfResourceIsAvailableViaHttp{RestTemplate}[4] History
Default Job < 1 sec
java.lang.NoClassDefFoundError: org/springframework/util/FileSystemUtils
	at org.springframework.boot.context.embedded.ExplodedApplicationLauncher.explodeArchive(ExplodedApplicationLauncher.java:73)
	at org.springframework.boot.context.embedded.ExplodedApplicationLauncher.getArguments(ExplodedApplicationLauncher.java:63)
	at org.springframework.boot.context.embedded.AbstractApplicationLauncher.startApplication(AbstractApplicationLauncher.java:83)
	at org.springframework.boot.context.embedded.AbstractApplicationLauncher.beforeEach(AbstractApplicationLauncher.java:63)
	at org.junit.jupiter.engine.descriptor.TestMethodTestDescriptor.lambda$invokeBeforeEachCallbacks$1(TestMethodTestDescriptor.java:151)
	at org.junit.jupiter.engine.descriptor.TestMethodTestDescriptor.lambda$invokeBeforeMethodsOrCallbacksUntilExceptionOccurs$5(TestMethodTestDescriptor.java:187)
	at org.junit.platform.engine.support.hierarchical.ThrowableCollector.execute(ThrowableCollector.java:73)
(103 more lines...)
Collapse Failed EmbeddedServletContainerJarPackagingIntegrationTests launcherIsNotAvailableViaHttp{RestTemplate}[6] History
Default Job < 1 sec
java.lang.NoClassDefFoundError: org/springframework/util/FileSystemUtils
	at org.springframework.boot.context.embedded.ExplodedApplicationLauncher.explodeArchive(ExplodedApplicationLauncher.java:73)
	at org.springframework.boot.context.embedded.ExplodedApplicationLauncher.getArguments(ExplodedApplicationLauncher.java:63)
	at org.springframework.boot.context.embedded.AbstractApplicationLauncher.startApplication(AbstractApplicationLauncher.java:83)
	at org.springframework.boot.context.embedded.AbstractApplicationLauncher.beforeEach(AbstractApplicationLauncher.java:63)
	at org.junit.jupiter.engine.descriptor.TestMethodTestDescriptor.lambda$invokeBeforeEachCallbacks$1(TestMethodTestDescriptor.java:151)
	at org.junit.jupiter.engine.descriptor.TestMethodTestDescriptor.lambda$invokeBeforeMethodsOrCallbacksUntilExceptionOccurs$5(TestMethodTestDescriptor.java:187)
	at org.junit.platform.engine.support.hierarchical.ThrowableCollector.execute(ThrowableCollector.java:73)
(103 more lines...)
Collapse Failed EmbeddedServletContainerJarPackagingIntegrationTests nestedMetaInfResourceIsAvailableViaHttp{RestTemplate}[5] History
Default Job 1 sec
org.junit.jupiter.api.extension.ParameterResolutionException: Failed to resolve parameter [org.springframework.web.client.RestTemplate rest] in method [public void org.springframework.boot.context.embedded.EmbeddedServletContainerJarPackagingIntegrationTests.nestedMetaInfResourceIsAvailableViaHttp(org.springframework.web.client.RestTemplate)]: org/springframework/core/NestedRuntimeException
	at org.junit.jupiter.engine.execution.ExecutableInvoker.resolveParameter(ExecutableInvoker.java:239)
	at org.junit.jupiter.engine.execution.ExecutableInvoker.resolveParameters(ExecutableInvoker.java:183)
	at org.junit.jupiter.engine.execution.ExecutableInvoker.resolveParameters(ExecutableInvoker.java:144)
	at org.junit.jupiter.engine.execution.ExecutableInvoker.invoke(ExecutableInvoker.java:96)
	at org.junit.jupiter.engine.descriptor.TestMethodTestDescriptor.lambda$invokeTestMethod$6(TestMethodTestDescriptor.java:202)
	at org.junit.platform.engine.support.hierarchical.ThrowableCollector.execute(ThrowableCollector.java:73)
	at org.junit.jupiter.engine.descriptor.TestMethodTestDescriptor.invokeTestMethod(TestMethodTestDescriptor.java:198)
(124 more lines...)
Collapse Failed EmbeddedServletContainerJarPackagingIntegrationTests nestedJarIsNotAvailableViaHttp{RestTemplate}[4] History
Default Job < 1 sec
java.lang.NoClassDefFoundError: org/springframework/util/FileSystemUtils
	at org.springframework.boot.context.embedded.ExplodedApplicationLauncher.explodeArchive(ExplodedApplicationLauncher.java:73)
	at org.springframework.boot.context.embedded.ExplodedApplicationLauncher.getArguments(ExplodedApplicationLauncher.java:63)
	at org.springframework.boot.context.embedded.AbstractApplicationLauncher.startApplication(AbstractApplicationLauncher.java:83)
	at org.springframework.boot.context.embedded.AbstractApplicationLauncher.beforeEach(AbstractApplicationLauncher.java:63)
	at org.junit.jupiter.engine.descriptor.TestMethodTestDescriptor.lambda$invokeBeforeEachCallbacks$1(TestMethodTestDescriptor.java:151)
	at org.junit.jupiter.engine.descriptor.TestMethodTestDescriptor.lambda$invokeBeforeMethodsOrCallbacksUntilExceptionOccurs$5(TestMethodTestDescriptor.java:187)
	at org.junit.platform.engine.support.hierarchical.ThrowableCollector.execute(ThrowableCollector.java:73)
(103 more lines...)
Collapse Failed EmbeddedServletContainerJarPackagingIntegrationTests org.springframework.boot.context.embedded.EmbeddedServletContainerJarPackagingIntegrationTests History
Default Job < 1 sec
java.lang.NoClassDefFoundError: org/springframework/util/FileSystemUtils
	at org.springframework.boot.context.embedded.EmbeddedServerContainerInvocationContextProvider.afterAll(EmbeddedServerContainerInvocationContextProvider.java:93)
	at org.junit.jupiter.engine.descriptor.ClassBasedTestDescriptor.lambda$invokeAfterAllCallbacks$13(ClassBasedTestDescriptor.java:421)
	at org.junit.platform.engine.support.hierarchical.ThrowableCollector.execute(ThrowableCollector.java:73)
	at org.junit.jupiter.engine.descriptor.ClassBasedTestDescriptor.lambda$invokeAfterAllCallbacks$14(ClassBasedTestDescriptor.java:421)
	at java.util.ArrayList.forEach(ArrayList.java:1257)
	at org.junit.jupiter.engine.descriptor.ClassBasedTestDescriptor.invokeAfterAllCallbacks(ClassBasedTestDescriptor.java:421)
	at org.junit.jupiter.engine.descriptor.ClassBasedTestDescriptor.after(ClassBasedTestDescriptor.java:213)
(33 more lines...)
Collapse Failed EmbeddedServletContainerJarPackagingIntegrationTests nestedMetaInfResourceIsAvailableViaServletContext{RestTemplate}[2] History
Default Job < 1 sec
java.lang.NoClassDefFoundError: org/springframework/util/FileSystemUtils
	at org.springframework.boot.context.embedded.ExplodedApplicationLauncher.explodeArchive(ExplodedApplicationLauncher.java:73)
	at org.springframework.boot.context.embedded.ExplodedApplicationLauncher.getArguments(ExplodedApplicationLauncher.java:63)
	at org.springframework.boot.context.embedded.AbstractApplicationLauncher.startApplication(AbstractApplicationLauncher.java:83)
	at org.springframework.boot.context.embedded.AbstractApplicationLauncher.beforeEach(AbstractApplicationLauncher.java:63)
	at org.junit.jupiter.engine.descriptor.TestMethodTestDescriptor.lambda$invokeBeforeEachCallbacks$1(TestMethodTestDescriptor.java:151)
	at org.junit.jupiter.engine.descriptor.TestMethodTestDescriptor.lambda$invokeBeforeMethodsOrCallbacksUntilExceptionOccurs$5(TestMethodTestDescriptor.java:187)
	at org.junit.platform.engine.support.hierarchical.ThrowableCollector.execute(ThrowableCollector.java:73)
(109 more lines...)
Collapse Failed EmbeddedServletContainerJarPackagingIntegrationTests nestedJarIsNotAvailableViaHttp{RestTemplate}[3] History
Default Job 1 sec
org.junit.jupiter.api.extension.ParameterResolutionException: Failed to resolve parameter [org.springframework.web.client.RestTemplate rest] in method [public void org.springframework.boot.context.embedded.EmbeddedServletContainerJarPackagingIntegrationTests.nestedJarIsNotAvailableViaHttp(org.springframework.web.client.RestTemplate)]: org/springframework/core/NestedRuntimeException
	at org.junit.jupiter.engine.execution.ExecutableInvoker.resolveParameter(ExecutableInvoker.java:239)
	at org.junit.jupiter.engine.execution.ExecutableInvoker.resolveParameters(ExecutableInvoker.java:183)
	at org.junit.jupiter.engine.execution.ExecutableInvoker.resolveParameters(ExecutableInvoker.java:144)
	at org.junit.jupiter.engine.execution.ExecutableInvoker.invoke(ExecutableInvoker.java:96)
	at org.junit.jupiter.engine.descriptor.TestMethodTestDescriptor.lambda$invokeTestMethod$6(TestMethodTestDescriptor.java:202)
	at org.junit.platform.engine.support.hierarchical.ThrowableCollector.execute(ThrowableCollector.java:73)
	at org.junit.jupiter.engine.descriptor.TestMethodTestDescriptor.invokeTestMethod(TestMethodTestDescriptor.java:198)
(124 more lines...)
Collapse Failed EmbeddedServletContainerJarPackagingIntegrationTests nestedMetaInfResourceIsAvailableViaServletContext{RestTemplate}[1] History
Default Job 8 secs
org.junit.jupiter.api.extension.ParameterResolutionException: Failed to resolve parameter [org.springframework.web.client.RestTemplate rest] in method [public void org.springframework.boot.context.embedded.EmbeddedServletContainerJarPackagingIntegrationTests.nestedMetaInfResourceIsAvailableViaServletContext(org.springframework.web.client.RestTemplate)]: org/springframework/core/NestedRuntimeException
	at org.junit.jupiter.engine.execution.ExecutableInvoker.resolveParameter(ExecutableInvoker.java:239)
	at org.junit.jupiter.engine.execution.ExecutableInvoker.resolveParameters(ExecutableInvoker.java:183)
	at org.junit.jupiter.engine.execution.ExecutableInvoker.resolveParameters(ExecutableInvoker.java:144)
	at org.junit.jupiter.engine.execution.ExecutableInvoker.invoke(ExecutableInvoker.java:96)
	at org.junit.jupiter.engine.descriptor.TestMethodTestDescriptor.lambda$invokeTestMethod$6(TestMethodTestDescriptor.java:202)
	at org.junit.platform.engine.support.hierarchical.ThrowableCollector.execute(ThrowableCollector.java:73)
	at org.junit.jupiter.engine.descriptor.TestMethodTestDescriptor.invokeTestMethod(TestMethodTestDescriptor.java:198)
(124 more lines...)
Collapse Failed EmbeddedServletContainerJarPackagingIntegrationTests nestedMetaInfResourceIsAvailableViaHttp{RestTemplate}[1] History
Default Job 1 sec
org.junit.jupiter.api.extension.ParameterResolutionException: Failed to resolve parameter [org.springframework.web.client.RestTemplate rest] in method [public void org.springframework.boot.context.embedded.EmbeddedServletContainerJarPackagingIntegrationTests.nestedMetaInfResourceIsAvailableViaHttp(org.springframework.web.client.RestTemplate)]: org/springframework/core/NestedRuntimeException
	at org.junit.jupiter.engine.execution.ExecutableInvoker.resolveParameter(ExecutableInvoker.java:239)
	at org.junit.jupiter.engine.execution.ExecutableInvoker.resolveParameters(ExecutableInvoker.java:183)
	at org.junit.jupiter.engine.execution.ExecutableInvoker.resolveParameters(ExecutableInvoker.java:144)
	at org.junit.jupiter.engine.execution.ExecutableInvoker.invoke(ExecutableInvoker.java:96)
	at org.junit.jupiter.engine.descriptor.TestMethodTestDescriptor.lambda$invokeTestMethod$6(TestMethodTestDescriptor.java:202)
	at org.junit.platform.engine.support.hierarchical.ThrowableCollector.execute(ThrowableCollector.java:73)
	at org.junit.jupiter.engine.descriptor.TestMethodTestDescriptor.invokeTestMethod(TestMethodTestDescriptor.java:198)
(124 more lines...)
Collapse Failed EmbeddedServletContainerWarDevelopmentIntegrationTests webappResourcesAreAvailableViaHttp{RestTemplate}[6] History
Default Job < 1 sec
java.lang.NoClassDefFoundError: org/springframework/util/FileSystemUtils
	at org.springframework.boot.context.embedded.IdeApplicationLauncher.explodeArchive(IdeApplicationLauncher.java:139)
	at org.springframework.boot.context.embedded.IdeApplicationLauncher.getArguments(IdeApplicationLauncher.java:64)
	at org.springframework.boot.context.embedded.AbstractApplicationLauncher.startApplication(AbstractApplicationLauncher.java:83)
	at org.springframework.boot.context.embedded.AbstractApplicationLauncher.beforeEach(AbstractApplicationLauncher.java:63)
	at org.junit.jupiter.engine.descriptor.TestMethodTestDescriptor.lambda$invokeBeforeEachCallbacks$1(TestMethodTestDescriptor.java:151)
	at org.junit.jupiter.engine.descriptor.TestMethodTestDescriptor.lambda$invokeBeforeMethodsOrCallbacksUntilExceptionOccurs$5(TestMethodTestDescriptor.java:187)
	at org.junit.platform.engine.support.hierarchical.ThrowableCollector.execute(ThrowableCollector.java:73)
(103 more lines...)
Collapse Failed EmbeddedServletContainerWarDevelopmentIntegrationTests org.springframework.boot.context.embedded.EmbeddedServletContainerWarDevelopmentIntegrationTests History
Default Job < 1 sec
java.lang.NoClassDefFoundError: org/springframework/util/FileSystemUtils
	at org.springframework.boot.context.embedded.EmbeddedServerContainerInvocationContextProvider.afterAll(EmbeddedServerContainerInvocationContextProvider.java:93)
	at org.junit.jupiter.engine.descriptor.ClassBasedTestDescriptor.lambda$invokeAfterAllCallbacks$13(ClassBasedTestDescriptor.java:421)
	at org.junit.platform.engine.support.hierarchical.ThrowableCollector.execute(ThrowableCollector.java:73)
	at org.junit.jupiter.engine.descriptor.ClassBasedTestDescriptor.lambda$invokeAfterAllCallbacks$14(ClassBasedTestDescriptor.java:421)
	at java.util.ArrayList.forEach(ArrayList.java:1257)
	at org.junit.jupiter.engine.descriptor.ClassBasedTestDescriptor.invokeAfterAllCallbacks(ClassBasedTestDescriptor.java:421)
	at org.junit.jupiter.engine.descriptor.ClassBasedTestDescriptor.after(ClassBasedTestDescriptor.java:213)
(33 more lines...)
Collapse Failed EmbeddedServletContainerWarDevelopmentIntegrationTests metaInfResourceFromDependencyIsAvailableViaServletContext{RestTemplate}[5] History
Default Job < 1 sec
java.lang.NoClassDefFoundError: org/springframework/util/FileSystemUtils
	at org.springframework.boot.context.embedded.BootRunApplicationLauncher.explodeArchive(BootRunApplicationLauncher.java:119)
	at org.springframework.boot.context.embedded.BootRunApplicationLauncher.getArguments(BootRunApplicationLauncher.java:54)
	at org.springframework.boot.context.embedded.AbstractApplicationLauncher.startApplication(AbstractApplicationLauncher.java:83)
	at org.springframework.boot.context.embedded.AbstractApplicationLauncher.beforeEach(AbstractApplicationLauncher.java:63)
	at org.junit.jupiter.engine.descriptor.TestMethodTestDescriptor.lambda$invokeBeforeEachCallbacks$1(TestMethodTestDescriptor.java:151)
	at org.junit.jupiter.engine.descriptor.TestMethodTestDescriptor.lambda$invokeBeforeMethodsOrCallbacksUntilExceptionOccurs$5(TestMethodTestDescriptor.java:187)
	at org.junit.platform.engine.support.hierarchical.ThrowableCollector.execute(ThrowableCollector.java:73)
(103 more lines...)
Collapse Failed EmbeddedServletContainerWarDevelopmentIntegrationTests loaderClassesAreNotAvailableViaResourcePaths{RestTemplate}[3] History
Default Job < 1 sec
java.lang.NoClassDefFoundError: org/springframework/util/FileSystemUtils
	at org.springframework.boot.context.embedded.BootRunApplicationLauncher.explodeArchive(BootRunApplicationLauncher.java:119)
	at org.springframework.boot.context.embedded.BootRunApplicationLauncher.getArguments(BootRunApplicationLauncher.java:54)
	at org.springframework.boot.context.embedded.AbstractApplicationLauncher.startApplication(AbstractApplicationLauncher.java:83)
	at org.springframework.boot.context.embedded.AbstractApplicationLauncher.beforeEach(AbstractApplicationLauncher.java:63)
	at org.junit.jupiter.engine.descriptor.TestMethodTestDescriptor.lambda$invokeBeforeEachCallbacks$1(TestMethodTestDescriptor.java:151)
	at org.junit.jupiter.engine.descriptor.TestMethodTestDescriptor.lambda$invokeBeforeMethodsOrCallbacksUntilExceptionOccurs$5(TestMethodTestDescriptor.java:187)
	at org.junit.platform.engine.support.hierarchical.ThrowableCollector.execute(ThrowableCollector.java:73)
(103 more lines...)
Collapse Failed EmbeddedServletContainerWarDevelopmentIntegrationTests metaInfResourceFromDependencyIsAvailableViaServletContext{RestTemplate}[6] History
Default Job < 1 sec
java.lang.NoClassDefFoundError: org/springframework/util/FileSystemUtils
	at org.springframework.boot.context.embedded.IdeApplicationLauncher.explodeArchive(IdeApplicationLauncher.java:139)
	at org.springframework.boot.context.embedded.IdeApplicationLauncher.getArguments(IdeApplicationLauncher.java:64)
	at org.springframework.boot.context.embedded.AbstractApplicationLauncher.startApplication(AbstractApplicationLauncher.java:83)
	at org.springframework.boot.context.embedded.AbstractApplicationLauncher.beforeEach(AbstractApplicationLauncher.java:63)
	at org.junit.jupiter.engine.descriptor.TestMethodTestDescriptor.lambda$invokeBeforeEachCallbacks$1(TestMethodTestDescriptor.java:151)
	at org.junit.jupiter.engine.descriptor.TestMethodTestDescriptor.lambda$invokeBeforeMethodsOrCallbacksUntilExceptionOccurs$5(TestMethodTestDescriptor.java:187)
	at org.junit.platform.engine.support.hierarchical.ThrowableCollector.execute(ThrowableCollector.java:73)
(103 more lines...)
Collapse Failed EmbeddedServletContainerWarDevelopmentIntegrationTests loaderClassesAreNotAvailableViaResourcePaths{RestTemplate}[4] History
Default Job < 1 sec
java.lang.NoClassDefFoundError: org/springframework/util/FileSystemUtils
	at org.springframework.boot.context.embedded.IdeApplicationLauncher.explodeArchive(IdeApplicationLauncher.java:139)
	at org.springframework.boot.context.embedded.IdeApplicationLauncher.getArguments(IdeApplicationLauncher.java:64)
	at org.springframework.boot.context.embedded.AbstractApplicationLauncher.startApplication(AbstractApplicationLauncher.java:83)
	at org.springframework.boot.context.embedded.AbstractApplicationLauncher.beforeEach(AbstractApplicationLauncher.java:63)
	at org.junit.jupiter.engine.descriptor.TestMethodTestDescriptor.lambda$invokeBeforeEachCallbacks$1(TestMethodTestDescriptor.java:151)
	at org.junit.jupiter.engine.descriptor.TestMethodTestDescriptor.lambda$invokeBeforeMethodsOrCallbacksUntilExceptionOccurs$5(TestMethodTestDescriptor.java:187)
	at org.junit.platform.engine.support.hierarchical.ThrowableCollector.execute(ThrowableCollector.java:73)
(103 more lines...)