Build #1,681

Spring Boot on Windows

Build: #1681 failed Scheduled with changes by 7 people

Build result summary

Details

Completed
Duration
232 minutes
Labels
None
Agent
bamboo-2k16-02
Revision
02fd0c45e436598d9ed62b76b3830929435b85f8 02fd0c45e436598d9ed62b76b3830929435b85f8
Total tests
5732
Failing since
#1680 (Scheduled with changes by 5 people)
Fixed in
#1682 (Scheduled with changes by 4 people)

Tests

Responsible

Code commits

Author Commit Message Commit date
Madhura Bhave Madhura Bhave 02fd0c45e436598d9ed62b76b3830929435b85f8 02fd0c45e436598d9ed62b76b3830929435b85f8 Merge branch '2.1.x'
Closes gh-17748
Madhura Bhave Madhura Bhave 96235ea674a474f49272e72bf3dce1bed8f57632 m 96235ea674a474f49272e72bf3dce1bed8f57632 Fix ordering of JSON property source relative to servlet sources
Fixes gh-17652
Phil Webb Phil Webb da4f436140bf47669442802225d02bb9691a19aa da4f436140bf47669442802225d02bb9691a19aa Change SearchStrategy EXHAUSTIVE to TYPE_HIERARCHY
Fixup references following upstream Spring Framework change.
Stéphane Nicoll Stéphane Nicoll 59265477674564cfd165e30b4571f5389d9a0d84 59265477674564cfd165e30b4571f5389d9a0d84 Merge branch '2.1.x'
Closes gh-17745
Stéphane Nicoll Stéphane Nicoll 340a20595e50bc07a11870a8aed130e9c3ab85e9 m 340a20595e50bc07a11870a8aed130e9c3ab85e9 Merge pull request #17736 from dsyer
* pr/17736:
  Harmonize settings.gradle documentation in Gradle getting started guide
  Add missing repositories to snapshot configuration

Closes gh-17736

Tests

New test failures 6
Status Test View job Duration
Collapse Failed RepositoryRestMvcAutoConfigurationTests testDefaultRepositoryConfiguration History
Default Job < 1 sec
org.springframework.beans.factory.UnsatisfiedDependencyException: Error creating bean with name 'repositoryPropertyReferenceController' defined in URL [jar:file:/C:/Windows/system32/config/systemprofile/.m2/repository/org/springframework/data/spring-data-rest-webmvc/3.2.0.BUILD-SNAPSHOT/spring-data-rest-webmvc-3.2.0.BUILD-SNAPSHOT.jar!/org/springframework/data/rest/webmvc/RepositoryPropertyReferenceController.class]: Unsatisfied dependency expressed through constructor parameter 0; nested exception is org.springframework.beans.factory.BeanCreationException: Error creating bean with name 'org.springframework.data.rest.webmvc.config.RepositoryRestMvcConfiguration': Post-processing of merged bean definition failed; nested exception is java.lang.IllegalStateException: Failed to introspect Class [org.springframework.data.rest.webmvc.config.RepositoryRestMvcConfiguration] from ClassLoader [sun.misc.Launcher$AppClassLoader@3d4eac69]
	at org.springframework.beans.factory.support.ConstructorResolver.createArgumentArray(ConstructorResolver.java:780)
	at org.springframework.beans.factory.support.ConstructorResolver.autowireConstructor(ConstructorResolver.java:219)
	at org.springframework.beans.factory.support.AbstractAutowireCapableBeanFactory.autowireConstructor(AbstractAutowireCapableBeanFactory.java:1361)
	at org.springframework.beans.factory.support.AbstractAutowireCapableBeanFactory.createBeanInstance(AbstractAutowireCapableBeanFactory.java:1207)
	at org.springframework.beans.factory.support.AbstractAutowireCapableBeanFactory.doCreateBean(AbstractAutowireCapableBeanFactory.java:557)
	at org.springframework.beans.factory.support.AbstractAutowireCapableBeanFactory.createBean(AbstractAutowireCapableBeanFactory.java:517)
	at org.springframework.beans.factory.support.AbstractBeanFactory.lambda$doGetBean$0(AbstractBeanFactory.java:323)
(116 more lines...)
Collapse Failed RepositoryRestMvcAutoConfigurationTests backOffWithCustomConfiguration History
Default Job < 1 sec
org.springframework.beans.factory.UnsatisfiedDependencyException: Error creating bean with name 'repositoryPropertyReferenceController' defined in URL [jar:file:/C:/Windows/system32/config/systemprofile/.m2/repository/org/springframework/data/spring-data-rest-webmvc/3.2.0.BUILD-SNAPSHOT/spring-data-rest-webmvc-3.2.0.BUILD-SNAPSHOT.jar!/org/springframework/data/rest/webmvc/RepositoryPropertyReferenceController.class]: Unsatisfied dependency expressed through constructor parameter 0; nested exception is org.springframework.beans.factory.BeanCreationException: Error creating bean with name 'org.springframework.data.rest.webmvc.config.RepositoryRestMvcConfiguration': Post-processing of merged bean definition failed; nested exception is java.lang.IllegalStateException: Failed to introspect Class [org.springframework.data.rest.webmvc.config.RepositoryRestMvcConfiguration] from ClassLoader [sun.misc.Launcher$AppClassLoader@3d4eac69]
	at org.springframework.beans.factory.support.ConstructorResolver.createArgumentArray(ConstructorResolver.java:780)
	at org.springframework.beans.factory.support.ConstructorResolver.autowireConstructor(ConstructorResolver.java:219)
	at org.springframework.beans.factory.support.AbstractAutowireCapableBeanFactory.autowireConstructor(AbstractAutowireCapableBeanFactory.java:1361)
	at org.springframework.beans.factory.support.AbstractAutowireCapableBeanFactory.createBeanInstance(AbstractAutowireCapableBeanFactory.java:1207)
	at org.springframework.beans.factory.support.AbstractAutowireCapableBeanFactory.doCreateBean(AbstractAutowireCapableBeanFactory.java:557)
	at org.springframework.beans.factory.support.AbstractAutowireCapableBeanFactory.createBean(AbstractAutowireCapableBeanFactory.java:517)
	at org.springframework.beans.factory.support.AbstractBeanFactory.lambda$doGetBean$0(AbstractBeanFactory.java:323)
(116 more lines...)
Collapse Failed RepositoryRestMvcAutoConfigurationTests testWithCustomBasePath History
Default Job < 1 sec
org.springframework.beans.factory.UnsatisfiedDependencyException: Error creating bean with name 'repositoryPropertyReferenceController' defined in URL [jar:file:/C:/Windows/system32/config/systemprofile/.m2/repository/org/springframework/data/spring-data-rest-webmvc/3.2.0.BUILD-SNAPSHOT/spring-data-rest-webmvc-3.2.0.BUILD-SNAPSHOT.jar!/org/springframework/data/rest/webmvc/RepositoryPropertyReferenceController.class]: Unsatisfied dependency expressed through constructor parameter 0; nested exception is org.springframework.beans.factory.BeanCreationException: Error creating bean with name 'org.springframework.data.rest.webmvc.config.RepositoryRestMvcConfiguration': Post-processing of merged bean definition failed; nested exception is java.lang.IllegalStateException: Failed to introspect Class [org.springframework.data.rest.webmvc.config.RepositoryRestMvcConfiguration] from ClassLoader [sun.misc.Launcher$AppClassLoader@3d4eac69]
	at org.springframework.beans.factory.support.ConstructorResolver.createArgumentArray(ConstructorResolver.java:780)
	at org.springframework.beans.factory.support.ConstructorResolver.autowireConstructor(ConstructorResolver.java:219)
	at org.springframework.beans.factory.support.AbstractAutowireCapableBeanFactory.autowireConstructor(AbstractAutowireCapableBeanFactory.java:1361)
	at org.springframework.beans.factory.support.AbstractAutowireCapableBeanFactory.createBeanInstance(AbstractAutowireCapableBeanFactory.java:1207)
	at org.springframework.beans.factory.support.AbstractAutowireCapableBeanFactory.doCreateBean(AbstractAutowireCapableBeanFactory.java:557)
	at org.springframework.beans.factory.support.AbstractAutowireCapableBeanFactory.createBean(AbstractAutowireCapableBeanFactory.java:517)
	at org.springframework.beans.factory.support.AbstractBeanFactory.lambda$doGetBean$0(AbstractBeanFactory.java:323)
(116 more lines...)
Collapse Failed RepositoryRestMvcAutoConfigurationTests testWithCustomConfigurer History
Default Job < 1 sec
org.springframework.beans.factory.UnsatisfiedDependencyException: Error creating bean with name 'repositoryPropertyReferenceController' defined in URL [jar:file:/C:/Windows/system32/config/systemprofile/.m2/repository/org/springframework/data/spring-data-rest-webmvc/3.2.0.BUILD-SNAPSHOT/spring-data-rest-webmvc-3.2.0.BUILD-SNAPSHOT.jar!/org/springframework/data/rest/webmvc/RepositoryPropertyReferenceController.class]: Unsatisfied dependency expressed through constructor parameter 0; nested exception is org.springframework.beans.factory.BeanCreationException: Error creating bean with name 'org.springframework.data.rest.webmvc.config.RepositoryRestMvcConfiguration': Post-processing of merged bean definition failed; nested exception is java.lang.IllegalStateException: Failed to introspect Class [org.springframework.data.rest.webmvc.config.RepositoryRestMvcConfiguration] from ClassLoader [sun.misc.Launcher$AppClassLoader@3d4eac69]
	at org.springframework.beans.factory.support.ConstructorResolver.createArgumentArray(ConstructorResolver.java:780)
	at org.springframework.beans.factory.support.ConstructorResolver.autowireConstructor(ConstructorResolver.java:219)
	at org.springframework.beans.factory.support.AbstractAutowireCapableBeanFactory.autowireConstructor(AbstractAutowireCapableBeanFactory.java:1361)
	at org.springframework.beans.factory.support.AbstractAutowireCapableBeanFactory.createBeanInstance(AbstractAutowireCapableBeanFactory.java:1207)
	at org.springframework.beans.factory.support.AbstractAutowireCapableBeanFactory.doCreateBean(AbstractAutowireCapableBeanFactory.java:557)
	at org.springframework.beans.factory.support.AbstractAutowireCapableBeanFactory.createBean(AbstractAutowireCapableBeanFactory.java:517)
	at org.springframework.beans.factory.support.AbstractBeanFactory.lambda$doGetBean$0(AbstractBeanFactory.java:323)
(116 more lines...)
Collapse Failed RepositoryRestMvcAutoConfigurationTests testWithCustomSettings History
Default Job < 1 sec
org.springframework.beans.factory.UnsatisfiedDependencyException: Error creating bean with name 'repositoryPropertyReferenceController' defined in URL [jar:file:/C:/Windows/system32/config/systemprofile/.m2/repository/org/springframework/data/spring-data-rest-webmvc/3.2.0.BUILD-SNAPSHOT/spring-data-rest-webmvc-3.2.0.BUILD-SNAPSHOT.jar!/org/springframework/data/rest/webmvc/RepositoryPropertyReferenceController.class]: Unsatisfied dependency expressed through constructor parameter 0; nested exception is org.springframework.beans.factory.BeanCreationException: Error creating bean with name 'org.springframework.data.rest.webmvc.config.RepositoryRestMvcConfiguration': Post-processing of merged bean definition failed; nested exception is java.lang.IllegalStateException: Failed to introspect Class [org.springframework.data.rest.webmvc.config.RepositoryRestMvcConfiguration] from ClassLoader [sun.misc.Launcher$AppClassLoader@3d4eac69]
	at org.springframework.beans.factory.support.ConstructorResolver.createArgumentArray(ConstructorResolver.java:780)
	at org.springframework.beans.factory.support.ConstructorResolver.autowireConstructor(ConstructorResolver.java:219)
	at org.springframework.beans.factory.support.AbstractAutowireCapableBeanFactory.autowireConstructor(AbstractAutowireCapableBeanFactory.java:1361)
	at org.springframework.beans.factory.support.AbstractAutowireCapableBeanFactory.createBeanInstance(AbstractAutowireCapableBeanFactory.java:1207)
	at org.springframework.beans.factory.support.AbstractAutowireCapableBeanFactory.doCreateBean(AbstractAutowireCapableBeanFactory.java:557)
	at org.springframework.beans.factory.support.AbstractAutowireCapableBeanFactory.createBean(AbstractAutowireCapableBeanFactory.java:517)
	at org.springframework.beans.factory.support.AbstractBeanFactory.lambda$doGetBean$0(AbstractBeanFactory.java:323)
(116 more lines...)
Collapse Failed HttpMessageConvertersAutoConfigurationTests typeConstrainedConverterFromSpringDataDoesNotPreventAutoConfigurationOfJacksonConverter History
Default Job < 1 sec
java.lang.IllegalStateException: Unstarted application context org.springframework.boot.test.context.assertj.AssertableApplicationContext[startupFailure=org.springframework.beans.factory.BeanCreationException] failed to start
	at org.springframework.boot.test.context.assertj.AssertProviderApplicationContextInvocationHandler.getStartedApplicationContext(AssertProviderApplicationContextInvocationHandler.java:156)
	at org.springframework.boot.test.context.assertj.AssertProviderApplicationContextInvocationHandler.getSourceContext(AssertProviderApplicationContextInvocationHandler.java:111)
	at org.springframework.boot.test.context.assertj.AssertProviderApplicationContextInvocationHandler.invoke(AssertProviderApplicationContextInvocationHandler.java:74)
	at com.sun.proxy.$Proxy39.getSourceApplicationContext(Unknown Source)
	at org.springframework.boot.autoconfigure.http.HttpMessageConvertersAutoConfigurationTests.lambda$typeConstrainedConverterFromSpringDataDoesNotPreventAutoConfigurationOfJacksonConverter$6(HttpMessageConvertersAutoConfigurationTests.java:190)
	at org.springframework.boot.test.context.runner.AbstractApplicationContextRunner.accept(AbstractApplicationContextRunner.java:424)
	at org.springframework.boot.test.context.runner.AbstractApplicationContextRunner.lambda$null$0(AbstractApplicationContextRunner.java:359)
(109 more lines...)