Build: #30 failed Changes by David Turanski <dturanski@pivotal.io>

Logs

The following logs have been generated by the jobs in this plan.
  • Expand all
  • Collapse all
Job Logs
Collapse Build and install CfEnv Default Stage Download or View
26-Feb-2019 23:46:08 [INFO] Java CF Env JDBC ................................... SUCCESS [  3.223 s]
26-Feb-2019 23:46:08 [INFO] Java CF Env Spring Boot ............................ FAILURE [  3.919 s]
26-Feb-2019 23:46:08 [INFO] Java CF Env Pivotal Spring Cloud Services .......... SKIPPED
26-Feb-2019 23:46:08 [INFO] Java CF Env Pivotal Single Sign On ................. SKIPPED
26-Feb-2019 23:46:08 [INFO] ------------------------------------------------------------------------
26-Feb-2019 23:46:08 [INFO] BUILD FAILURE
26-Feb-2019 23:46:08 [INFO] ------------------------------------------------------------------------
26-Feb-2019 23:46:08 [INFO] Total time: 13.639 s
26-Feb-2019 23:46:08 [INFO] Finished at: 2019-02-26T23:46:08Z
26-Feb-2019 23:46:08 [INFO] Final Memory: 45M/581M
26-Feb-2019 23:46:08 [INFO] ------------------------------------------------------------------------
26-Feb-2019 23:46:08 [ERROR] Failed to execute goal org.apache.maven.plugins:maven-surefire-plugin:2.20:test (default-test) on project java-cfenv-boot: There are test failures.
26-Feb-2019 23:46:08 [ERROR]
26-Feb-2019 23:46:08 [ERROR] Please refer to /opt/bamboo-home/xml-data/build-dir/CFENV-BMASTER-JOB1/java-cfenv-boot/target/surefire-reports for the individual test results.
26-Feb-2019 23:46:08 [ERROR] Please refer to dump files (if any exist) [date]-jvmRun[N].dump, [date].dumpstream and [date]-jvmRun[N].dumpstream.
26-Feb-2019 23:46:08 [ERROR] -> [Help 1]
26-Feb-2019 23:46:08 [ERROR]
26-Feb-2019 23:46:08 [ERROR] To see the full stack trace of the errors, re-run Maven with the -e switch.
26-Feb-2019 23:46:08 [ERROR] Re-run Maven using the -X switch to enable full debug logging.
26-Feb-2019 23:46:08 [ERROR]
26-Feb-2019 23:46:08 [ERROR] For more information about the errors and possible solutions, please read the following articles:
26-Feb-2019 23:46:08 [ERROR] [Help 1] http://cwiki.apache.org/confluence/display/MAVEN/MojoFailureException
26-Feb-2019 23:46:08 [ERROR]
26-Feb-2019 23:46:08 [ERROR] After correcting the problems, you can resume the build with the command
26-Feb-2019 23:46:08 [ERROR]   mvn <goals> -rf :java-cfenv-boot