Build: #72 was successful

Job: Build and install CfEnv was successful

Stages & jobs

  1. Default Stage

Build log

The build generated 1,152 lines of output.The output is too long and has been truncated to the last 1,000 lines. Download or view full build log

18-Jun-2019 18:34:14 [INFO] Downloaded from central: https://repo.maven.apache.org/maven2/org/springframework/boot/spring-boot-starter-test/2.1.1.RELEASE/spring-boot-starter-test-2.1.1.RELEASE.jar (420 B at 8.1 kB/s)
18-Jun-2019 18:34:14 [INFO] Downloading from central: https://repo.maven.apache.org/maven2/org/springframework/boot/spring-boot-test-autoconfigure/2.1.1.RELEASE/spring-boot-test-autoconfigure-2.1.1.RELEASE.jar
18-Jun-2019 18:34:14 [INFO] Downloaded from central: https://repo.maven.apache.org/maven2/org/springframework/boot/spring-boot-starter-logging/2.1.1.RELEASE/spring-boot-starter-logging-2.1.1.RELEASE.jar (423 B at 8.1 kB/s)
18-Jun-2019 18:34:14 [INFO] Downloaded from central: https://repo.maven.apache.org/maven2/org/springframework/boot/spring-boot-test/2.1.1.RELEASE/spring-boot-test-2.1.1.RELEASE.jar (198 kB at 2.6 MB/s)
18-Jun-2019 18:34:14 [INFO] Downloaded from central: https://repo.maven.apache.org/maven2/org/springframework/boot/spring-boot-test-autoconfigure/2.1.1.RELEASE/spring-boot-test-autoconfigure-2.1.1.RELEASE.jar (175 kB at 1.7 MB/s)
18-Jun-2019 18:34:14 [INFO] Downloaded from central: https://repo.maven.apache.org/maven2/org/springframework/boot/spring-boot/2.1.1.RELEASE/spring-boot-2.1.1.RELEASE.jar (958 kB at 6.7 MB/s)
18-Jun-2019 18:34:14 [INFO] Downloaded from central: https://repo.maven.apache.org/maven2/org/springframework/boot/spring-boot-autoconfigure/2.1.1.RELEASE/spring-boot-autoconfigure-2.1.1.RELEASE.jar (1.3 MB at 7.2 MB/s)
18-Jun-2019 18:34:14 [INFO]
18-Jun-2019 18:34:14 [INFO] --- maven-clean-plugin:2.5:clean (default-clean) @ java-cfenv ---
18-Jun-2019 18:34:14 [INFO]
18-Jun-2019 18:34:14 [INFO] --- maven-checkstyle-plugin:3.0.0:check (validate) @ java-cfenv ---
18-Jun-2019 18:34:15 [INFO]
18-Jun-2019 18:34:15 [INFO] --- jacoco-maven-plugin:0.7.9:prepare-agent (agent) @ java-cfenv ---
18-Jun-2019 18:34:15 [INFO] argLine set to -javaagent:/home/bamboo/.m2/repository/org/jacoco/org.jacoco.agent/0.7.9/org.jacoco.agent-0.7.9-runtime.jar=destfile=/opt/bamboo-home/xml-data/build-dir/CFENV-BMASTER-JOB1/java-cfenv/target/jacoco.exec
18-Jun-2019 18:34:15 [INFO]
18-Jun-2019 18:34:15 [INFO] --- maven-resources-plugin:2.6:resources (default-resources) @ java-cfenv ---
18-Jun-2019 18:34:15 [INFO] Using 'UTF-8' encoding to copy filtered resources.
18-Jun-2019 18:34:15 [INFO] skip non existing resourceDirectory /opt/bamboo-home/xml-data/build-dir/CFENV-BMASTER-JOB1/java-cfenv/src/main/resources
18-Jun-2019 18:34:15 [INFO]
18-Jun-2019 18:34:15 [INFO] --- maven-compiler-plugin:3.8.0:compile (default-compile) @ java-cfenv ---
18-Jun-2019 18:34:15 [INFO] Changes detected - recompiling the module!
18-Jun-2019 18:34:15 [INFO] Compiling 7 source files to /opt/bamboo-home/xml-data/build-dir/CFENV-BMASTER-JOB1/java-cfenv/target/classes
18-Jun-2019 18:34:15 [INFO] /opt/bamboo-home/xml-data/build-dir/CFENV-BMASTER-JOB1/java-cfenv/src/main/java/io/pivotal/cfenv/core/CfService.java: Some input files use unchecked or unsafe operations.
18-Jun-2019 18:34:15 [INFO] /opt/bamboo-home/xml-data/build-dir/CFENV-BMASTER-JOB1/java-cfenv/src/main/java/io/pivotal/cfenv/core/CfService.java: Recompile with -Xlint:unchecked for details.
18-Jun-2019 18:34:15 [INFO]
18-Jun-2019 18:34:15 [INFO] --- maven-resources-plugin:2.6:testResources (default-testResources) @ java-cfenv ---
18-Jun-2019 18:34:15 [INFO] Using 'UTF-8' encoding to copy filtered resources.
18-Jun-2019 18:34:15 [INFO] Copying 4 resources
18-Jun-2019 18:34:15 [INFO]
18-Jun-2019 18:34:15 [INFO] --- maven-compiler-plugin:3.8.0:testCompile (default-testCompile) @ java-cfenv ---
18-Jun-2019 18:34:15 [INFO] Changes detected - recompiling the module!
18-Jun-2019 18:34:15 [INFO] Compiling 3 source files to /opt/bamboo-home/xml-data/build-dir/CFENV-BMASTER-JOB1/java-cfenv/target/test-classes
18-Jun-2019 18:34:15 [INFO]
18-Jun-2019 18:34:15 [INFO] --- maven-surefire-plugin:2.20:test (default-test) @ java-cfenv ---
18-Jun-2019 18:34:16 [INFO]
18-Jun-2019 18:34:16 [INFO] -------------------------------------------------------
18-Jun-2019 18:34:16 [INFO]  T E S T S
18-Jun-2019 18:34:16 [INFO] -------------------------------------------------------
18-Jun-2019 18:34:16 [INFO] Running io.pivotal.cfenv.core.CfEnvTests
18-Jun-2019 18:34:17 [INFO] Tests run: 10, Failures: 0, Errors: 0, Skipped: 0, Time elapsed: 1.309 s - in io.pivotal.cfenv.core.CfEnvTests
18-Jun-2019 18:34:17 [INFO] Running io.pivotal.cfenv.core.UriInfoTests
18-Jun-2019 18:34:17 [INFO] Tests run: 5, Failures: 0, Errors: 0, Skipped: 0, Time elapsed: 0.005 s - in io.pivotal.cfenv.core.UriInfoTests
18-Jun-2019 18:34:17 [INFO] Running io.pivotal.cfenv.core.CfEnvIsInCfTests
18-Jun-2019 18:34:17 [INFO] Tests run: 2, Failures: 0, Errors: 0, Skipped: 0, Time elapsed: 0.031 s - in io.pivotal.cfenv.core.CfEnvIsInCfTests
18-Jun-2019 18:34:18 [INFO]
18-Jun-2019 18:34:18 [INFO] Results:
18-Jun-2019 18:34:18 [INFO]
18-Jun-2019 18:34:18 [INFO] Tests run: 17, Failures: 0, Errors: 0, Skipped: 0
18-Jun-2019 18:34:18 [INFO]
18-Jun-2019 18:34:18 [INFO]
18-Jun-2019 18:34:18 [INFO] --- jacoco-maven-plugin:0.7.9:report (report) @ java-cfenv ---
18-Jun-2019 18:34:18 [INFO] Loading execution data file /opt/bamboo-home/xml-data/build-dir/CFENV-BMASTER-JOB1/java-cfenv/target/jacoco.exec
18-Jun-2019 18:34:18 [INFO] Analyzed bundle 'Java CF Env' with 9 classes
18-Jun-2019 18:34:18 [INFO]
18-Jun-2019 18:34:18 [INFO] --- maven-jar-plugin:3.0.2:jar (default-jar) @ java-cfenv ---
18-Jun-2019 18:34:18 [INFO] Building jar: /opt/bamboo-home/xml-data/build-dir/CFENV-BMASTER-JOB1/java-cfenv/target/java-cfenv-1.1.1.BUILD-SNAPSHOT.jar
18-Jun-2019 18:34:18 [INFO]
18-Jun-2019 18:34:18 [INFO] >>> maven-source-plugin:3.0.1:jar (attach-sources) > generate-sources @ java-cfenv >>>
18-Jun-2019 18:34:18 [INFO]
18-Jun-2019 18:34:18 [INFO] --- maven-checkstyle-plugin:3.0.0:check (validate) @ java-cfenv ---
18-Jun-2019 18:34:18 [INFO]
18-Jun-2019 18:34:18 [INFO] --- jacoco-maven-plugin:0.7.9:prepare-agent (agent) @ java-cfenv ---
18-Jun-2019 18:34:18 [INFO] argLine set to -javaagent:/home/bamboo/.m2/repository/org/jacoco/org.jacoco.agent/0.7.9/org.jacoco.agent-0.7.9-runtime.jar=destfile=/opt/bamboo-home/xml-data/build-dir/CFENV-BMASTER-JOB1/java-cfenv/target/jacoco.exec
18-Jun-2019 18:34:18 [INFO]
18-Jun-2019 18:34:18 [INFO] <<< maven-source-plugin:3.0.1:jar (attach-sources) < generate-sources @ java-cfenv <<<
18-Jun-2019 18:34:18 [INFO]
18-Jun-2019 18:34:18 [INFO]
18-Jun-2019 18:34:18 [INFO] --- maven-source-plugin:3.0.1:jar (attach-sources) @ java-cfenv ---
18-Jun-2019 18:34:18 [INFO] Building jar: /opt/bamboo-home/xml-data/build-dir/CFENV-BMASTER-JOB1/java-cfenv/target/java-cfenv-1.1.1.BUILD-SNAPSHOT-sources.jar
18-Jun-2019 18:34:18 [INFO]
18-Jun-2019 18:34:18 [INFO] --- maven-javadoc-plugin:3.0.1:jar (attach-javadocs) @ java-cfenv ---
18-Jun-2019 18:34:19 [INFO] Building jar: /opt/bamboo-home/xml-data/build-dir/CFENV-BMASTER-JOB1/java-cfenv/target/java-cfenv-1.1.1.BUILD-SNAPSHOT-javadoc.jar
18-Jun-2019 18:34:19 [INFO]
18-Jun-2019 18:34:19 [INFO] --- maven-javadoc-plugin:3.0.1:jar (javadoc) @ java-cfenv ---
18-Jun-2019 18:34:20 [INFO] Building jar: /opt/bamboo-home/xml-data/build-dir/CFENV-BMASTER-JOB1/java-cfenv/target/java-cfenv-1.1.1.BUILD-SNAPSHOT-javadoc.jar
18-Jun-2019 18:34:20 [INFO]
18-Jun-2019 18:34:20 [INFO] --- maven-install-plugin:2.4:install (default-install) @ java-cfenv ---
18-Jun-2019 18:34:20 [INFO] Installing /opt/bamboo-home/xml-data/build-dir/CFENV-BMASTER-JOB1/java-cfenv/target/java-cfenv-1.1.1.BUILD-SNAPSHOT.jar to /home/bamboo/.m2/repository/io/pivotal/cfenv/java-cfenv/1.1.1.BUILD-SNAPSHOT/java-cfenv-1.1.1.BUILD-SNAPSHOT.jar
18-Jun-2019 18:34:20 [INFO] Installing /opt/bamboo-home/xml-data/build-dir/CFENV-BMASTER-JOB1/java-cfenv/pom.xml to /home/bamboo/.m2/repository/io/pivotal/cfenv/java-cfenv/1.1.1.BUILD-SNAPSHOT/java-cfenv-1.1.1.BUILD-SNAPSHOT.pom
18-Jun-2019 18:34:20 [INFO] Installing /opt/bamboo-home/xml-data/build-dir/CFENV-BMASTER-JOB1/java-cfenv/target/java-cfenv-1.1.1.BUILD-SNAPSHOT-sources.jar to /home/bamboo/.m2/repository/io/pivotal/cfenv/java-cfenv/1.1.1.BUILD-SNAPSHOT/java-cfenv-1.1.1.BUILD-SNAPSHOT-sources.jar
18-Jun-2019 18:34:20 [INFO] Installing /opt/bamboo-home/xml-data/build-dir/CFENV-BMASTER-JOB1/java-cfenv/target/java-cfenv-1.1.1.BUILD-SNAPSHOT-javadoc.jar to /home/bamboo/.m2/repository/io/pivotal/cfenv/java-cfenv/1.1.1.BUILD-SNAPSHOT/java-cfenv-1.1.1.BUILD-SNAPSHOT-javadoc.jar
18-Jun-2019 18:34:20 [INFO] Installing /opt/bamboo-home/xml-data/build-dir/CFENV-BMASTER-JOB1/java-cfenv/target/java-cfenv-1.1.1.BUILD-SNAPSHOT-javadoc.jar to /home/bamboo/.m2/repository/io/pivotal/cfenv/java-cfenv/1.1.1.BUILD-SNAPSHOT/java-cfenv-1.1.1.BUILD-SNAPSHOT-javadoc.jar
18-Jun-2019 18:34:20 [INFO]
18-Jun-2019 18:34:20 [INFO] --------------< io.pivotal.cfenv:java-cfenv-test-support >--------------
18-Jun-2019 18:34:20 [INFO] Building Java CF Env Test Support 1.1.1.BUILD-SNAPSHOT             [3/7]
18-Jun-2019 18:34:20 [INFO] --------------------------------[ jar ]---------------------------------
18-Jun-2019 18:34:20 [INFO]
18-Jun-2019 18:34:20 [INFO] --- maven-clean-plugin:2.5:clean (default-clean) @ java-cfenv-test-support ---
18-Jun-2019 18:34:20 [INFO]
18-Jun-2019 18:34:20 [INFO] --- maven-checkstyle-plugin:3.0.0:check (validate) @ java-cfenv-test-support ---
18-Jun-2019 18:34:20 [INFO]
18-Jun-2019 18:34:20 [INFO] --- jacoco-maven-plugin:0.7.9:prepare-agent (agent) @ java-cfenv-test-support ---
18-Jun-2019 18:34:20 [INFO] argLine set to -javaagent:/home/bamboo/.m2/repository/org/jacoco/org.jacoco.agent/0.7.9/org.jacoco.agent-0.7.9-runtime.jar=destfile=/opt/bamboo-home/xml-data/build-dir/CFENV-BMASTER-JOB1/java-cfenv-test-support/target/jacoco.exec
18-Jun-2019 18:34:20 [INFO]
18-Jun-2019 18:34:20 [INFO] --- maven-resources-plugin:2.6:resources (default-resources) @ java-cfenv-test-support ---
18-Jun-2019 18:34:20 [INFO] Using 'UTF-8' encoding to copy filtered resources.
18-Jun-2019 18:34:20 [INFO] Copying 2 resources
18-Jun-2019 18:34:20 [INFO]
18-Jun-2019 18:34:20 [INFO] --- maven-compiler-plugin:3.8.0:compile (default-compile) @ java-cfenv-test-support ---
18-Jun-2019 18:34:20 [INFO] Changes detected - recompiling the module!
18-Jun-2019 18:34:20 [INFO] Compiling 2 source files to /opt/bamboo-home/xml-data/build-dir/CFENV-BMASTER-JOB1/java-cfenv-test-support/target/classes
18-Jun-2019 18:34:20 [INFO]
18-Jun-2019 18:34:20 [INFO] --- maven-resources-plugin:2.6:testResources (default-testResources) @ java-cfenv-test-support ---
18-Jun-2019 18:34:20 [INFO] Using 'UTF-8' encoding to copy filtered resources.
18-Jun-2019 18:34:20 [INFO] skip non existing resourceDirectory /opt/bamboo-home/xml-data/build-dir/CFENV-BMASTER-JOB1/java-cfenv-test-support/src/test/resources
18-Jun-2019 18:34:20 [INFO]
18-Jun-2019 18:34:20 [INFO] --- maven-compiler-plugin:3.8.0:testCompile (default-testCompile) @ java-cfenv-test-support ---
18-Jun-2019 18:34:20 [INFO] No sources to compile
18-Jun-2019 18:34:20 [INFO]
18-Jun-2019 18:34:20 [INFO] --- maven-surefire-plugin:2.20:test (default-test) @ java-cfenv-test-support ---
18-Jun-2019 18:34:20 [INFO] No tests to run.
18-Jun-2019 18:34:20 [INFO]
18-Jun-2019 18:34:20 [INFO] --- jacoco-maven-plugin:0.7.9:report (report) @ java-cfenv-test-support ---
18-Jun-2019 18:34:20 [INFO] Skipping JaCoCo execution due to missing execution data file.
18-Jun-2019 18:34:20 [INFO]
18-Jun-2019 18:34:20 [INFO] --- maven-jar-plugin:3.0.2:jar (default-jar) @ java-cfenv-test-support ---
18-Jun-2019 18:34:20 [INFO] Building jar: /opt/bamboo-home/xml-data/build-dir/CFENV-BMASTER-JOB1/java-cfenv-test-support/target/java-cfenv-test-support-1.1.1.BUILD-SNAPSHOT.jar
18-Jun-2019 18:34:20 [INFO]
18-Jun-2019 18:34:20 [INFO] >>> maven-source-plugin:3.0.1:jar (attach-sources) > generate-sources @ java-cfenv-test-support >>>
18-Jun-2019 18:34:20 [INFO]
18-Jun-2019 18:34:20 [INFO] --- maven-checkstyle-plugin:3.0.0:check (validate) @ java-cfenv-test-support ---
18-Jun-2019 18:34:20 [INFO]
18-Jun-2019 18:34:20 [INFO] --- jacoco-maven-plugin:0.7.9:prepare-agent (agent) @ java-cfenv-test-support ---
18-Jun-2019 18:34:20 [INFO] argLine set to -javaagent:/home/bamboo/.m2/repository/org/jacoco/org.jacoco.agent/0.7.9/org.jacoco.agent-0.7.9-runtime.jar=destfile=/opt/bamboo-home/xml-data/build-dir/CFENV-BMASTER-JOB1/java-cfenv-test-support/target/jacoco.exec
18-Jun-2019 18:34:20 [INFO]
18-Jun-2019 18:34:20 [INFO] <<< maven-source-plugin:3.0.1:jar (attach-sources) < generate-sources @ java-cfenv-test-support <<<
18-Jun-2019 18:34:20 [INFO]
18-Jun-2019 18:34:20 [INFO]
18-Jun-2019 18:34:20 [INFO] --- maven-source-plugin:3.0.1:jar (attach-sources) @ java-cfenv-test-support ---
18-Jun-2019 18:34:20 [INFO] Building jar: /opt/bamboo-home/xml-data/build-dir/CFENV-BMASTER-JOB1/java-cfenv-test-support/target/java-cfenv-test-support-1.1.1.BUILD-SNAPSHOT-sources.jar
18-Jun-2019 18:34:20 [INFO]
18-Jun-2019 18:34:20 [INFO] --- maven-javadoc-plugin:3.0.1:jar (attach-javadocs) @ java-cfenv-test-support ---
18-Jun-2019 18:34:21 [INFO] Building jar: /opt/bamboo-home/xml-data/build-dir/CFENV-BMASTER-JOB1/java-cfenv-test-support/target/java-cfenv-test-support-1.1.1.BUILD-SNAPSHOT-javadoc.jar
18-Jun-2019 18:34:21 [INFO]
18-Jun-2019 18:34:21 [INFO] --- maven-javadoc-plugin:3.0.1:jar (javadoc) @ java-cfenv-test-support ---
18-Jun-2019 18:34:22 [INFO] Building jar: /opt/bamboo-home/xml-data/build-dir/CFENV-BMASTER-JOB1/java-cfenv-test-support/target/java-cfenv-test-support-1.1.1.BUILD-SNAPSHOT-javadoc.jar
18-Jun-2019 18:34:22 [INFO]
18-Jun-2019 18:34:22 [INFO] --- maven-install-plugin:2.4:install (default-install) @ java-cfenv-test-support ---
18-Jun-2019 18:34:22 [INFO] Installing /opt/bamboo-home/xml-data/build-dir/CFENV-BMASTER-JOB1/java-cfenv-test-support/target/java-cfenv-test-support-1.1.1.BUILD-SNAPSHOT.jar to /home/bamboo/.m2/repository/io/pivotal/cfenv/java-cfenv-test-support/1.1.1.BUILD-SNAPSHOT/java-cfenv-test-support-1.1.1.BUILD-SNAPSHOT.jar
18-Jun-2019 18:34:22 [INFO] Installing /opt/bamboo-home/xml-data/build-dir/CFENV-BMASTER-JOB1/java-cfenv-test-support/pom.xml to /home/bamboo/.m2/repository/io/pivotal/cfenv/java-cfenv-test-support/1.1.1.BUILD-SNAPSHOT/java-cfenv-test-support-1.1.1.BUILD-SNAPSHOT.pom
18-Jun-2019 18:34:22 [INFO] Installing /opt/bamboo-home/xml-data/build-dir/CFENV-BMASTER-JOB1/java-cfenv-test-support/target/java-cfenv-test-support-1.1.1.BUILD-SNAPSHOT-sources.jar to /home/bamboo/.m2/repository/io/pivotal/cfenv/java-cfenv-test-support/1.1.1.BUILD-SNAPSHOT/java-cfenv-test-support-1.1.1.BUILD-SNAPSHOT-sources.jar
18-Jun-2019 18:34:22 [INFO] Installing /opt/bamboo-home/xml-data/build-dir/CFENV-BMASTER-JOB1/java-cfenv-test-support/target/java-cfenv-test-support-1.1.1.BUILD-SNAPSHOT-javadoc.jar to /home/bamboo/.m2/repository/io/pivotal/cfenv/java-cfenv-test-support/1.1.1.BUILD-SNAPSHOT/java-cfenv-test-support-1.1.1.BUILD-SNAPSHOT-javadoc.jar
18-Jun-2019 18:34:22 [INFO] Installing /opt/bamboo-home/xml-data/build-dir/CFENV-BMASTER-JOB1/java-cfenv-test-support/target/java-cfenv-test-support-1.1.1.BUILD-SNAPSHOT-javadoc.jar to /home/bamboo/.m2/repository/io/pivotal/cfenv/java-cfenv-test-support/1.1.1.BUILD-SNAPSHOT/java-cfenv-test-support-1.1.1.BUILD-SNAPSHOT-javadoc.jar
18-Jun-2019 18:34:22 [INFO]
18-Jun-2019 18:34:22 [INFO] ------------------< io.pivotal.cfenv:java-cfenv-jdbc >------------------
18-Jun-2019 18:34:22 [INFO] Building Java CF Env JDBC 1.1.1.BUILD-SNAPSHOT                     [4/7]
18-Jun-2019 18:34:22 [INFO] --------------------------------[ jar ]---------------------------------
18-Jun-2019 18:34:22 [INFO]
18-Jun-2019 18:34:22 [INFO] --- maven-clean-plugin:2.5:clean (default-clean) @ java-cfenv-jdbc ---
18-Jun-2019 18:34:22 [INFO]
18-Jun-2019 18:34:22 [INFO] --- maven-checkstyle-plugin:3.0.0:check (validate) @ java-cfenv-jdbc ---
18-Jun-2019 18:34:22 [INFO]
18-Jun-2019 18:34:22 [INFO] --- jacoco-maven-plugin:0.7.9:prepare-agent (agent) @ java-cfenv-jdbc ---
18-Jun-2019 18:34:22 [INFO] argLine set to -javaagent:/home/bamboo/.m2/repository/org/jacoco/org.jacoco.agent/0.7.9/org.jacoco.agent-0.7.9-runtime.jar=destfile=/opt/bamboo-home/xml-data/build-dir/CFENV-BMASTER-JOB1/java-cfenv-jdbc/target/jacoco.exec
18-Jun-2019 18:34:22 [INFO]
18-Jun-2019 18:34:22 [INFO] --- maven-resources-plugin:2.6:resources (default-resources) @ java-cfenv-jdbc ---
18-Jun-2019 18:34:22 [INFO] Using 'UTF-8' encoding to copy filtered resources.
18-Jun-2019 18:34:22 [INFO] Copying 1 resource
18-Jun-2019 18:34:22 [INFO]
18-Jun-2019 18:34:22 [INFO] --- maven-compiler-plugin:3.8.0:compile (default-compile) @ java-cfenv-jdbc ---
18-Jun-2019 18:34:22 [INFO] Changes detected - recompiling the module!
18-Jun-2019 18:34:22 [INFO] Compiling 10 source files to /opt/bamboo-home/xml-data/build-dir/CFENV-BMASTER-JOB1/java-cfenv-jdbc/target/classes
18-Jun-2019 18:34:22 [INFO]
18-Jun-2019 18:34:22 [INFO] --- maven-resources-plugin:2.6:testResources (default-testResources) @ java-cfenv-jdbc ---
18-Jun-2019 18:34:22 [INFO] Using 'UTF-8' encoding to copy filtered resources.
18-Jun-2019 18:34:22 [INFO] Copying 14 resources
18-Jun-2019 18:34:22 [INFO]
18-Jun-2019 18:34:22 [INFO] --- maven-compiler-plugin:3.8.0:testCompile (default-testCompile) @ java-cfenv-jdbc ---
18-Jun-2019 18:34:22 [INFO] Changes detected - recompiling the module!
18-Jun-2019 18:34:22 [INFO] Compiling 7 source files to /opt/bamboo-home/xml-data/build-dir/CFENV-BMASTER-JOB1/java-cfenv-jdbc/target/test-classes
18-Jun-2019 18:34:22 [INFO]
18-Jun-2019 18:34:22 [INFO] --- maven-surefire-plugin:2.20:test (default-test) @ java-cfenv-jdbc ---
18-Jun-2019 18:34:22 [INFO]
18-Jun-2019 18:34:22 [INFO] -------------------------------------------------------
18-Jun-2019 18:34:22 [INFO]  T E S T S
18-Jun-2019 18:34:22 [INFO] -------------------------------------------------------
18-Jun-2019 18:34:23 [INFO] Running io.pivotal.cfenv.jdbc.PostgresqlJdbcTests
18-Jun-2019 18:34:24 [INFO] Tests run: 4, Failures: 0, Errors: 0, Skipped: 0, Time elapsed: 1.262 s - in io.pivotal.cfenv.jdbc.PostgresqlJdbcTests
18-Jun-2019 18:34:24 [INFO] Running io.pivotal.cfenv.jdbc.DB2JdbcTests
18-Jun-2019 18:34:24 [INFO] Tests run: 4, Failures: 0, Errors: 0, Skipped: 0, Time elapsed: 0.103 s - in io.pivotal.cfenv.jdbc.DB2JdbcTests
18-Jun-2019 18:34:24 [INFO] Running io.pivotal.cfenv.jdbc.SqlServerJdbcTests
18-Jun-2019 18:34:24 [INFO] Tests run: 2, Failures: 0, Errors: 0, Skipped: 0, Time elapsed: 0.042 s - in io.pivotal.cfenv.jdbc.SqlServerJdbcTests
18-Jun-2019 18:34:24 [INFO] Running io.pivotal.cfenv.jdbc.MySqlJdbcTests
18-Jun-2019 18:34:24 [INFO] Tests run: 9, Failures: 0, Errors: 0, Skipped: 0, Time elapsed: 0.238 s - in io.pivotal.cfenv.jdbc.MySqlJdbcTests
18-Jun-2019 18:34:24 [INFO] Running io.pivotal.cfenv.jdbc.CfJdbcEnvTests
18-Jun-2019 18:34:24 [INFO] Tests run: 1, Failures: 0, Errors: 0, Skipped: 0, Time elapsed: 0.048 s - in io.pivotal.cfenv.jdbc.CfJdbcEnvTests
18-Jun-2019 18:34:24 [INFO] Running io.pivotal.cfenv.jdbc.OracleJdbcTests
18-Jun-2019 18:34:24 [INFO] Tests run: 3, Failures: 0, Errors: 0, Skipped: 0, Time elapsed: 0.071 s - in io.pivotal.cfenv.jdbc.OracleJdbcTests
18-Jun-2019 18:34:25 [INFO]
18-Jun-2019 18:34:25 [INFO] Results:
18-Jun-2019 18:34:25 [INFO]
18-Jun-2019 18:34:25 [INFO] Tests run: 23, Failures: 0, Errors: 0, Skipped: 0
18-Jun-2019 18:34:25 [INFO]
18-Jun-2019 18:34:25 [INFO]
18-Jun-2019 18:34:25 [INFO] --- jacoco-maven-plugin:0.7.9:report (report) @ java-cfenv-jdbc ---
18-Jun-2019 18:34:25 [INFO] Loading execution data file /opt/bamboo-home/xml-data/build-dir/CFENV-BMASTER-JOB1/java-cfenv-jdbc/target/jacoco.exec
18-Jun-2019 18:34:25 [INFO] Analyzed bundle 'Java CF Env JDBC' with 9 classes
18-Jun-2019 18:34:25 [INFO]
18-Jun-2019 18:34:25 [INFO] --- maven-jar-plugin:3.0.2:jar (default-jar) @ java-cfenv-jdbc ---
18-Jun-2019 18:34:25 [INFO] Building jar: /opt/bamboo-home/xml-data/build-dir/CFENV-BMASTER-JOB1/java-cfenv-jdbc/target/java-cfenv-jdbc-1.1.1.BUILD-SNAPSHOT.jar
18-Jun-2019 18:34:25 [INFO]
18-Jun-2019 18:34:25 [INFO] >>> maven-source-plugin:3.0.1:jar (attach-sources) > generate-sources @ java-cfenv-jdbc >>>
18-Jun-2019 18:34:25 [INFO]
18-Jun-2019 18:34:25 [INFO] --- maven-checkstyle-plugin:3.0.0:check (validate) @ java-cfenv-jdbc ---
18-Jun-2019 18:34:25 [INFO]
18-Jun-2019 18:34:25 [INFO] --- jacoco-maven-plugin:0.7.9:prepare-agent (agent) @ java-cfenv-jdbc ---
18-Jun-2019 18:34:25 [INFO] argLine set to -javaagent:/home/bamboo/.m2/repository/org/jacoco/org.jacoco.agent/0.7.9/org.jacoco.agent-0.7.9-runtime.jar=destfile=/opt/bamboo-home/xml-data/build-dir/CFENV-BMASTER-JOB1/java-cfenv-jdbc/target/jacoco.exec
18-Jun-2019 18:34:25 [INFO]
18-Jun-2019 18:34:25 [INFO] <<< maven-source-plugin:3.0.1:jar (attach-sources) < generate-sources @ java-cfenv-jdbc <<<
18-Jun-2019 18:34:25 [INFO]
18-Jun-2019 18:34:25 [INFO]
18-Jun-2019 18:34:25 [INFO] --- maven-source-plugin:3.0.1:jar (attach-sources) @ java-cfenv-jdbc ---
18-Jun-2019 18:34:25 [INFO] Building jar: /opt/bamboo-home/xml-data/build-dir/CFENV-BMASTER-JOB1/java-cfenv-jdbc/target/java-cfenv-jdbc-1.1.1.BUILD-SNAPSHOT-sources.jar
18-Jun-2019 18:34:25 [INFO]
18-Jun-2019 18:34:25 [INFO] --- maven-javadoc-plugin:3.0.1:jar (attach-javadocs) @ java-cfenv-jdbc ---
18-Jun-2019 18:34:26 [INFO] Building jar: /opt/bamboo-home/xml-data/build-dir/CFENV-BMASTER-JOB1/java-cfenv-jdbc/target/java-cfenv-jdbc-1.1.1.BUILD-SNAPSHOT-javadoc.jar
18-Jun-2019 18:34:26 [INFO]
18-Jun-2019 18:34:26 [INFO] --- maven-javadoc-plugin:3.0.1:jar (javadoc) @ java-cfenv-jdbc ---
18-Jun-2019 18:34:26 [INFO] Building jar: /opt/bamboo-home/xml-data/build-dir/CFENV-BMASTER-JOB1/java-cfenv-jdbc/target/java-cfenv-jdbc-1.1.1.BUILD-SNAPSHOT-javadoc.jar
18-Jun-2019 18:34:26 [INFO]
18-Jun-2019 18:34:26 [INFO] --- maven-install-plugin:2.4:install (default-install) @ java-cfenv-jdbc ---
18-Jun-2019 18:34:26 [INFO] Installing /opt/bamboo-home/xml-data/build-dir/CFENV-BMASTER-JOB1/java-cfenv-jdbc/target/java-cfenv-jdbc-1.1.1.BUILD-SNAPSHOT.jar to /home/bamboo/.m2/repository/io/pivotal/cfenv/java-cfenv-jdbc/1.1.1.BUILD-SNAPSHOT/java-cfenv-jdbc-1.1.1.BUILD-SNAPSHOT.jar
18-Jun-2019 18:34:26 [INFO] Installing /opt/bamboo-home/xml-data/build-dir/CFENV-BMASTER-JOB1/java-cfenv-jdbc/pom.xml to /home/bamboo/.m2/repository/io/pivotal/cfenv/java-cfenv-jdbc/1.1.1.BUILD-SNAPSHOT/java-cfenv-jdbc-1.1.1.BUILD-SNAPSHOT.pom
18-Jun-2019 18:34:26 [INFO] Installing /opt/bamboo-home/xml-data/build-dir/CFENV-BMASTER-JOB1/java-cfenv-jdbc/target/java-cfenv-jdbc-1.1.1.BUILD-SNAPSHOT-sources.jar to /home/bamboo/.m2/repository/io/pivotal/cfenv/java-cfenv-jdbc/1.1.1.BUILD-SNAPSHOT/java-cfenv-jdbc-1.1.1.BUILD-SNAPSHOT-sources.jar
18-Jun-2019 18:34:26 [INFO] Installing /opt/bamboo-home/xml-data/build-dir/CFENV-BMASTER-JOB1/java-cfenv-jdbc/target/java-cfenv-jdbc-1.1.1.BUILD-SNAPSHOT-javadoc.jar to /home/bamboo/.m2/repository/io/pivotal/cfenv/java-cfenv-jdbc/1.1.1.BUILD-SNAPSHOT/java-cfenv-jdbc-1.1.1.BUILD-SNAPSHOT-javadoc.jar
18-Jun-2019 18:34:26 [INFO] Installing /opt/bamboo-home/xml-data/build-dir/CFENV-BMASTER-JOB1/java-cfenv-jdbc/target/java-cfenv-jdbc-1.1.1.BUILD-SNAPSHOT-javadoc.jar to /home/bamboo/.m2/repository/io/pivotal/cfenv/java-cfenv-jdbc/1.1.1.BUILD-SNAPSHOT/java-cfenv-jdbc-1.1.1.BUILD-SNAPSHOT-javadoc.jar
18-Jun-2019 18:34:26 [INFO]
18-Jun-2019 18:34:26 [INFO] ------------------< io.pivotal.cfenv:java-cfenv-boot >------------------
18-Jun-2019 18:34:26 [INFO] Building Java CF Env Spring Boot 1.1.1.BUILD-SNAPSHOT              [5/7]
18-Jun-2019 18:34:26 [INFO] --------------------------------[ jar ]---------------------------------
18-Jun-2019 18:34:27 [INFO]
18-Jun-2019 18:34:27 [INFO] --- maven-clean-plugin:2.5:clean (default-clean) @ java-cfenv-boot ---
18-Jun-2019 18:34:27 [INFO]
18-Jun-2019 18:34:27 [INFO] --- maven-checkstyle-plugin:3.0.0:check (validate) @ java-cfenv-boot ---
18-Jun-2019 18:34:27 [INFO]
18-Jun-2019 18:34:27 [INFO] --- jacoco-maven-plugin:0.7.9:prepare-agent (agent) @ java-cfenv-boot ---
18-Jun-2019 18:34:27 [INFO] argLine set to -javaagent:/home/bamboo/.m2/repository/org/jacoco/org.jacoco.agent/0.7.9/org.jacoco.agent-0.7.9-runtime.jar=destfile=/opt/bamboo-home/xml-data/build-dir/CFENV-BMASTER-JOB1/java-cfenv-boot/target/jacoco.exec
18-Jun-2019 18:34:27 [INFO]
18-Jun-2019 18:34:27 [INFO] --- maven-resources-plugin:2.6:resources (default-resources) @ java-cfenv-boot ---
18-Jun-2019 18:34:27 [INFO] Using 'UTF-8' encoding to copy filtered resources.
18-Jun-2019 18:34:27 [INFO] Copying 1 resource
18-Jun-2019 18:34:27 [INFO]
18-Jun-2019 18:34:27 [INFO] --- maven-compiler-plugin:3.8.0:compile (default-compile) @ java-cfenv-boot ---
18-Jun-2019 18:34:27 [INFO] Changes detected - recompiling the module!
18-Jun-2019 18:34:27 [INFO] Compiling 11 source files to /opt/bamboo-home/xml-data/build-dir/CFENV-BMASTER-JOB1/java-cfenv-boot/target/classes
18-Jun-2019 18:34:27 [INFO] /opt/bamboo-home/xml-data/build-dir/CFENV-BMASTER-JOB1/java-cfenv-boot/src/main/java/io/pivotal/cfenv/spring/boot/AmqpCfEnvProcessor.java: Some input files use unchecked or unsafe operations.
18-Jun-2019 18:34:27 [INFO] /opt/bamboo-home/xml-data/build-dir/CFENV-BMASTER-JOB1/java-cfenv-boot/src/main/java/io/pivotal/cfenv/spring/boot/AmqpCfEnvProcessor.java: Recompile with -Xlint:unchecked for details.
18-Jun-2019 18:34:27 [INFO]
18-Jun-2019 18:34:27 [INFO] --- maven-resources-plugin:2.6:testResources (default-testResources) @ java-cfenv-boot ---
18-Jun-2019 18:34:27 [INFO] Using 'UTF-8' encoding to copy filtered resources.
18-Jun-2019 18:34:27 [INFO] Copying 15 resources
18-Jun-2019 18:34:27 [INFO]
18-Jun-2019 18:34:27 [INFO] --- maven-compiler-plugin:3.8.0:testCompile (default-testCompile) @ java-cfenv-boot ---
18-Jun-2019 18:34:27 [INFO] Changes detected - recompiling the module!
18-Jun-2019 18:34:27 [INFO] Compiling 10 source files to /opt/bamboo-home/xml-data/build-dir/CFENV-BMASTER-JOB1/java-cfenv-boot/target/test-classes
18-Jun-2019 18:34:27 [INFO] /opt/bamboo-home/xml-data/build-dir/CFENV-BMASTER-JOB1/java-cfenv-boot/src/test/java/io/pivotal/cfenv/spring/boot/AmqpTests.java: /opt/bamboo-home/xml-data/build-dir/CFENV-BMASTER-JOB1/java-cfenv-boot/src/test/java/io/pivotal/cfenv/spring/boot/AmqpTests.java uses unchecked or unsafe operations.
18-Jun-2019 18:34:27 [INFO] /opt/bamboo-home/xml-data/build-dir/CFENV-BMASTER-JOB1/java-cfenv-boot/src/test/java/io/pivotal/cfenv/spring/boot/AmqpTests.java: Recompile with -Xlint:unchecked for details.
18-Jun-2019 18:34:27 [INFO]
18-Jun-2019 18:34:27 [INFO] --- maven-surefire-plugin:2.20:test (default-test) @ java-cfenv-boot ---
18-Jun-2019 18:34:27 [INFO]
18-Jun-2019 18:34:27 [INFO] -------------------------------------------------------
18-Jun-2019 18:34:27 [INFO]  T E S T S
18-Jun-2019 18:34:27 [INFO] -------------------------------------------------------
18-Jun-2019 18:34:27 [INFO] Running io.pivotal.cfenv.spring.boot.MongoCfEnvProcessorTests
18-Jun-2019 18:34:29 18:34:29.446 [main] DEBUG org.springframework.boot.context.logging.ClasspathLoggingApplicationListener - Application failed to start with classpath: [file:/opt/bamboo-home/xml-data/build-dir/CFENV-BMASTER-JOB1/java-cfenv-boot/target/surefire/surefirebooter303312696542567070.jar, file:/opt/users/bamboo/.m2/repository/org/jacoco/org.jacoco.agent/0.7.9/org.jacoco.agent-0.7.9-runtime.jar, file:/opt/users/bamboo/.m2/repository/org/jmockit/jmockit/1.24/jmockit-1.24.jar]
18-Jun-2019 18:34:29 18:34:29.458 [main] ERROR org.springframework.boot.SpringApplication - Application run failed
18-Jun-2019 18:34:29 java.lang.IllegalStateException: Exiting the application since the Spring Cloud Connector library has been detected on the classpath.  Please remove this dependency from your project and set the environment variable JBP_CONFIG_SPRING_AUTO_RECONFIGURATION '{enabled: false}' in the Cloud Foundry manifest.
18-Jun-2019 18:34:29         at io.pivotal.cfenv.spring.boot.ConnectorLibraryDetector.assertNoConnectorLibrary(ConnectorLibraryDetector.java:43)
18-Jun-2019 18:34:29         at io.pivotal.cfenv.spring.boot.MongoCfEnvProcessor.accept(MongoCfEnvProcessor.java:41)
18-Jun-2019 18:34:29         at java.util.stream.ReferencePipeline$2$1.accept(ReferencePipeline.java:174)
18-Jun-2019 18:34:29         at java.util.ArrayList$ArrayListSpliterator.forEachRemaining(ArrayList.java:1382)
18-Jun-2019 18:34:29         at java.util.stream.AbstractPipeline.copyInto(AbstractPipeline.java:482)
18-Jun-2019 18:34:29         at java.util.stream.AbstractPipeline.wrapAndCopyInto(AbstractPipeline.java:472)
18-Jun-2019 18:34:29         at java.util.stream.ReduceOps$ReduceOp.evaluateSequential(ReduceOps.java:708)
18-Jun-2019 18:34:29         at java.util.stream.AbstractPipeline.evaluate(AbstractPipeline.java:234)
18-Jun-2019 18:34:29         at java.util.stream.ReferencePipeline.collect(ReferencePipeline.java:499)
18-Jun-2019 18:34:29         at io.pivotal.cfenv.spring.boot.CfEnvironmentPostProcessor.postProcessEnvironment(CfEnvironmentPostProcessor.java:92)
18-Jun-2019 18:34:29         at org.springframework.boot.context.config.ConfigFileApplicationListener.onApplicationEnvironmentPreparedEvent(ConfigFileApplicationListener.java:177)
18-Jun-2019 18:34:29         at org.springframework.boot.context.config.ConfigFileApplicationListener.onApplicationEvent(ConfigFileApplicationListener.java:163)
18-Jun-2019 18:34:29         at org.springframework.context.event.SimpleApplicationEventMulticaster.doInvokeListener(SimpleApplicationEventMulticaster.java:172)
18-Jun-2019 18:34:29         at org.springframework.context.event.SimpleApplicationEventMulticaster.invokeListener(SimpleApplicationEventMulticaster.java:165)
18-Jun-2019 18:34:29         at org.springframework.context.event.SimpleApplicationEventMulticaster.multicastEvent(SimpleApplicationEventMulticaster.java:139)
18-Jun-2019 18:34:29         at org.springframework.context.event.SimpleApplicationEventMulticaster.multicastEvent(SimpleApplicationEventMulticaster.java:127)
18-Jun-2019 18:34:29         at org.springframework.boot.context.event.EventPublishingRunListener.environmentPrepared(EventPublishingRunListener.java:75)
18-Jun-2019 18:34:29         at org.springframework.boot.SpringApplicationRunListeners.environmentPrepared(SpringApplicationRunListeners.java:54)
18-Jun-2019 18:34:29         at org.springframework.boot.SpringApplication.prepareEnvironment(SpringApplication.java:347)
18-Jun-2019 18:34:29         at org.springframework.boot.SpringApplication.run(SpringApplication.java:306)
18-Jun-2019 18:34:29         at org.springframework.boot.builder.SpringApplicationBuilder.run(SpringApplicationBuilder.java:139)
18-Jun-2019 18:34:29         at io.pivotal.cfenv.spring.boot.MongoCfEnvProcessorTests.getEnvironment(MongoCfEnvProcessorTests.java:71)
18-Jun-2019 18:34:29         at io.pivotal.cfenv.spring.boot.MongoCfEnvProcessorTests.lambda$testWithConnectorLibraryOnCP$0(MongoCfEnvProcessorTests.java:45)
18-Jun-2019 18:34:29         at org.assertj.core.api.ThrowableAssert.catchThrowable(ThrowableAssert.java:62)
18-Jun-2019 18:34:29         at org.assertj.core.api.ThrowableTypeAssert.isThrownBy(ThrowableTypeAssert.java:59)
18-Jun-2019 18:34:29         at io.pivotal.cfenv.spring.boot.MongoCfEnvProcessorTests.testWithConnectorLibraryOnCP(MongoCfEnvProcessorTests.java:45)
18-Jun-2019 18:34:29         at sun.reflect.NativeMethodAccessorImpl.invoke0(Native Method)
18-Jun-2019 18:34:29         at sun.reflect.NativeMethodAccessorImpl.invoke(NativeMethodAccessorImpl.java:62)
18-Jun-2019 18:34:29         at sun.reflect.DelegatingMethodAccessorImpl.invoke(DelegatingMethodAccessorImpl.java:43)
18-Jun-2019 18:34:29         at java.lang.reflect.Method.invoke(Method.java:498)
18-Jun-2019 18:34:29         at org.junit.runners.model.FrameworkMethod$1.runReflectiveCall(FrameworkMethod.java:50)
18-Jun-2019 18:34:29         at org.junit.internal.runners.model.ReflectiveCallable.run(ReflectiveCallable.java:12)
18-Jun-2019 18:34:29         at org.junit.runners.model.FrameworkMethod.invokeExplosively(FrameworkMethod.java:47)
18-Jun-2019 18:34:29         at org.junit.internal.runners.statements.InvokeMethod.evaluate(InvokeMethod.java:17)
18-Jun-2019 18:34:29         at org.junit.internal.runners.statements.RunBefores.evaluate(RunBefores.java:26)
18-Jun-2019 18:34:29         at org.junit.internal.runners.statements.RunAfters.evaluate(RunAfters.java:27)
18-Jun-2019 18:34:29         at org.junit.runners.ParentRunner.runLeaf(ParentRunner.java:325)
18-Jun-2019 18:34:29         at org.junit.runners.BlockJUnit4ClassRunner.runChild(BlockJUnit4ClassRunner.java:78)
18-Jun-2019 18:34:29         at org.junit.runners.BlockJUnit4ClassRunner.runChild(BlockJUnit4ClassRunner.java:57)
18-Jun-2019 18:34:29         at org.junit.runners.ParentRunner$3.run(ParentRunner.java:290)
18-Jun-2019 18:34:29         at org.junit.runners.ParentRunner$1.schedule(ParentRunner.java:71)
18-Jun-2019 18:34:29         at org.junit.runners.ParentRunner.runChildren(ParentRunner.java:288)
18-Jun-2019 18:34:29         at org.junit.runners.ParentRunner.access$000(ParentRunner.java:58)
18-Jun-2019 18:34:29         at org.junit.runners.ParentRunner$2.evaluate(ParentRunner.java:268)
18-Jun-2019 18:34:29         at org.junit.runners.ParentRunner.run(ParentRunner.java:363)
18-Jun-2019 18:34:29         at org.apache.maven.surefire.junit4.JUnit4Provider.execute(JUnit4Provider.java:365)
18-Jun-2019 18:34:29         at org.apache.maven.surefire.junit4.JUnit4Provider.executeWithRerun(JUnit4Provider.java:272)
18-Jun-2019 18:34:29         at org.apache.maven.surefire.junit4.JUnit4Provider.executeTestSet(JUnit4Provider.java:236)
18-Jun-2019 18:34:29         at org.apache.maven.surefire.junit4.JUnit4Provider.invoke(JUnit4Provider.java:159)
18-Jun-2019 18:34:29         at org.apache.maven.surefire.booter.ForkedBooter.invokeProviderInSameClassLoader(ForkedBooter.java:386)
18-Jun-2019 18:34:29         at org.apache.maven.surefire.booter.ForkedBooter.runSuitesInProcess(ForkedBooter.java:323)
18-Jun-2019 18:34:29         at org.apache.maven.surefire.booter.ForkedBooter.main(ForkedBooter.java:143)
18-Jun-2019 18:34:29 2019-06-18 18:34:29.891  INFO 30058 --- [           main] o.a.maven.surefire.booter.ForkedBooter   : Starting ForkedBooter v2.20 on bamboo-16 with PID 30058 (started by bamboo in /opt/bamboo-home/xml-data/build-dir/CFENV-BMASTER-JOB1/java-cfenv-boot)
18-Jun-2019 18:34:29 2019-06-18 18:34:29.893  INFO 30058 --- [           main] o.a.maven.surefire.booter.ForkedBooter   : No active profile set, falling back to default profiles: default
18-Jun-2019 18:34:30 2019-06-18 18:34:30.679  INFO 30058 --- [           main] o.a.maven.surefire.booter.ForkedBooter   : Started ForkedBooter in 1.144 seconds (JVM running for 3.325)
18-Jun-2019 18:34:30 2019-06-18 18:34:30.793  INFO 30058 --- [           main] o.a.maven.surefire.booter.ForkedBooter   : Starting ForkedBooter v2.20 on bamboo-16 with PID 30058 (started by bamboo in /opt/bamboo-home/xml-data/build-dir/CFENV-BMASTER-JOB1/java-cfenv-boot)
18-Jun-2019 18:34:30 2019-06-18 18:34:30.793  INFO 30058 --- [           main] o.a.maven.surefire.booter.ForkedBooter   : No active profile set, falling back to default profiles: default
18-Jun-2019 18:34:30 2019-06-18 18:34:30.897  INFO 30058 --- [           main] o.a.maven.surefire.booter.ForkedBooter   : Started ForkedBooter in 0.13 seconds (JVM running for 3.543)
18-Jun-2019 18:34:30 [INFO] Tests run: 3, Failures: 0, Errors: 0, Skipped: 0, Time elapsed: 3.206 s - in io.pivotal.cfenv.spring.boot.MongoCfEnvProcessorTests
18-Jun-2019 18:34:30 [INFO] Running io.pivotal.cfenv.spring.boot.DeferredLogTests
18-Jun-2019 18:34:31 [INFO] Tests run: 20, Failures: 0, Errors: 0, Skipped: 0, Time elapsed: 0.394 s - in io.pivotal.cfenv.spring.boot.DeferredLogTests
18-Jun-2019 18:34:31 [INFO] Running io.pivotal.cfenv.spring.boot.CassandraCfEnvProcessorTests
18-Jun-2019 18:34:31 2019-06-18 18:34:31.351  INFO 30058 --- [           main] o.a.maven.surefire.booter.ForkedBooter   : Starting ForkedBooter v2.20 on bamboo-16 with PID 30058 (started by bamboo in /opt/bamboo-home/xml-data/build-dir/CFENV-BMASTER-JOB1/java-cfenv-boot)
18-Jun-2019 18:34:31 2019-06-18 18:34:31.352  INFO 30058 --- [           main] o.a.maven.surefire.booter.ForkedBooter   : No active profile set, falling back to default profiles: default
18-Jun-2019 18:34:31 2019-06-18 18:34:31.462  INFO 30058 --- [           main] o.a.maven.surefire.booter.ForkedBooter   : Started ForkedBooter in 0.143 seconds (JVM running for 4.109)
18-Jun-2019 18:34:31 2019-06-18 18:34:31.535  INFO 30058 --- [           main] o.a.maven.surefire.booter.ForkedBooter   : Starting ForkedBooter v2.20 on bamboo-16 with PID 30058 (started by bamboo in /opt/bamboo-home/xml-data/build-dir/CFENV-BMASTER-JOB1/java-cfenv-boot)
18-Jun-2019 18:34:31 2019-06-18 18:34:31.536  INFO 30058 --- [           main] o.a.maven.surefire.booter.ForkedBooter   : No active profile set, falling back to default profiles: default
18-Jun-2019 18:34:31 2019-06-18 18:34:31.664  INFO 30058 --- [           main] o.a.maven.surefire.booter.ForkedBooter   : Started ForkedBooter in 0.154 seconds (JVM running for 4.311)
18-Jun-2019 18:34:31 2019-06-18 18:34:31.745  INFO 30058 --- [           main] o.a.maven.surefire.booter.ForkedBooter   : Starting ForkedBooter v2.20 on bamboo-16 with PID 30058 (started by bamboo in /opt/bamboo-home/xml-data/build-dir/CFENV-BMASTER-JOB1/java-cfenv-boot)
18-Jun-2019 18:34:31 2019-06-18 18:34:31.746  INFO 30058 --- [           main] o.a.maven.surefire.booter.ForkedBooter   : No active profile set, falling back to default profiles: default
18-Jun-2019 18:34:31 2019-06-18 18:34:31.878  INFO 30058 --- [           main] o.a.maven.surefire.booter.ForkedBooter   : Started ForkedBooter in 0.163 seconds (JVM running for 4.524)
18-Jun-2019 18:34:31 [INFO] Tests run: 3, Failures: 0, Errors: 0, Skipped: 0, Time elapsed: 0.584 s - in io.pivotal.cfenv.spring.boot.CassandraCfEnvProcessorTests
18-Jun-2019 18:34:31 [INFO] Running io.pivotal.cfenv.spring.boot.AmqpCfEnvProcessorTests
18-Jun-2019 18:34:31 2019-06-18 18:34:31.956  INFO 30058 --- [           main] o.a.maven.surefire.booter.ForkedBooter   : Starting ForkedBooter v2.20 on bamboo-16 with PID 30058 (started by bamboo in /opt/bamboo-home/xml-data/build-dir/CFENV-BMASTER-JOB1/java-cfenv-boot)
18-Jun-2019 18:34:31 2019-06-18 18:34:31.957  INFO 30058 --- [           main] o.a.maven.surefire.booter.ForkedBooter   : No active profile set, falling back to default profiles: default
18-Jun-2019 18:34:32 2019-06-18 18:34:32.030  INFO 30058 --- [           main] o.a.maven.surefire.booter.ForkedBooter   : Started ForkedBooter in 0.098 seconds (JVM running for 4.676)
18-Jun-2019 18:34:32 2019-06-18 18:34:32.103  INFO 30058 --- [           main] o.a.maven.surefire.booter.ForkedBooter   : Starting ForkedBooter v2.20 on bamboo-16 with PID 30058 (started by bamboo in /opt/bamboo-home/xml-data/build-dir/CFENV-BMASTER-JOB1/java-cfenv-boot)
18-Jun-2019 18:34:32 2019-06-18 18:34:32.104  INFO 30058 --- [           main] o.a.maven.surefire.booter.ForkedBooter   : No active profile set, falling back to default profiles: default
18-Jun-2019 18:34:32 2019-06-18 18:34:32.168  INFO 30058 --- [           main] o.a.maven.surefire.booter.ForkedBooter   : Started ForkedBooter in 0.087 seconds (JVM running for 4.814)
18-Jun-2019 18:34:32 2019-06-18 18:34:32.249  INFO 30058 --- [           main] o.a.maven.surefire.booter.ForkedBooter   : Starting ForkedBooter v2.20 on bamboo-16 with PID 30058 (started by bamboo in /opt/bamboo-home/xml-data/build-dir/CFENV-BMASTER-JOB1/java-cfenv-boot)
18-Jun-2019 18:34:32 2019-06-18 18:34:32.249  INFO 30058 --- [           main] o.a.maven.surefire.booter.ForkedBooter   : No active profile set, falling back to default profiles: default
18-Jun-2019 18:34:32 2019-06-18 18:34:32.312  INFO 30058 --- [           main] o.a.maven.surefire.booter.ForkedBooter   : Started ForkedBooter in 0.085 seconds (JVM running for 4.958)
18-Jun-2019 18:34:32 2019-06-18 18:34:32.398  INFO 30058 --- [           main] o.a.maven.surefire.booter.ForkedBooter   : Starting ForkedBooter v2.20 on bamboo-16 with PID 30058 (started by bamboo in /opt/bamboo-home/xml-data/build-dir/CFENV-BMASTER-JOB1/java-cfenv-boot)
18-Jun-2019 18:34:32 2019-06-18 18:34:32.399  INFO 30058 --- [           main] o.a.maven.surefire.booter.ForkedBooter   : No active profile set, falling back to default profiles: default
18-Jun-2019 18:34:32 2019-06-18 18:34:32.462  INFO 30058 --- [           main] o.a.maven.surefire.booter.ForkedBooter   : Started ForkedBooter in 0.096 seconds (JVM running for 5.108)
18-Jun-2019 18:34:32 [INFO] Tests run: 4, Failures: 0, Errors: 0, Skipped: 0, Time elapsed: 0.581 s - in io.pivotal.cfenv.spring.boot.AmqpCfEnvProcessorTests
18-Jun-2019 18:34:32 [INFO] Running io.pivotal.cfenv.spring.boot.CfEnvProcessorPropertiesTests
18-Jun-2019 18:34:32 [INFO] Tests run: 1, Failures: 0, Errors: 0, Skipped: 0, Time elapsed: 0 s - in io.pivotal.cfenv.spring.boot.CfEnvProcessorPropertiesTests
18-Jun-2019 18:34:32 [INFO] Running io.pivotal.cfenv.spring.boot.RedisCfEnvProcessorTests
18-Jun-2019 18:34:32 2019-06-18 18:34:32.539  INFO 30058 --- [           main] o.a.maven.surefire.booter.ForkedBooter   : Starting ForkedBooter v2.20 on bamboo-16 with PID 30058 (started by bamboo in /opt/bamboo-home/xml-data/build-dir/CFENV-BMASTER-JOB1/java-cfenv-boot)
18-Jun-2019 18:34:32 2019-06-18 18:34:32.539  INFO 30058 --- [           main] o.a.maven.surefire.booter.ForkedBooter   : No active profile set, falling back to default profiles: default
18-Jun-2019 18:34:32 2019-06-18 18:34:32.597  INFO 30058 --- [           main] o.a.maven.surefire.booter.ForkedBooter   : Started ForkedBooter in 0.082 seconds (JVM running for 5.243)
18-Jun-2019 18:34:32 2019-06-18 18:34:32.672  INFO 30058 --- [           main] o.a.maven.surefire.booter.ForkedBooter   : Starting ForkedBooter v2.20 on bamboo-16 with PID 30058 (started by bamboo in /opt/bamboo-home/xml-data/build-dir/CFENV-BMASTER-JOB1/java-cfenv-boot)
18-Jun-2019 18:34:32 2019-06-18 18:34:32.673  INFO 30058 --- [           main] o.a.maven.surefire.booter.ForkedBooter   : No active profile set, falling back to default profiles: default
18-Jun-2019 18:34:32 2019-06-18 18:34:32.733  INFO 30058 --- [           main] o.a.maven.surefire.booter.ForkedBooter   : Started ForkedBooter in 0.081 seconds (JVM running for 5.379)
18-Jun-2019 18:34:32 2019-06-18 18:34:32.814  INFO 30058 --- [           main] o.a.maven.surefire.booter.ForkedBooter   : Starting ForkedBooter v2.20 on bamboo-16 with PID 30058 (started by bamboo in /opt/bamboo-home/xml-data/build-dir/CFENV-BMASTER-JOB1/java-cfenv-boot)
18-Jun-2019 18:34:32 2019-06-18 18:34:32.815  INFO 30058 --- [           main] o.a.maven.surefire.booter.ForkedBooter   : No active profile set, falling back to default profiles: default
18-Jun-2019 18:34:32 2019-06-18 18:34:32.876  INFO 30058 --- [           main] o.a.maven.surefire.booter.ForkedBooter   : Started ForkedBooter in 0.085 seconds (JVM running for 5.522)
18-Jun-2019 18:34:32 2019-06-18 18:34:32.963  INFO 30058 --- [           main] o.a.maven.surefire.booter.ForkedBooter   : Starting ForkedBooter v2.20 on bamboo-16 with PID 30058 (started by bamboo in /opt/bamboo-home/xml-data/build-dir/CFENV-BMASTER-JOB1/java-cfenv-boot)
18-Jun-2019 18:34:32 2019-06-18 18:34:32.964  INFO 30058 --- [           main] o.a.maven.surefire.booter.ForkedBooter   : No active profile set, falling back to default profiles: default
18-Jun-2019 18:34:33 2019-06-18 18:34:33.027  INFO 30058 --- [           main] o.a.maven.surefire.booter.ForkedBooter   : Started ForkedBooter in 0.083 seconds (JVM running for 5.673)
18-Jun-2019 18:34:33 [INFO] Tests run: 4, Failures: 0, Errors: 0, Skipped: 0, Time elapsed: 0.563 s - in io.pivotal.cfenv.spring.boot.RedisCfEnvProcessorTests
18-Jun-2019 18:34:33 [INFO] Running io.pivotal.cfenv.spring.boot.AmqpTests
18-Jun-2019 18:34:33 [INFO] Tests run: 8, Failures: 0, Errors: 0, Skipped: 0, Time elapsed: 0.475 s - in io.pivotal.cfenv.spring.boot.AmqpTests
18-Jun-2019 18:34:33 [INFO] Running io.pivotal.cfenv.spring.boot.DataSourceTests
18-Jun-2019 18:34:33 [INFO] Tests run: 1, Failures: 0, Errors: 0, Skipped: 0, Time elapsed: 0.06 s - in io.pivotal.cfenv.spring.boot.DataSourceTests
18-Jun-2019 18:34:33 [INFO] Running io.pivotal.cfenv.spring.boot.RedisTests
18-Jun-2019 18:34:33 [INFO] Tests run: 2, Failures: 0, Errors: 0, Skipped: 0, Time elapsed: 0.121 s - in io.pivotal.cfenv.spring.boot.RedisTests
18-Jun-2019 18:34:34 [INFO]
18-Jun-2019 18:34:34 [INFO] Results:
18-Jun-2019 18:34:34 [INFO]
18-Jun-2019 18:34:34 [INFO] Tests run: 46, Failures: 0, Errors: 0, Skipped: 0
18-Jun-2019 18:34:34 [INFO]
18-Jun-2019 18:34:34 [INFO]
18-Jun-2019 18:34:34 [INFO] --- jacoco-maven-plugin:0.7.9:report (report) @ java-cfenv-boot ---
18-Jun-2019 18:34:34 [INFO] Loading execution data file /opt/bamboo-home/xml-data/build-dir/CFENV-BMASTER-JOB1/java-cfenv-boot/target/jacoco.exec
18-Jun-2019 18:34:34 [INFO] Analyzed bundle 'Java CF Env Spring Boot' with 13 classes
18-Jun-2019 18:34:34 [INFO]
18-Jun-2019 18:34:34 [INFO] --- maven-jar-plugin:3.0.2:jar (default-jar) @ java-cfenv-boot ---
18-Jun-2019 18:34:34 [INFO] Building jar: /opt/bamboo-home/xml-data/build-dir/CFENV-BMASTER-JOB1/java-cfenv-boot/target/java-cfenv-boot-1.1.1.BUILD-SNAPSHOT.jar
18-Jun-2019 18:34:34 [INFO]
18-Jun-2019 18:34:34 [INFO] >>> maven-source-plugin:3.0.1:jar (attach-sources) > generate-sources @ java-cfenv-boot >>>
18-Jun-2019 18:34:34 [INFO]
18-Jun-2019 18:34:34 [INFO] --- maven-checkstyle-plugin:3.0.0:check (validate) @ java-cfenv-boot ---
18-Jun-2019 18:34:34 [INFO]
18-Jun-2019 18:34:34 [INFO] --- jacoco-maven-plugin:0.7.9:prepare-agent (agent) @ java-cfenv-boot ---
18-Jun-2019 18:34:34 [INFO] argLine set to -javaagent:/home/bamboo/.m2/repository/org/jacoco/org.jacoco.agent/0.7.9/org.jacoco.agent-0.7.9-runtime.jar=destfile=/opt/bamboo-home/xml-data/build-dir/CFENV-BMASTER-JOB1/java-cfenv-boot/target/jacoco.exec
18-Jun-2019 18:34:34 [INFO]
18-Jun-2019 18:34:34 [INFO] <<< maven-source-plugin:3.0.1:jar (attach-sources) < generate-sources @ java-cfenv-boot <<<
18-Jun-2019 18:34:34 [INFO]
18-Jun-2019 18:34:34 [INFO]
18-Jun-2019 18:34:34 [INFO] --- maven-source-plugin:3.0.1:jar (attach-sources) @ java-cfenv-boot ---
18-Jun-2019 18:34:34 [INFO] Building jar: /opt/bamboo-home/xml-data/build-dir/CFENV-BMASTER-JOB1/java-cfenv-boot/target/java-cfenv-boot-1.1.1.BUILD-SNAPSHOT-sources.jar
18-Jun-2019 18:34:34 [INFO]
18-Jun-2019 18:34:34 [INFO] --- maven-javadoc-plugin:3.0.1:jar (attach-javadocs) @ java-cfenv-boot ---
18-Jun-2019 18:34:35 [INFO] Building jar: /opt/bamboo-home/xml-data/build-dir/CFENV-BMASTER-JOB1/java-cfenv-boot/target/java-cfenv-boot-1.1.1.BUILD-SNAPSHOT-javadoc.jar
18-Jun-2019 18:34:35 [INFO]
18-Jun-2019 18:34:35 [INFO] --- maven-javadoc-plugin:3.0.1:jar (javadoc) @ java-cfenv-boot ---
18-Jun-2019 18:34:35 [INFO] Building jar: /opt/bamboo-home/xml-data/build-dir/CFENV-BMASTER-JOB1/java-cfenv-boot/target/java-cfenv-boot-1.1.1.BUILD-SNAPSHOT-javadoc.jar
18-Jun-2019 18:34:35 [INFO]
18-Jun-2019 18:34:35 [INFO] --- maven-install-plugin:2.4:install (default-install) @ java-cfenv-boot ---
18-Jun-2019 18:34:35 [INFO] Installing /opt/bamboo-home/xml-data/build-dir/CFENV-BMASTER-JOB1/java-cfenv-boot/target/java-cfenv-boot-1.1.1.BUILD-SNAPSHOT.jar to /home/bamboo/.m2/repository/io/pivotal/cfenv/java-cfenv-boot/1.1.1.BUILD-SNAPSHOT/java-cfenv-boot-1.1.1.BUILD-SNAPSHOT.jar
18-Jun-2019 18:34:35 [INFO] Installing /opt/bamboo-home/xml-data/build-dir/CFENV-BMASTER-JOB1/java-cfenv-boot/pom.xml to /home/bamboo/.m2/repository/io/pivotal/cfenv/java-cfenv-boot/1.1.1.BUILD-SNAPSHOT/java-cfenv-boot-1.1.1.BUILD-SNAPSHOT.pom
18-Jun-2019 18:34:35 [INFO] Installing /opt/bamboo-home/xml-data/build-dir/CFENV-BMASTER-JOB1/java-cfenv-boot/target/java-cfenv-boot-1.1.1.BUILD-SNAPSHOT-sources.jar to /home/bamboo/.m2/repository/io/pivotal/cfenv/java-cfenv-boot/1.1.1.BUILD-SNAPSHOT/java-cfenv-boot-1.1.1.BUILD-SNAPSHOT-sources.jar
18-Jun-2019 18:34:35 [INFO] Installing /opt/bamboo-home/xml-data/build-dir/CFENV-BMASTER-JOB1/java-cfenv-boot/target/java-cfenv-boot-1.1.1.BUILD-SNAPSHOT-javadoc.jar to /home/bamboo/.m2/repository/io/pivotal/cfenv/java-cfenv-boot/1.1.1.BUILD-SNAPSHOT/java-cfenv-boot-1.1.1.BUILD-SNAPSHOT-javadoc.jar
18-Jun-2019 18:34:35 [INFO] Installing /opt/bamboo-home/xml-data/build-dir/CFENV-BMASTER-JOB1/java-cfenv-boot/target/java-cfenv-boot-1.1.1.BUILD-SNAPSHOT-javadoc.jar to /home/bamboo/.m2/repository/io/pivotal/cfenv/java-cfenv-boot/1.1.1.BUILD-SNAPSHOT/java-cfenv-boot-1.1.1.BUILD-SNAPSHOT-javadoc.jar
18-Jun-2019 18:34:36 [INFO]
18-Jun-2019 18:34:36 [INFO] ------------< io.pivotal.cfenv:java-cfenv-boot-pivotal-scs >------------
18-Jun-2019 18:34:36 [INFO] Building Java CF Env Pivotal Spring Cloud Services 1.1.1.BUILD-SNAPSHOT [6/7]
18-Jun-2019 18:34:36 [INFO] --------------------------------[ jar ]---------------------------------
18-Jun-2019 18:34:36 [INFO] Downloading from spring-snapshots: http://repo.spring.io/libs-snapshot/org/springframework/boot/spring-boot-dependencies/2.1.2.RELEASE/spring-boot-dependencies-2.1.2.RELEASE.pom
18-Jun-2019 18:34:36 [INFO] Downloading from spring-milestones: http://repo.spring.io/libs-milestone-local/org/springframework/boot/spring-boot-dependencies/2.1.2.RELEASE/spring-boot-dependencies-2.1.2.RELEASE.pom
18-Jun-2019 18:34:36 [INFO] Downloading from spring-releases: http://repo.spring.io/release/org/springframework/boot/spring-boot-dependencies/2.1.2.RELEASE/spring-boot-dependencies-2.1.2.RELEASE.pom
18-Jun-2019 18:34:37 [INFO] Downloading from central: https://repo.maven.apache.org/maven2/org/springframework/boot/spring-boot-dependencies/2.1.2.RELEASE/spring-boot-dependencies-2.1.2.RELEASE.pom
18-Jun-2019 18:34:37 [INFO] Downloaded from central: https://repo.maven.apache.org/maven2/org/springframework/boot/spring-boot-dependencies/2.1.2.RELEASE/spring-boot-dependencies-2.1.2.RELEASE.pom (143 kB at 4.1 MB/s)
18-Jun-2019 18:34:37 [INFO] Downloading from spring-snapshots: http://repo.spring.io/libs-snapshot/org/springframework/boot/spring-boot-starter-actuator/2.1.1.RELEASE/spring-boot-starter-actuator-2.1.1.RELEASE.pom
18-Jun-2019 18:34:37 [INFO] Downloading from spring-milestones: http://repo.spring.io/libs-milestone-local/org/springframework/boot/spring-boot-starter-actuator/2.1.1.RELEASE/spring-boot-starter-actuator-2.1.1.RELEASE.pom
18-Jun-2019 18:34:37 [INFO] Downloading from spring-releases: http://repo.spring.io/release/org/springframework/boot/spring-boot-starter-actuator/2.1.1.RELEASE/spring-boot-starter-actuator-2.1.1.RELEASE.pom
18-Jun-2019 18:34:38 [INFO] Downloading from central: https://repo.maven.apache.org/maven2/org/springframework/boot/spring-boot-starter-actuator/2.1.1.RELEASE/spring-boot-starter-actuator-2.1.1.RELEASE.pom
18-Jun-2019 18:34:38 [INFO] Downloaded from central: https://repo.maven.apache.org/maven2/org/springframework/boot/spring-boot-starter-actuator/2.1.1.RELEASE/spring-boot-starter-actuator-2.1.1.RELEASE.pom (2.6 kB at 115 kB/s)
18-Jun-2019 18:34:38 [INFO] Downloading from spring-snapshots: http://repo.spring.io/libs-snapshot/org/springframework/boot/spring-boot-actuator-autoconfigure/2.1.1.RELEASE/spring-boot-actuator-autoconfigure-2.1.1.RELEASE.pom
18-Jun-2019 18:34:38 [INFO] Downloading from spring-milestones: http://repo.spring.io/libs-milestone-local/org/springframework/boot/spring-boot-actuator-autoconfigure/2.1.1.RELEASE/spring-boot-actuator-autoconfigure-2.1.1.RELEASE.pom
18-Jun-2019 18:34:38 [INFO] Downloading from spring-releases: http://repo.spring.io/release/org/springframework/boot/spring-boot-actuator-autoconfigure/2.1.1.RELEASE/spring-boot-actuator-autoconfigure-2.1.1.RELEASE.pom
18-Jun-2019 18:34:39 [INFO] Downloading from central: https://repo.maven.apache.org/maven2/org/springframework/boot/spring-boot-actuator-autoconfigure/2.1.1.RELEASE/spring-boot-actuator-autoconfigure-2.1.1.RELEASE.pom
18-Jun-2019 18:34:39 [INFO] Downloaded from central: https://repo.maven.apache.org/maven2/org/springframework/boot/spring-boot-actuator-autoconfigure/2.1.1.RELEASE/spring-boot-actuator-autoconfigure-2.1.1.RELEASE.pom (22 kB at 956 kB/s)
18-Jun-2019 18:34:39 [INFO] Downloading from spring-snapshots: http://repo.spring.io/libs-snapshot/org/springframework/boot/spring-boot-actuator/2.1.1.RELEASE/spring-boot-actuator-2.1.1.RELEASE.pom
18-Jun-2019 18:34:39 [INFO] Downloading from spring-milestones: http://repo.spring.io/libs-milestone-local/org/springframework/boot/spring-boot-actuator/2.1.1.RELEASE/spring-boot-actuator-2.1.1.RELEASE.pom
18-Jun-2019 18:34:40 [INFO] Downloading from spring-releases: http://repo.spring.io/release/org/springframework/boot/spring-boot-actuator/2.1.1.RELEASE/spring-boot-actuator-2.1.1.RELEASE.pom
18-Jun-2019 18:34:40 [INFO] Downloading from central: https://repo.maven.apache.org/maven2/org/springframework/boot/spring-boot-actuator/2.1.1.RELEASE/spring-boot-actuator-2.1.1.RELEASE.pom
18-Jun-2019 18:34:40 [INFO] Downloaded from central: https://repo.maven.apache.org/maven2/org/springframework/boot/spring-boot-actuator/2.1.1.RELEASE/spring-boot-actuator-2.1.1.RELEASE.pom (14 kB at 614 kB/s)
18-Jun-2019 18:34:40 [INFO] Downloading from spring-snapshots: http://repo.spring.io/libs-snapshot/org/springframework/boot/spring-boot-starter-web/2.1.1.RELEASE/spring-boot-starter-web-2.1.1.RELEASE.pom
18-Jun-2019 18:34:40 [INFO] Downloading from spring-milestones: http://repo.spring.io/libs-milestone-local/org/springframework/boot/spring-boot-starter-web/2.1.1.RELEASE/spring-boot-starter-web-2.1.1.RELEASE.pom
18-Jun-2019 18:34:41 [INFO] Downloading from spring-releases: http://repo.spring.io/release/org/springframework/boot/spring-boot-starter-web/2.1.1.RELEASE/spring-boot-starter-web-2.1.1.RELEASE.pom
18-Jun-2019 18:34:41 [INFO] Downloading from central: https://repo.maven.apache.org/maven2/org/springframework/boot/spring-boot-starter-web/2.1.1.RELEASE/spring-boot-starter-web-2.1.1.RELEASE.pom
18-Jun-2019 18:34:41 [INFO] Downloaded from central: https://repo.maven.apache.org/maven2/org/springframework/boot/spring-boot-starter-web/2.1.1.RELEASE/spring-boot-starter-web-2.1.1.RELEASE.pom (3.2 kB at 139 kB/s)
18-Jun-2019 18:34:41 [INFO] Downloading from spring-snapshots: http://repo.spring.io/libs-snapshot/org/springframework/boot/spring-boot-starter-json/2.1.1.RELEASE/spring-boot-starter-json-2.1.1.RELEASE.pom
18-Jun-2019 18:34:41 [INFO] Downloading from spring-milestones: http://repo.spring.io/libs-milestone-local/org/springframework/boot/spring-boot-starter-json/2.1.1.RELEASE/spring-boot-starter-json-2.1.1.RELEASE.pom
18-Jun-2019 18:34:42 [INFO] Downloading from spring-releases: http://repo.spring.io/release/org/springframework/boot/spring-boot-starter-json/2.1.1.RELEASE/spring-boot-starter-json-2.1.1.RELEASE.pom
18-Jun-2019 18:34:42 [INFO] Downloading from central: https://repo.maven.apache.org/maven2/org/springframework/boot/spring-boot-starter-json/2.1.1.RELEASE/spring-boot-starter-json-2.1.1.RELEASE.pom
18-Jun-2019 18:34:42 [INFO] Downloaded from central: https://repo.maven.apache.org/maven2/org/springframework/boot/spring-boot-starter-json/2.1.1.RELEASE/spring-boot-starter-json-2.1.1.RELEASE.pom (3.1 kB at 130 kB/s)
18-Jun-2019 18:34:42 [INFO] Downloading from spring-snapshots: http://repo.spring.io/libs-snapshot/org/springframework/boot/spring-boot-starter-tomcat/2.1.1.RELEASE/spring-boot-starter-tomcat-2.1.1.RELEASE.pom
18-Jun-2019 18:34:42 [INFO] Downloading from spring-milestones: http://repo.spring.io/libs-milestone-local/org/springframework/boot/spring-boot-starter-tomcat/2.1.1.RELEASE/spring-boot-starter-tomcat-2.1.1.RELEASE.pom
18-Jun-2019 18:34:43 [INFO] Downloading from spring-releases: http://repo.spring.io/release/org/springframework/boot/spring-boot-starter-tomcat/2.1.1.RELEASE/spring-boot-starter-tomcat-2.1.1.RELEASE.pom
18-Jun-2019 18:34:43 [INFO] Downloading from central: https://repo.maven.apache.org/maven2/org/springframework/boot/spring-boot-starter-tomcat/2.1.1.RELEASE/spring-boot-starter-tomcat-2.1.1.RELEASE.pom
18-Jun-2019 18:34:43 [INFO] Downloaded from central: https://repo.maven.apache.org/maven2/org/springframework/boot/spring-boot-starter-tomcat/2.1.1.RELEASE/spring-boot-starter-tomcat-2.1.1.RELEASE.pom (3.0 kB at 129 kB/s)
18-Jun-2019 18:34:43 [INFO] Downloading from spring-snapshots: http://repo.spring.io/libs-snapshot/org/springframework/boot/spring-boot-starter-actuator/2.1.1.RELEASE/spring-boot-starter-actuator-2.1.1.RELEASE.jar
18-Jun-2019 18:34:43 [INFO] Downloading from spring-snapshots: http://repo.spring.io/libs-snapshot/org/springframework/boot/spring-boot-actuator-autoconfigure/2.1.1.RELEASE/spring-boot-actuator-autoconfigure-2.1.1.RELEASE.jar
18-Jun-2019 18:34:43 [INFO] Downloading from spring-snapshots: http://repo.spring.io/libs-snapshot/org/springframework/boot/spring-boot-starter-web/2.1.1.RELEASE/spring-boot-starter-web-2.1.1.RELEASE.jar
18-Jun-2019 18:34:43 [INFO] Downloading from spring-snapshots: http://repo.spring.io/libs-snapshot/org/springframework/boot/spring-boot-starter-json/2.1.1.RELEASE/spring-boot-starter-json-2.1.1.RELEASE.jar
18-Jun-2019 18:34:43 [INFO] Downloading from spring-snapshots: http://repo.spring.io/libs-snapshot/org/springframework/boot/spring-boot-actuator/2.1.1.RELEASE/spring-boot-actuator-2.1.1.RELEASE.jar
18-Jun-2019 18:34:43 [INFO] Downloading from spring-snapshots: http://repo.spring.io/libs-snapshot/org/springframework/boot/spring-boot-starter-tomcat/2.1.1.RELEASE/spring-boot-starter-tomcat-2.1.1.RELEASE.jar
18-Jun-2019 18:34:44 [INFO] Downloading from spring-milestones: http://repo.spring.io/libs-milestone-local/org/springframework/boot/spring-boot-starter-actuator/2.1.1.RELEASE/spring-boot-starter-actuator-2.1.1.RELEASE.jar
18-Jun-2019 18:34:44 [INFO] Downloading from spring-milestones: http://repo.spring.io/libs-milestone-local/org/springframework/boot/spring-boot-actuator-autoconfigure/2.1.1.RELEASE/spring-boot-actuator-autoconfigure-2.1.1.RELEASE.jar
18-Jun-2019 18:34:44 [INFO] Downloading from spring-milestones: http://repo.spring.io/libs-milestone-local/org/springframework/boot/spring-boot-actuator/2.1.1.RELEASE/spring-boot-actuator-2.1.1.RELEASE.jar
18-Jun-2019 18:34:44 [INFO] Downloading from spring-milestones: http://repo.spring.io/libs-milestone-local/org/springframework/boot/spring-boot-starter-web/2.1.1.RELEASE/spring-boot-starter-web-2.1.1.RELEASE.jar
18-Jun-2019 18:34:44 [INFO] Downloading from spring-milestones: http://repo.spring.io/libs-milestone-local/org/springframework/boot/spring-boot-starter-json/2.1.1.RELEASE/spring-boot-starter-json-2.1.1.RELEASE.jar
18-Jun-2019 18:34:44 [INFO] Downloading from spring-milestones: http://repo.spring.io/libs-milestone-local/org/springframework/boot/spring-boot-starter-tomcat/2.1.1.RELEASE/spring-boot-starter-tomcat-2.1.1.RELEASE.jar
18-Jun-2019 18:34:44 [INFO] Downloading from spring-releases: http://repo.spring.io/release/org/springframework/boot/spring-boot-starter-actuator/2.1.1.RELEASE/spring-boot-starter-actuator-2.1.1.RELEASE.jar
18-Jun-2019 18:34:44 [INFO] Downloading from spring-releases: http://repo.spring.io/release/org/springframework/boot/spring-boot-starter-json/2.1.1.RELEASE/spring-boot-starter-json-2.1.1.RELEASE.jar
18-Jun-2019 18:34:44 [INFO] Downloading from spring-releases: http://repo.spring.io/release/org/springframework/boot/spring-boot-starter-web/2.1.1.RELEASE/spring-boot-starter-web-2.1.1.RELEASE.jar
18-Jun-2019 18:34:44 [INFO] Downloading from spring-releases: http://repo.spring.io/release/org/springframework/boot/spring-boot-actuator-autoconfigure/2.1.1.RELEASE/spring-boot-actuator-autoconfigure-2.1.1.RELEASE.jar
18-Jun-2019 18:34:44 [INFO] Downloading from spring-releases: http://repo.spring.io/release/org/springframework/boot/spring-boot-actuator/2.1.1.RELEASE/spring-boot-actuator-2.1.1.RELEASE.jar
18-Jun-2019 18:34:45 [INFO] Downloading from spring-releases: http://repo.spring.io/release/org/springframework/boot/spring-boot-starter-tomcat/2.1.1.RELEASE/spring-boot-starter-tomcat-2.1.1.RELEASE.jar
18-Jun-2019 18:34:45 [INFO] Downloading from central: https://repo.maven.apache.org/maven2/org/springframework/boot/spring-boot-starter-actuator/2.1.1.RELEASE/spring-boot-starter-actuator-2.1.1.RELEASE.jar
18-Jun-2019 18:34:45 [INFO] Downloading from central: https://repo.maven.apache.org/maven2/org/springframework/boot/spring-boot-actuator-autoconfigure/2.1.1.RELEASE/spring-boot-actuator-autoconfigure-2.1.1.RELEASE.jar
18-Jun-2019 18:34:45 [INFO] Downloading from central: https://repo.maven.apache.org/maven2/org/springframework/boot/spring-boot-actuator/2.1.1.RELEASE/spring-boot-actuator-2.1.1.RELEASE.jar
18-Jun-2019 18:34:45 [INFO] Downloading from central: https://repo.maven.apache.org/maven2/org/springframework/boot/spring-boot-starter-web/2.1.1.RELEASE/spring-boot-starter-web-2.1.1.RELEASE.jar
18-Jun-2019 18:34:45 [INFO] Downloading from central: https://repo.maven.apache.org/maven2/org/springframework/boot/spring-boot-starter-json/2.1.1.RELEASE/spring-boot-starter-json-2.1.1.RELEASE.jar
18-Jun-2019 18:34:45 [INFO] Downloaded from central: https://repo.maven.apache.org/maven2/org/springframework/boot/spring-boot-starter-actuator/2.1.1.RELEASE/spring-boot-starter-actuator-2.1.1.RELEASE.jar (424 B at 14 kB/s)
18-Jun-2019 18:34:45 [INFO] Downloading from central: https://repo.maven.apache.org/maven2/org/springframework/boot/spring-boot-starter-tomcat/2.1.1.RELEASE/spring-boot-starter-tomcat-2.1.1.RELEASE.jar
18-Jun-2019 18:34:45 [INFO] Downloaded from central: https://repo.maven.apache.org/maven2/org/springframework/boot/spring-boot-starter-json/2.1.1.RELEASE/spring-boot-starter-json-2.1.1.RELEASE.jar (421 B at 14 kB/s)
18-Jun-2019 18:34:45 [INFO] Downloaded from central: https://repo.maven.apache.org/maven2/org/springframework/boot/spring-boot-starter-web/2.1.1.RELEASE/spring-boot-starter-web-2.1.1.RELEASE.jar (421 B at 13 kB/s)
18-Jun-2019 18:34:45 [INFO] Downloaded from central: https://repo.maven.apache.org/maven2/org/springframework/boot/spring-boot-actuator/2.1.1.RELEASE/spring-boot-actuator-2.1.1.RELEASE.jar (515 kB at 11 MB/s)
18-Jun-2019 18:34:45 [INFO] Downloaded from central: https://repo.maven.apache.org/maven2/org/springframework/boot/spring-boot-starter-tomcat/2.1.1.RELEASE/spring-boot-starter-tomcat-2.1.1.RELEASE.jar (422 B at 7.5 kB/s)
18-Jun-2019 18:34:45 [INFO] Downloaded from central: https://repo.maven.apache.org/maven2/org/springframework/boot/spring-boot-actuator-autoconfigure/2.1.1.RELEASE/spring-boot-actuator-autoconfigure-2.1.1.RELEASE.jar (441 kB at 7.2 MB/s)
18-Jun-2019 18:34:45 [INFO]
18-Jun-2019 18:34:45 [INFO] --- maven-clean-plugin:2.5:clean (default-clean) @ java-cfenv-boot-pivotal-scs ---
18-Jun-2019 18:34:45 [INFO]
18-Jun-2019 18:34:45 [INFO] --- maven-checkstyle-plugin:3.0.0:check (validate) @ java-cfenv-boot-pivotal-scs ---
18-Jun-2019 18:34:45 [INFO]
18-Jun-2019 18:34:45 [INFO] --- jacoco-maven-plugin:0.7.9:prepare-agent (agent) @ java-cfenv-boot-pivotal-scs ---
18-Jun-2019 18:34:45 [INFO] argLine set to -javaagent:/home/bamboo/.m2/repository/org/jacoco/org.jacoco.agent/0.7.9/org.jacoco.agent-0.7.9-runtime.jar=destfile=/opt/bamboo-home/xml-data/build-dir/CFENV-BMASTER-JOB1/java-cfenv-boot-pivotal-scs/target/jacoco.exec
18-Jun-2019 18:34:45 [INFO]
18-Jun-2019 18:34:45 [INFO] --- maven-resources-plugin:2.6:resources (default-resources) @ java-cfenv-boot-pivotal-scs ---
18-Jun-2019 18:34:45 [INFO] Using 'UTF-8' encoding to copy filtered resources.
18-Jun-2019 18:34:45 [INFO] Copying 2 resources
18-Jun-2019 18:34:45 [INFO]
18-Jun-2019 18:34:45 [INFO] --- maven-compiler-plugin:3.8.0:compile (default-compile) @ java-cfenv-boot-pivotal-scs ---
18-Jun-2019 18:34:45 [INFO] Changes detected - recompiling the module!
18-Jun-2019 18:34:45 [INFO] Compiling 9 source files to /opt/bamboo-home/xml-data/build-dir/CFENV-BMASTER-JOB1/java-cfenv-boot-pivotal-scs/target/classes
18-Jun-2019 18:34:45 [INFO]
18-Jun-2019 18:34:45 [INFO] --- maven-resources-plugin:2.6:testResources (default-testResources) @ java-cfenv-boot-pivotal-scs ---
18-Jun-2019 18:34:45 [INFO] Using 'UTF-8' encoding to copy filtered resources.
18-Jun-2019 18:34:45 [INFO] Copying 7 resources
18-Jun-2019 18:34:45 [INFO]
18-Jun-2019 18:34:45 [INFO] --- maven-compiler-plugin:3.8.0:testCompile (default-testCompile) @ java-cfenv-boot-pivotal-scs ---
18-Jun-2019 18:34:45 [INFO] Changes detected - recompiling the module!
18-Jun-2019 18:34:45 [INFO] Compiling 9 source files to /opt/bamboo-home/xml-data/build-dir/CFENV-BMASTER-JOB1/java-cfenv-boot-pivotal-scs/target/test-classes
18-Jun-2019 18:34:45 [INFO]
18-Jun-2019 18:34:45 [INFO] --- maven-surefire-plugin:2.20:test (default-test) @ java-cfenv-boot-pivotal-scs ---
18-Jun-2019 18:34:45 [INFO]
18-Jun-2019 18:34:45 [INFO] -------------------------------------------------------
18-Jun-2019 18:34:45 [INFO]  T E S T S
18-Jun-2019 18:34:45 [INFO] -------------------------------------------------------
18-Jun-2019 18:34:46 [INFO] Running io.pivotal.cfenv.boot.scs.PlainTextConfigClientAutoConfigTests
18-Jun-2019 18:34:46 18:34:46.699 [main] DEBUG org.springframework.web.context.support.AnnotationConfigWebApplicationContext - Refreshing Root WebApplicationContext
18-Jun-2019 18:34:46 18:34:46.776 [main] DEBUG org.springframework.web.context.support.AnnotationConfigWebApplicationContext - Registering annotated classes: [class io.pivotal.cfenv.boot.scs.ConfigClientOAuth2BootstrapConfiguration,class org.springframework.cloud.config.client.ConfigClientAutoConfiguration,class io.pivotal.cfenv.boot.scs.PlainTextConfigClientAutoConfiguration,class org.springframework.cloud.config.client.ConfigServiceBootstrapConfiguration]
18-Jun-2019 18:34:46 18:34:46.889 [main] DEBUG org.springframework.beans.factory.support.DefaultListableBeanFactory - Creating shared instance of singleton bean 'org.springframework.context.annotation.internalConfigurationAnnotationProcessor'
18-Jun-2019 18:34:46 18:34:46.969 [main] DEBUG org.springframework.beans.factory.support.DefaultListableBeanFactory - Creating shared instance of singleton bean 'org.springframework.boot.autoconfigure.condition.BeanTypeRegistry'
18-Jun-2019 18:34:46 18:34:46.978 [main] DEBUG org.springframework.beans.factory.support.DefaultListableBeanFactory - Overriding bean definition for bean 'configClientProperties' with a different definition: replacing [Root bean: class [null]; scope=; abstract=false; lazyInit=false; autowireMode=3; dependencyCheck=0; autowireCandidate=true; primary=false; factoryBeanName=configClientAutoConfiguration; factoryMethodName=configClientProperties; initMethodName=null; destroyMethodName=(inferred); defined in org.springframework.cloud.config.client.ConfigClientAutoConfiguration] with [Root bean: class [null]; scope=; abstract=false; lazyInit=false; autowireMode=3; dependencyCheck=0; autowireCandidate=true; primary=false; factoryBeanName=configServiceBootstrapConfiguration; factoryMethodName=configClientProperties; initMethodName=null; destroyMethodName=(inferred); defined in org.springframework.cloud.config.client.ConfigServiceBootstrapConfiguration]
18-Jun-2019 18:34:47 18:34:47.082 [main] DEBUG org.springframework.beans.factory.support.DefaultListableBeanFactory - Creating shared instance of singleton bean 'org.springframework.context.event.internalEventListenerProcessor'
18-Jun-2019 18:34:47 18:34:47.085 [main] DEBUG org.springframework.beans.factory.support.DefaultListableBeanFactory - Creating shared instance of singleton bean 'org.springframework.boot.context.properties.ConfigurationBeanFactoryMetadata'
18-Jun-2019 18:34:47 18:34:47.085 [main] DEBUG org.springframework.beans.factory.support.DefaultListableBeanFactory - Creating shared instance of singleton bean 'org.springframework.context.event.internalEventListenerFactory'
18-Jun-2019 18:34:47 18:34:47.088 [main] DEBUG org.springframework.beans.factory.support.DefaultListableBeanFactory - Creating shared instance of singleton bean 'org.springframework.context.annotation.internalAutowiredAnnotationProcessor'
18-Jun-2019 18:34:47 18:34:47.089 [main] DEBUG org.springframework.beans.factory.support.DefaultListableBeanFactory - Creating shared instance of singleton bean 'org.springframework.context.annotation.internalCommonAnnotationProcessor'
18-Jun-2019 18:34:47 18:34:47.092 [main] DEBUG org.springframework.beans.factory.support.DefaultListableBeanFactory - Creating shared instance of singleton bean 'org.springframework.boot.context.properties.ConfigurationPropertiesBindingPostProcessor'
18-Jun-2019 18:34:47 18:34:47.106 [main] DEBUG org.springframework.ui.context.support.UiApplicationContextUtils - Unable to locate ThemeSource with name 'themeSource': using default [org.springframework.ui.context.support.ResourceBundleThemeSource@27d6267e]
18-Jun-2019 18:34:47 18:34:47.107 [main] DEBUG org.springframework.beans.factory.support.DefaultListableBeanFactory - Creating shared instance of singleton bean 'configClientAutoConfiguration'
18-Jun-2019 18:34:47 18:34:47.113 [main] DEBUG org.springframework.beans.factory.support.DefaultListableBeanFactory - Creating shared instance of singleton bean 'plainTextConfigClientAutoConfiguration'
18-Jun-2019 18:34:47 18:34:47.114 [main] DEBUG org.springframework.beans.factory.support.DefaultListableBeanFactory - Creating shared instance of singleton bean 'configServiceBootstrapConfiguration'
18-Jun-2019 18:34:47 18:34:47.126 [main] DEBUG org.springframework.beans.factory.support.DefaultListableBeanFactory - Creating shared instance of singleton bean 'configClientProperties'
18-Jun-2019 18:34:47 18:34:47.268 [main] DEBUG org.springframework.beans.factory.support.DefaultListableBeanFactory - Creating shared instance of singleton bean 'configClientHealthProperties'
18-Jun-2019 18:34:47 18:34:47.277 [main] DEBUG org.springframework.beans.factory.support.DefaultListableBeanFactory - Creating shared instance of singleton bean 'configServicePropertySource'
18-Jun-2019 18:34:47 18:34:47.280 [main] DEBUG org.springframework.beans.factory.support.DefaultListableBeanFactory - Autowiring by type from bean name 'configServicePropertySource' via factory method to bean named 'configClientProperties'
18-Jun-2019 18:34:47 18:34:47.401 [main] DEBUG org.springframework.web.context.support.AnnotationConfigWebApplicationContext - Closing Root WebApplicationContext, started on Tue Jun 18 18:34:46 UTC 2019
18-Jun-2019 18:34:47 18:34:47.409 [main] DEBUG org.springframework.web.context.support.AnnotationConfigWebApplicationContext - Refreshing Root WebApplicationContext
18-Jun-2019 18:34:47 18:34:47.410 [main] DEBUG org.springframework.web.context.support.AnnotationConfigWebApplicationContext - Registering annotated classes: [class io.pivotal.cfenv.boot.scs.ConfigClientOAuth2BootstrapConfiguration,class org.springframework.cloud.config.client.ConfigClientAutoConfiguration,class io.pivotal.cfenv.boot.scs.PlainTextConfigClientAutoConfiguration,class org.springframework.cloud.config.client.ConfigServiceBootstrapConfiguration]
18-Jun-2019 18:34:47 18:34:47.413 [main] DEBUG org.springframework.core.env.PropertySourcesPropertyResolver - Found key 'spring.cloud.config.client.oauth2.client-id' in PropertySource 'configurationProperties' with value of type String
18-Jun-2019 18:34:47 18:34:47.415 [main] DEBUG org.springframework.beans.factory.support.DefaultListableBeanFactory - Creating shared instance of singleton bean 'org.springframework.context.annotation.internalConfigurationAnnotationProcessor'
18-Jun-2019 18:34:47 18:34:47.416 [main] DEBUG org.springframework.core.env.PropertySourcesPropertyResolver - Found key 'spring.cloud.config.client.oauth2.client-id' in PropertySource 'configurationProperties' with value of type String
18-Jun-2019 18:34:47 18:34:47.430 [main] DEBUG org.springframework.core.env.PropertySourcesPropertyResolver - Found key 'spring.cloud.config.client.oauth2.client-id' in PropertySource 'configurationProperties' with value of type String
18-Jun-2019 18:34:47 18:34:47.434 [main] DEBUG org.springframework.beans.factory.support.DefaultListableBeanFactory - Creating shared instance of singleton bean 'org.springframework.boot.autoconfigure.condition.BeanTypeRegistry'
18-Jun-2019 18:34:47 18:34:47.435 [main] DEBUG org.springframework.core.env.PropertySourcesPropertyResolver - Found key 'spring.cloud.config.client.oauth2.client-id' in PropertySource 'configurationProperties' with value of type String
18-Jun-2019 18:34:47 18:34:47.435 [main] DEBUG org.springframework.core.env.PropertySourcesPropertyResolver - Found key 'spring.cloud.config.client.oauth2.client-secret' in PropertySource 'configurationProperties' with value of type String
18-Jun-2019 18:34:47 18:34:47.436 [main] DEBUG org.springframework.beans.factory.support.DefaultListableBeanFactory - Overriding bean definition for bean 'configClientProperties' with a different definition: replacing [Root bean: class [null]; scope=; abstract=false; lazyInit=false; autowireMode=3; dependencyCheck=0; autowireCandidate=true; primary=false; factoryBeanName=configClientAutoConfiguration; factoryMethodName=configClientProperties; initMethodName=null; destroyMethodName=(inferred); defined in org.springframework.cloud.config.client.ConfigClientAutoConfiguration] with [Root bean: class [null]; scope=; abstract=false; lazyInit=false; autowireMode=3; dependencyCheck=0; autowireCandidate=true; primary=false; factoryBeanName=configServiceBootstrapConfiguration; factoryMethodName=configClientProperties; initMethodName=null; destroyMethodName=(inferred); defined in org.springframework.cloud.config.client.ConfigServiceBootstrapConfiguration]
18-Jun-2019 18:34:47 18:34:47.444 [main] DEBUG org.springframework.beans.factory.support.DefaultListableBeanFactory - Creating shared instance of singleton bean 'org.springframework.context.event.internalEventListenerProcessor'
18-Jun-2019 18:34:47 18:34:47.444 [main] DEBUG org.springframework.beans.factory.support.DefaultListableBeanFactory - Creating shared instance of singleton bean 'org.springframework.boot.context.properties.ConfigurationBeanFactoryMetadata'
18-Jun-2019 18:34:47 18:34:47.445 [main] DEBUG org.springframework.beans.factory.support.DefaultListableBeanFactory - Creating shared instance of singleton bean 'org.springframework.context.event.internalEventListenerFactory'
18-Jun-2019 18:34:47 18:34:47.446 [main] DEBUG org.springframework.beans.factory.support.DefaultListableBeanFactory - Creating shared instance of singleton bean 'org.springframework.context.annotation.internalAutowiredAnnotationProcessor'
18-Jun-2019 18:34:47 18:34:47.446 [main] DEBUG org.springframework.beans.factory.support.DefaultListableBeanFactory - Creating shared instance of singleton bean 'org.springframework.context.annotation.internalCommonAnnotationProcessor'
18-Jun-2019 18:34:47 18:34:47.447 [main] DEBUG org.springframework.beans.factory.support.DefaultListableBeanFactory - Creating shared instance of singleton bean 'org.springframework.boot.context.properties.ConfigurationPropertiesBindingPostProcessor'
18-Jun-2019 18:34:47 18:34:47.447 [main] DEBUG org.springframework.ui.context.support.UiApplicationContextUtils - Unable to locate ThemeSource with name 'themeSource': using default [org.springframework.ui.context.support.ResourceBundleThemeSource@2d2fe68a]
18-Jun-2019 18:34:47 18:34:47.447 [main] DEBUG org.springframework.beans.factory.support.DefaultListableBeanFactory - Creating shared instance of singleton bean 'configClientOAuth2BootstrapConfiguration'
18-Jun-2019 18:34:47 18:34:47.448 [main] DEBUG org.springframework.beans.factory.support.DefaultListableBeanFactory - Creating shared instance of singleton bean 'configClientAutoConfiguration'
18-Jun-2019 18:34:47 18:34:47.448 [main] DEBUG org.springframework.beans.factory.support.DefaultListableBeanFactory - Creating shared instance of singleton bean 'plainTextConfigClientAutoConfiguration'
18-Jun-2019 18:34:47 18:34:47.449 [main] DEBUG org.springframework.beans.factory.support.DefaultListableBeanFactory - Creating shared instance of singleton bean 'configServiceBootstrapConfiguration'
18-Jun-2019 18:34:47 18:34:47.450 [main] DEBUG org.springframework.beans.factory.support.DefaultListableBeanFactory - Creating shared instance of singleton bean 'io.pivotal.cfenv.boot.scs.ConfigClientOAuth2BootstrapConfiguration$ConfigClientOAuth2Configurer'
18-Jun-2019 18:34:47 18:34:47.455 [main] DEBUG org.springframework.core.LocalVariableTableParameterNameDiscoverer - Cannot find '.class' file for class [class io.pivotal.cfenv.boot.scs.ConfigClientOAuth2BootstrapConfiguration$ConfigClientOAuth2Configurer$$EnhancerBySpringCGLIB$$28ceda52] - unable to determine constructor/method parameter names
18-Jun-2019 18:34:47 18:34:47.455 [main] DEBUG org.springframework.beans.factory.support.DefaultListableBeanFactory - Creating shared instance of singleton bean 'configServicePropertySource'
18-Jun-2019 18:34:47 18:34:47.456 [main] DEBUG org.springframework.beans.factory.support.DefaultListableBeanFactory - Creating shared instance of singleton bean 'configClientProperties'
18-Jun-2019 18:34:47 18:34:47.477 [main] DEBUG org.springframework.beans.factory.support.DefaultListableBeanFactory - Autowiring by type from bean name 'configServicePropertySource' via factory method to bean named 'configClientProperties'
18-Jun-2019 18:34:47 18:34:47.478 [main] DEBUG org.springframework.beans.factory.support.DefaultListableBeanFactory - Creating shared instance of singleton bean 'spring.cloud.config.client.oauth2-io.pivotal.cfenv.boot.scs.ConfigClientOAuth2ResourceDetails'
18-Jun-2019 18:34:47 18:34:47.493 [main] DEBUG org.springframework.beans.factory.support.DefaultListableBeanFactory - Autowiring by type from bean name 'io.pivotal.cfenv.boot.scs.ConfigClientOAuth2BootstrapConfiguration$ConfigClientOAuth2Configurer' via constructor to bean named 'configClientOAuth2BootstrapConfiguration'
18-Jun-2019 18:34:47 18:34:47.494 [main] DEBUG org.springframework.beans.factory.support.DefaultListableBeanFactory - Autowiring by type from bean name 'io.pivotal.cfenv.boot.scs.ConfigClientOAuth2BootstrapConfiguration$ConfigClientOAuth2Configurer' via constructor to bean named 'configServicePropertySource'
18-Jun-2019 18:34:47 18:34:47.494 [main] DEBUG org.springframework.beans.factory.support.DefaultListableBeanFactory - Autowiring by type from bean name 'io.pivotal.cfenv.boot.scs.ConfigClientOAuth2BootstrapConfiguration$ConfigClientOAuth2Configurer' via constructor to bean named 'spring.cloud.config.client.oauth2-io.pivotal.cfenv.boot.scs.ConfigClientOAuth2ResourceDetails'
18-Jun-2019 18:34:47 18:34:47.908 [main] DEBUG org.springframework.beans.factory.support.DefaultListableBeanFactory - Creating shared instance of singleton bean 'configClientHealthProperties'
18-Jun-2019 18:34:47 18:34:47.909 [main] DEBUG org.springframework.beans.factory.support.DefaultListableBeanFactory - Creating shared instance of singleton bean 'plainTextConfigClient'
18-Jun-2019 18:34:47 18:34:47.910 [main] DEBUG org.springframework.beans.factory.support.DefaultListableBeanFactory - Autowiring by type from bean name 'plainTextConfigClient' via factory method to bean named 'spring.cloud.config.client.oauth2-io.pivotal.cfenv.boot.scs.ConfigClientOAuth2ResourceDetails'
18-Jun-2019 18:34:47 18:34:47.910 [main] DEBUG org.springframework.beans.factory.support.DefaultListableBeanFactory - Autowiring by type from bean name 'plainTextConfigClient' via factory method to bean named 'configClientProperties'
18-Jun-2019 18:34:47 18:34:47.928 [main] DEBUG org.springframework.web.context.support.AnnotationConfigWebApplicationContext - Closing Root WebApplicationContext, started on Tue Jun 18 18:34:47 UTC 2019
18-Jun-2019 18:34:47 [INFO] Tests run: 2, Failures: 0, Errors: 0, Skipped: 0, Time elapsed: 1.622 s - in io.pivotal.cfenv.boot.scs.PlainTextConfigClientAutoConfigTests
18-Jun-2019 18:34:47 [INFO] Running io.pivotal.cfenv.boot.scs.VaultTokenRenewalAutoConfigurationTest
18-Jun-2019 18:34:47 18:34:47.951 [main] DEBUG org.springframework.test.context.junit4.SpringJUnit4ClassRunner - SpringJUnit4ClassRunner constructor called with [class io.pivotal.cfenv.boot.scs.VaultTokenRenewalAutoConfigurationTest]
18-Jun-2019 18:34:47 18:34:47.953 [main] DEBUG org.springframework.test.context.BootstrapUtils - Instantiating CacheAwareContextLoaderDelegate from class [org.springframework.test.context.cache.DefaultCacheAwareContextLoaderDelegate]
18-Jun-2019 18:34:47 18:34:47.956 [main] DEBUG org.springframework.test.context.BootstrapUtils - Instantiating BootstrapContext using constructor [public org.springframework.test.context.support.DefaultBootstrapContext(java.lang.Class,org.springframework.test.context.CacheAwareContextLoaderDelegate)]
18-Jun-2019 18:34:47 18:34:47.959 [main] DEBUG org.springframework.test.context.BootstrapUtils - Instantiating TestContextBootstrapper for test class [io.pivotal.cfenv.boot.scs.VaultTokenRenewalAutoConfigurationTest] from class [org.springframework.boot.test.context.SpringBootTestContextBootstrapper]
18-Jun-2019 18:34:47 18:34:47.967 [main] INFO org.springframework.boot.test.context.SpringBootTestContextBootstrapper - Neither @ContextConfiguration nor @ContextHierarchy found for test class [io.pivotal.cfenv.boot.scs.VaultTokenRenewalAutoConfigurationTest], using SpringBootContextLoader
18-Jun-2019 18:34:47 18:34:47.968 [main] DEBUG org.springframework.test.context.support.AbstractContextLoader - Did not detect default resource location for test class [io.pivotal.cfenv.boot.scs.VaultTokenRenewalAutoConfigurationTest]: class path resource [io/pivotal/cfenv/boot/scs/VaultTokenRenewalAutoConfigurationTest-context.xml] does not exist
18-Jun-2019 18:34:47 18:34:47.968 [main] DEBUG org.springframework.test.context.support.AbstractContextLoader - Did not detect default resource location for test class [io.pivotal.cfenv.boot.scs.VaultTokenRenewalAutoConfigurationTest]: class path resource [io/pivotal/cfenv/boot/scs/VaultTokenRenewalAutoConfigurationTestContext.groovy] does not exist
18-Jun-2019 18:34:47 18:34:47.968 [main] INFO org.springframework.test.context.support.AbstractContextLoader - Could not detect default resource locations for test class [io.pivotal.cfenv.boot.scs.VaultTokenRenewalAutoConfigurationTest]: no resource found for suffixes {-context.xml, Context.groovy}.
18-Jun-2019 18:34:47 18:34:47.998 [main] DEBUG org.springframework.test.context.support.ActiveProfilesUtils - Could not find an 'annotation declaring class' for annotation type [org.springframework.test.context.ActiveProfiles] and class [io.pivotal.cfenv.boot.scs.VaultTokenRenewalAutoConfigurationTest]
18-Jun-2019 18:34:48 18:34:48.022 [main] DEBUG org.springframework.boot.test.context.SpringBootTestContextBootstrapper - @TestExecutionListeners is not present for class [io.pivotal.cfenv.boot.scs.VaultTokenRenewalAutoConfigurationTest]: using defaults.
18-Jun-2019 18:34:48 18:34:48.022 [main] INFO org.springframework.boot.test.context.SpringBootTestContextBootstrapper - Loaded default TestExecutionListener class names from location [META-INF/spring.factories]: [org.springframework.boot.test.mock.mockito.MockitoTestExecutionListener, org.springframework.boot.test.mock.mockito.ResetMocksTestExecutionListener, org.springframework.boot.test.autoconfigure.restdocs.RestDocsTestExecutionListener, org.springframework.boot.test.autoconfigure.web.client.MockRestServiceServerResetTestExecutionListener, org.springframework.boot.test.autoconfigure.web.servlet.MockMvcPrintOnlyOnFailureTestExecutionListener, org.springframework.boot.test.autoconfigure.web.servlet.WebDriverTestExecutionListener, org.springframework.test.context.web.ServletTestExecutionListener, org.springframework.test.context.support.DirtiesContextBeforeModesTestExecutionListener, org.springframework.test.context.support.DependencyInjectionTestExecutionListener, org.springframework.test.context.support.DirtiesContextTestExecutionListener, org.springframework.test.context.transaction.TransactionalTestExecutionListener, org.springframework.test.context.jdbc.SqlScriptsTestExecutionListener]
18-Jun-2019 18:34:48 18:34:48.032 [main] DEBUG org.springframework.boot.test.context.SpringBootTestContextBootstrapper - Skipping candidate TestExecutionListener [org.springframework.test.context.transaction.TransactionalTestExecutionListener] due to a missing dependency. Specify custom listener classes or make the default listener classes and their required dependencies available. Offending class: [org/springframework/transaction/TransactionDefinition]
18-Jun-2019 18:34:48 18:34:48.033 [main] DEBUG org.springframework.boot.test.context.SpringBootTestContextBootstrapper - Skipping candidate TestExecutionListener [org.springframework.test.context.jdbc.SqlScriptsTestExecutionListener] due to a missing dependency. Specify custom listener classes or make the default listener classes and their required dependencies available. Offending class: [org/springframework/transaction/interceptor/TransactionAttribute]
18-Jun-2019 18:34:48 18:34:48.033 [main] INFO org.springframework.boot.test.context.SpringBootTestContextBootstrapper - Using TestExecutionListeners: [org.springframework.test.context.web.ServletTestExecutionListener@1f1e4e04, org.springframework.test.context.support.DirtiesContextBeforeModesTestExecutionListener@4a5e1a3a, org.springframework.boot.test.mock.mockito.MockitoTestExecutionListener@532f568e, org.springframework.boot.test.autoconfigure.SpringBootDependencyInjectionTestExecutionListener@dd3586e, org.springframework.test.context.support.DirtiesContextTestExecutionListener@605049be, org.springframework.boot.test.mock.mockito.ResetMocksTestExecutionListener@5ae50044, org.springframework.boot.test.autoconfigure.restdocs.RestDocsTestExecutionListener@73d7b6b0, org.springframework.boot.test.autoconfigure.web.client.MockRestServiceServerResetTestExecutionListener@64d0908c, org.springframework.boot.test.autoconfigure.web.servlet.MockMvcPrintOnlyOnFailureTestExecutionListener@62f2811, org.springframework.boot.test.autoconfigure.web.servlet.WebDriverTestExecutionListener@74baefb0]
18-Jun-2019 18:34:48 18:34:48.035 [main] DEBUG org.springframework.test.annotation.ProfileValueUtils - Retrieved @ProfileValueSourceConfiguration [null] for test class [io.pivotal.cfenv.boot.scs.VaultTokenRenewalAutoConfigurationTest]
18-Jun-2019 18:34:48 18:34:48.035 [main] DEBUG org.springframework.test.annotation.ProfileValueUtils - Retrieved ProfileValueSource type [class org.springframework.test.annotation.SystemProfileValueSource] for class [io.pivotal.cfenv.boot.scs.VaultTokenRenewalAutoConfigurationTest]
18-Jun-2019 18:34:48 18:34:48.036 [main] DEBUG org.springframework.test.annotation.ProfileValueUtils - Retrieved @ProfileValueSourceConfiguration [null] for test class [io.pivotal.cfenv.boot.scs.VaultTokenRenewalAutoConfigurationTest]
18-Jun-2019 18:34:48 18:34:48.036 [main] DEBUG org.springframework.test.annotation.ProfileValueUtils - Retrieved ProfileValueSource type [class org.springframework.test.annotation.SystemProfileValueSource] for class [io.pivotal.cfenv.boot.scs.VaultTokenRenewalAutoConfigurationTest]
18-Jun-2019 18:34:48 18:34:48.036 [main] DEBUG org.springframework.test.annotation.ProfileValueUtils - Retrieved @ProfileValueSourceConfiguration [null] for test class [io.pivotal.cfenv.boot.scs.VaultTokenRenewalAutoConfigurationTest]
18-Jun-2019 18:34:48 18:34:48.036 [main] DEBUG org.springframework.test.annotation.ProfileValueUtils - Retrieved ProfileValueSource type [class org.springframework.test.annotation.SystemProfileValueSource] for class [io.pivotal.cfenv.boot.scs.VaultTokenRenewalAutoConfigurationTest]
18-Jun-2019 18:34:48 18:34:48.039 [main] DEBUG org.springframework.test.context.support.AbstractDirtiesContextTestExecutionListener - Before test class: context [DefaultTestContext@5fc444d0 testClass = VaultTokenRenewalAutoConfigurationTest, testInstance = [null], testMethod = [null], testException = [null], mergedContextConfiguration = [WebMergedContextConfiguration@1f27b6fc testClass = VaultTokenRenewalAutoConfigurationTest, locations = '{}', classes = '{class io.pivotal.cfenv.boot.scs.VaultTokenRenewalAutoConfigurationTest$TestApplication, class io.pivotal.cfenv.boot.scs.VaultTokenRenewalAutoConfigurationTest$TestApplication}', contextInitializerClasses = '[]', activeProfiles = '{}', propertySourceLocations = '{}', propertySourceProperties = '{spring.cloud.config.token=footoken, vault.token.renew.rate=1000, org.springframework.boot.test.context.SpringBootTestContextBootstrapper=true}', contextCustomizers = set[org.springframework.boot.test.context.filter.ExcludeFilterContextCustomizer@3680cde9, org.springframework.boot.test.json.DuplicateJsonObjectContextCustomizerFactory$DuplicateJsonObjectContextCustomizer@59d64b60, org.springframework.boot.test.mock.mockito.MockitoContextCustomizer@a873ab96, org.springframework.boot.test.web.client.TestRestTemplateContextCustomizer@2c4af3ae, org.springframework.boot.test.autoconfigure.properties.PropertyMappingContextCustomizer@0, org.springframework.boot.test.autoconfigure.web.servlet.WebDriverContextCustomizerFactory$Customizer@2464c125], resourceBasePath = 'src/main/webapp', contextLoader = 'org.springframework.boot.test.context.SpringBootContextLoader', parent = [null]], attributes = map['org.springframework.test.context.web.ServletTestExecutionListener.activateListener' -> true]], class annotated with @DirtiesContext [false] with mode [null].
18-Jun-2019 18:34:48 18:34:48.039 [main] DEBUG org.springframework.test.annotation.ProfileValueUtils - Retrieved @ProfileValueSourceConfiguration [null] for test class [io.pivotal.cfenv.boot.scs.VaultTokenRenewalAutoConfigurationTest]
18-Jun-2019 18:34:48 18:34:48.040 [main] DEBUG org.springframework.test.annotation.ProfileValueUtils - Retrieved ProfileValueSource type [class org.springframework.test.annotation.SystemProfileValueSource] for class [io.pivotal.cfenv.boot.scs.VaultTokenRenewalAutoConfigurationTest]
18-Jun-2019 18:34:48 18:34:48.066 [main] DEBUG org.springframework.test.context.support.TestPropertySourceUtils - Adding inlined properties to environment: {spring.jmx.enabled=false, spring.cloud.config.token=footoken, vault.token.renew.rate=1000, org.springframework.boot.test.context.SpringBootTestContextBootstrapper=true, server.port=-1}
18-Jun-2019 18:34:48 2019-06-18 18:34:48.410  INFO 30245 --- [           main] trationDelegate$BeanPostProcessorChecker : Bean 'org.springframework.cloud.autoconfigure.ConfigurationPropertiesRebinderAutoConfiguration' of type [org.springframework.cloud.autoconfigure.ConfigurationPropertiesRebinderAutoConfiguration$$EnhancerBySpringCGLIB$$fdaea27c] is not eligible for getting processed by all BeanPostProcessors (for example: not eligible for auto-proxying)
18-Jun-2019 18:34:48
18-Jun-2019 18:34:48   .   ____          _            __ _ _
18-Jun-2019 18:34:48 /\\ / ___'_ __ _ _(_)_ __  __ _ \ \ \ \
18-Jun-2019 18:34:48 ( ( )\___ | '_ | '_| | '_ \/ _` | \ \ \ \
18-Jun-2019 18:34:48 \\/  ___)| |_)| | | | | || (_| |  ) ) ) )
18-Jun-2019 18:34:48   '  |____| .__|_| |_|_| |_\__, | / / / /
18-Jun-2019 18:34:48 =========|_|==============|___/=/_/_/_/
18-Jun-2019 18:34:48 :: Spring Boot ::        (v2.1.1.RELEASE)
18-Jun-2019 18:34:48
18-Jun-2019 18:34:48 2019-06-18 18:34:48.808  INFO 30245 --- [           main] s.VaultTokenRenewalAutoConfigurationTest : The following profiles are active: native
18-Jun-2019 18:34:49 2019-06-18 18:34:49.980  INFO 30245 --- [           main] o.s.cloud.context.scope.GenericScope     : BeanFactory id=2c1c54eb-1c47-3d03-97b0-e5005011b7c3
18-Jun-2019 18:34:50 2019-06-18 18:34:50.573  INFO 30245 --- [           main] trationDelegate$BeanPostProcessorChecker : Bean 'org.springframework.cloud.autoconfigure.ConfigurationPropertiesRebinderAutoConfiguration' of type [org.springframework.cloud.autoconfigure.ConfigurationPropertiesRebinderAutoConfiguration$$EnhancerBySpringCGLIB$$fdaea27c] is not eligible for getting processed by all BeanPostProcessors (for example: not eligible for auto-proxying)
18-Jun-2019 18:34:51 2019-06-18 18:34:51.087  INFO 30245 --- [           main] .s.s.UserDetailsServiceAutoConfiguration :
18-Jun-2019 18:34:51
18-Jun-2019 18:34:51 Using generated security password: e688cafe-eb0e-47d4-880c-979ae669ebb7
18-Jun-2019 18:34:51
18-Jun-2019 18:34:51 2019-06-18 18:34:51.533  INFO 30245 --- [           main] a.OAuth2AuthorizationServerConfiguration : Initialized OAuth2 Client
18-Jun-2019 18:34:51
18-Jun-2019 18:34:51 security.oauth2.client.client-id = 41f4e6b6-e340-49ee-bad1-fc2ebf4a772e
18-Jun-2019 18:34:51 security.oauth2.client.client-secret = 8a2dd644-6010-45f1-8a50-1db165b2e03d
18-Jun-2019 18:34:51
18-Jun-2019 18:34:51
18-Jun-2019 18:34:51 2019-06-18 18:34:51.635  INFO 30245 --- [           main] o.s.s.concurrent.ThreadPoolTaskExecutor  : Initializing ExecutorService 'applicationTaskExecutor'
18-Jun-2019 18:34:52 2019-06-18 18:34:52.655  INFO 30245 --- [           main] o.s.s.web.DefaultSecurityFilterChain     : Creating filter chain: OrRequestMatcher [requestMatchers=[Ant [pattern='/oauth/token'], Ant [pattern='/oauth/token_key'], Ant [pattern='/oauth/check_token']]], [org.springframework.security.web.context.request.async.WebAsyncManagerIntegrationFilter@30164c73, org.springframework.security.web.context.SecurityContextPersistenceFilter@6ee117de, org.springframework.security.web.header.HeaderWriterFilter@79b605e8, org.springframework.security.web.authentication.logout.LogoutFilter@9b38b82, org.springframework.security.web.authentication.www.BasicAuthenticationFilter@6a8f22b7, org.springframework.security.web.savedrequest.RequestCacheAwareFilter@71ab85be, org.springframework.security.web.servletapi.SecurityContextHolderAwareRequestFilter@a080b51, org.springframework.security.web.authentication.AnonymousAuthenticationFilter@45cb2a2b, org.springframework.security.web.session.SessionManagementFilter@461c66cf, org.springframework.security.web.access.ExceptionTranslationFilter@37779ddf, org.springframework.security.web.access.intercept.FilterSecurityInterceptor@64f8434c]
18-Jun-2019 18:34:52 2019-06-18 18:34:52.667  INFO 30245 --- [           main] o.s.s.web.DefaultSecurityFilterChain     : Creating filter chain: Ant [pattern='/**'], [org.springframework.security.web.context.request.async.WebAsyncManagerIntegrationFilter@69d00a77, org.springframework.security.web.context.SecurityContextPersistenceFilter@756104e, org.springframework.security.web.header.HeaderWriterFilter@17f8ae0, org.springframework.security.web.authentication.logout.LogoutFilter@3c437652, org.springframework.security.oauth2.provider.authentication.OAuth2AuthenticationProcessingFilter@2833ab19, org.springframework.security.web.savedrequest.RequestCacheAwareFilter@5913106b, org.springframework.security.web.servletapi.SecurityContextHolderAwareRequestFilter@24c6b923, org.springframework.security.web.authentication.AnonymousAuthenticationFilter@66369c3, org.springframework.security.web.session.SessionManagementFilter@59683eaf, org.springframework.security.web.access.ExceptionTranslationFilter@53c1ab44, org.springframework.security.web.access.intercept.FilterSecurityInterceptor@6bb17a3b]
18-Jun-2019 18:34:52 2019-06-18 18:34:52.677  INFO 30245 --- [           main] o.s.s.web.DefaultSecurityFilterChain     : Creating filter chain: any request, [org.springframework.security.web.context.request.async.WebAsyncManagerIntegrationFilter@1b8c10c0, org.springframework.security.web.context.SecurityContextPersistenceFilter@5ce2d561, org.springframework.security.web.header.HeaderWriterFilter@71136897, org.springframework.security.web.csrf.CsrfFilter@510eb392, org.springframework.security.web.authentication.logout.LogoutFilter@13d0e05a, org.springframework.security.web.authentication.UsernamePasswordAuthenticationFilter@136a6e73, org.springframework.security.web.authentication.ui.DefaultLoginPageGeneratingFilter@59536fcc, org.springframework.security.web.authentication.ui.DefaultLogoutPageGeneratingFilter@5abc83cb, org.springframework.security.web.authentication.www.BasicAuthenticationFilter@29d72ce1, org.springframework.security.web.savedrequest.RequestCacheAwareFilter@48081f2f, org.springframework.security.web.servletapi.SecurityContextHolderAwareRequestFilter@22358169, org.springframework.security.web.authentication.AnonymousAuthenticationFilter@45df123f, org.springframework.security.web.session.SessionManagementFilter@5525c704, org.springframework.security.web.access.ExceptionTranslationFilter@1ac1c7fd, org.springframework.security.web.access.intercept.FilterSecurityInterceptor@43b05859]
18-Jun-2019 18:34:52 2019-06-18 18:34:52.738  INFO 30245 --- [           main] o.s.b.a.e.web.EndpointLinksResolver      : Exposing 2 endpoint(s) beneath base path '/actuator'
18-Jun-2019 18:34:52 2019-06-18 18:34:52.802  INFO 30245 --- [           main] o.s.s.c.ThreadPoolTaskScheduler          : Initializing ExecutorService 'taskScheduler'
18-Jun-2019 18:34:53 2019-06-18 18:34:53.161  INFO 30245 --- [           main] s.VaultTokenRenewalAutoConfigurationTest : Started VaultTokenRenewalAutoConfigurationTest in 5.09 seconds (JVM running for 7.268)
18-Jun-2019 18:34:53 2019-06-18 18:34:53.172  INFO 30245 --- [   scheduling-1] c.b.s.VaultTokenRenewalAutoConfiguration : Renewing Vault token foot[*]oken for 300000 milliseconds.
18-Jun-2019 18:34:53 2019-06-18 18:34:53.221 ERROR 30245 --- [   scheduling-1] c.b.s.VaultTokenRenewalAutoConfiguration : Unable to renew Vault token foot[*]oken. Is the token invalid or expired?
18-Jun-2019 18:34:54 2019-06-18 18:34:54.158  INFO 30245 --- [   scheduling-1] c.b.s.VaultTokenRenewalAutoConfiguration : Renewing Vault token foot[*]oken for 300000 milliseconds.
18-Jun-2019 18:34:55 2019-06-18 18:34:55.158  INFO 30245 --- [   scheduling-1] c.b.s.VaultTokenRenewalAutoConfiguration : Renewing Vault token foot[*]oken for 300000 milliseconds.
18-Jun-2019 18:34:56 2019-06-18 18:34:56.158  INFO 30245 --- [   scheduling-1] c.b.s.VaultTokenRenewalAutoConfiguration : Renewing Vault token foot[*]oken for 300000 milliseconds.
18-Jun-2019 18:34:57 2019-06-18 18:34:57.158  INFO 30245 --- [   scheduling-1] c.b.s.VaultTokenRenewalAutoConfiguration : Renewing Vault token foot[*]oken for 300000 milliseconds.
18-Jun-2019 18:34:57 [INFO] Tests run: 2, Failures: 0, Errors: 0, Skipped: 0, Time elapsed: 9.286 s - in io.pivotal.cfenv.boot.scs.VaultTokenRenewalAutoConfigurationTest
18-Jun-2019 18:34:57 [INFO] Running io.pivotal.cfenv.boot.scs.PlainTextDefaultLabelTests
18-Jun-2019 18:34:57 2019-06-18 18:34:57.218  INFO 30245 --- [           main] .b.t.c.SpringBootTestContextBootstrapper : Neither @ContextConfiguration nor @ContextHierarchy found for test class [io.pivotal.cfenv.boot.scs.PlainTextDefaultLabelTests], using SpringBootContextLoader
18-Jun-2019 18:34:57 2019-06-18 18:34:57.219  INFO 30245 --- [           main] o.s.t.c.support.AbstractContextLoader    : Could not detect default resource locations for test class [io.pivotal.cfenv.boot.scs.PlainTextDefaultLabelTests]: no resource found for suffixes {-context.xml, Context.groovy}.
18-Jun-2019 18:34:57 2019-06-18 18:34:57.220  INFO 30245 --- [           main] .b.t.c.SpringBootTestContextBootstrapper : Loaded default TestExecutionListener class names from location [META-INF/spring.factories]: [org.springframework.boot.test.mock.mockito.MockitoTestExecutionListener, org.springframework.boot.test.mock.mockito.ResetMocksTestExecutionListener, org.springframework.boot.test.autoconfigure.restdocs.RestDocsTestExecutionListener, org.springframework.boot.test.autoconfigure.web.client.MockRestServiceServerResetTestExecutionListener, org.springframework.boot.test.autoconfigure.web.servlet.MockMvcPrintOnlyOnFailureTestExecutionListener, org.springframework.boot.test.autoconfigure.web.servlet.WebDriverTestExecutionListener, org.springframework.test.context.web.ServletTestExecutionListener, org.springframework.test.context.support.DirtiesContextBeforeModesTestExecutionListener, org.springframework.test.context.support.DependencyInjectionTestExecutionListener, org.springframework.test.context.support.DirtiesContextTestExecutionListener, org.springframework.test.context.transaction.TransactionalTestExecutionListener, org.springframework.test.context.jdbc.SqlScriptsTestExecutionListener]
18-Jun-2019 18:34:57 2019-06-18 18:34:57.221  INFO 30245 --- [           main] .b.t.c.SpringBootTestContextBootstrapper : Using TestExecutionListeners: [org.springframework.test.context.web.ServletTestExecutionListener@11478a2b, org.springframework.test.context.support.DirtiesContextBeforeModesTestExecutionListener@3d82bc46, org.springframework.boot.test.mock.mockito.MockitoTestExecutionListener@434ca0fe, org.springframework.boot.test.autoconfigure.SpringBootDependencyInjectionTestExecutionListener@779eefd2, org.springframework.test.context.support.DirtiesContextTestExecutionListener@5aa525d8, org.springframework.boot.test.mock.mockito.ResetMocksTestExecutionListener@72edc246, org.springframework.boot.test.autoconfigure.restdocs.RestDocsTestExecutionListener@5480d7b5, org.springframework.boot.test.autoconfigure.web.client.MockRestServiceServerResetTestExecutionListener@54e04288, org.springframework.boot.test.autoconfigure.web.servlet.MockMvcPrintOnlyOnFailureTestExecutionListener@27183629, org.springframework.boot.test.autoconfigure.web.servlet.WebDriverTestExecutionListener@3bfb2f7e]
18-Jun-2019 18:34:57 2019-06-18 18:34:57.284  INFO 30245 --- [           main] trationDelegate$BeanPostProcessorChecker : Bean 'org.springframework.cloud.autoconfigure.ConfigurationPropertiesRebinderAutoConfiguration' of type [org.springframework.cloud.autoconfigure.ConfigurationPropertiesRebinderAutoConfiguration$$EnhancerBySpringCGLIB$$fdaea27c] is not eligible for getting processed by all BeanPostProcessors (for example: not eligible for auto-proxying)
18-Jun-2019 18:34:57 2019-06-18 18:34:57.344  INFO 30245 --- [           main] c.c.c.ConfigServicePropertySourceLocator : Fetching config from server at : http://localhost:8888
18-Jun-2019 18:34:57 2019-06-18 18:34:57.444  INFO 30245 --- [           main] c.c.c.ConfigServicePropertySourceLocator : Connect Timeout Exception on Url - http://localhost:8888. Will be trying the next url if available
18-Jun-2019 18:34:57 2019-06-18 18:34:57.445  WARN 30245 --- [           main] c.c.c.ConfigServicePropertySourceLocator : Could not locate PropertySource: I/O error on GET request for "http://localhost:8888/test-app/plaintext,native,integration-test": Connection refused (Connection refused); nested exception is java.net.ConnectException: Connection refused (Connection refused)
18-Jun-2019 18:34:57 2019-06-18 18:34:57.448  INFO 30245 --- [           main] i.p.c.b.scs.PlainTextDefaultLabelTests   : The following profiles are active: plaintext,native,integration-test
18-Jun-2019 18:34:57 2019-06-18 18:34:57.729  INFO 30245 --- [           main] o.s.cloud.context.scope.GenericScope     : BeanFactory id=83448aeb-d0e8-3032-981d-a064b2c9f11d
18-Jun-2019 18:34:57 2019-06-18 18:34:57.747  INFO 30245 --- [           main] trationDelegate$BeanPostProcessorChecker : Bean 'org.springframework.cloud.autoconfigure.ConfigurationPropertiesRebinderAutoConfiguration' of type [org.springframework.cloud.autoconfigure.ConfigurationPropertiesRebinderAutoConfiguration$$EnhancerBySpringCGLIB$$fdaea27c] is not eligible for getting processed by all BeanPostProcessors (for example: not eligible for auto-proxying)
18-Jun-2019 18:34:57 2019-06-18 18:34:57.965  INFO 30245 --- [           main] o.s.b.w.embedded.tomcat.TomcatWebServer  : Tomcat initialized with port(s): 0 (http)
18-Jun-2019 18:34:58 2019-06-18 18:34:58.003  INFO 30245 --- [           main] o.apache.catalina.core.StandardService   : Starting service [Tomcat]
18-Jun-2019 18:34:58 2019-06-18 18:34:58.003  INFO 30245 --- [           main] org.apache.catalina.core.StandardEngine  : Starting Servlet Engine: Apache Tomcat/9.0.13
18-Jun-2019 18:34:58 2019-06-18 18:34:58.017  INFO 30245 --- [           main] o.a.catalina.core.AprLifecycleListener   : The APR based Apache Tomcat Native library which allows optimal performance in production environments was not found on the java.library.path: [/usr/java/packages/lib/amd64:/usr/lib64:/lib64:/lib:/usr/lib]
18-Jun-2019 18:34:58 2019-06-18 18:34:58.132  INFO 30245 --- [           main] o.a.c.c.C.[Tomcat].[localhost].[/]       : Initializing Spring embedded WebApplicationContext
18-Jun-2019 18:34:58 2019-06-18 18:34:58.132  INFO 30245 --- [           main] o.s.web.context.ContextLoader            : Root WebApplicationContext: initialization completed in 682 ms
18-Jun-2019 18:34:58 2019-06-18 18:34:58.158  INFO 30245 --- [   scheduling-1] c.b.s.VaultTokenRenewalAutoConfiguration : Renewing Vault token foot[*]oken for 300000 milliseconds.
18-Jun-2019 18:34:58 2019-06-18 18:34:58.433  INFO 30245 --- [           main] .s.s.UserDetailsServiceAutoConfiguration :
18-Jun-2019 18:34:58
18-Jun-2019 18:34:58 Using generated security password: d4dfbbf9-05dd-4176-9058-eec40c4bd9f9
18-Jun-2019 18:34:58
18-Jun-2019 18:34:58 2019-06-18 18:34:58.487  INFO 30245 --- [           main] a.OAuth2AuthorizationServerConfiguration : Initialized OAuth2 Client
18-Jun-2019 18:34:58
18-Jun-2019 18:34:58 security.oauth2.client.client-id = acme
18-Jun-2019 18:34:58 security.oauth2.client.client-secret = ****
18-Jun-2019 18:34:58
18-Jun-2019 18:34:58
18-Jun-2019 18:34:58 2019-06-18 18:34:58.523  INFO 30245 --- [           main] o.s.s.concurrent.ThreadPoolTaskExecutor  : Initializing ExecutorService 'applicationTaskExecutor'
18-Jun-2019 18:34:58 2019-06-18 18:34:58.649  INFO 30245 --- [           main] o.s.s.web.DefaultSecurityFilterChain     : Creating filter chain: OrRequestMatcher [requestMatchers=[Ant [pattern='/oauth/token'], Ant [pattern='/oauth/token_key'], Ant [pattern='/oauth/check_token']]], [org.springframework.security.web.context.request.async.WebAsyncManagerIntegrationFilter@1da71bfa, org.springframework.security.web.context.SecurityContextPersistenceFilter@939aebb, org.springframework.security.web.header.HeaderWriterFilter@44b98b5b, org.springframework.security.web.authentication.logout.LogoutFilter@6536ba30, org.springframework.security.web.authentication.www.BasicAuthenticationFilter@40b3146e, org.springframework.security.web.savedrequest.RequestCacheAwareFilter@8fa0667, org.springframework.security.web.servletapi.SecurityContextHolderAwareRequestFilter@91a770, org.springframework.security.web.authentication.AnonymousAuthenticationFilter@59c7ae98, org.springframework.security.web.session.SessionManagementFilter@107eb78d, org.springframework.security.web.access.ExceptionTranslationFilter@521a6b10, org.springframework.security.web.access.intercept.FilterSecurityInterceptor@73623d80]
18-Jun-2019 18:34:58 2019-06-18 18:34:58.657  INFO 30245 --- [           main] o.s.s.web.DefaultSecurityFilterChain     : Creating filter chain: Ant [pattern='/**'], [org.springframework.security.web.context.request.async.WebAsyncManagerIntegrationFilter@170a5e0b, org.springframework.security.web.context.SecurityContextPersistenceFilter@29abe8cc, org.springframework.security.web.header.HeaderWriterFilter@97e813c, org.springframework.security.web.authentication.logout.LogoutFilter@2f51f26f, org.springframework.security.oauth2.provider.authentication.OAuth2AuthenticationProcessingFilter@33c3dad9, org.springframework.security.web.savedrequest.RequestCacheAwareFilter@1ae1f78f, org.springframework.security.web.servletapi.SecurityContextHolderAwareRequestFilter@676bf28e, org.springframework.security.web.authentication.AnonymousAuthenticationFilter@342eacb2, org.springframework.security.web.session.SessionManagementFilter@63856ef2, org.springframework.security.web.access.ExceptionTranslationFilter@39a15b05, org.springframework.security.web.access.intercept.FilterSecurityInterceptor@3ab24e96]
18-Jun-2019 18:34:58 2019-06-18 18:34:58.660  INFO 30245 --- [           main] o.s.s.web.DefaultSecurityFilterChain     : Creating filter chain: any request, [org.springframework.security.web.context.request.async.WebAsyncManagerIntegrationFilter@4208d5f4, org.springframework.security.web.context.SecurityContextPersistenceFilter@13004135, org.springframework.security.web.header.HeaderWriterFilter@63e16eea, org.springframework.security.web.csrf.CsrfFilter@5e4d9393, org.springframework.security.web.authentication.logout.LogoutFilter@45514f69, org.springframework.security.web.authentication.UsernamePasswordAuthenticationFilter@16d6477e, org.springframework.security.web.authentication.ui.DefaultLoginPageGeneratingFilter@5449b53c, org.springframework.security.web.authentication.ui.DefaultLogoutPageGeneratingFilter@7a4c4c5, org.springframework.security.web.authentication.www.BasicAuthenticationFilter@610dd237, org.springframework.security.web.savedrequest.RequestCacheAwareFilter@1951871, org.springframework.security.web.servletapi.SecurityContextHolderAwareRequestFilter@696ba097, org.springframework.security.web.authentication.AnonymousAuthenticationFilter@23ed8ef8, org.springframework.security.web.session.SessionManagementFilter@21e39f91, org.springframework.security.web.access.ExceptionTranslationFilter@36e49c78, org.springframework.security.web.access.intercept.FilterSecurityInterceptor@ee97000]
18-Jun-2019 18:34:58 2019-06-18 18:34:58.669  INFO 30245 --- [           main] o.s.b.a.e.web.EndpointLinksResolver      : Exposing 2 endpoint(s) beneath base path '/actuator'
18-Jun-2019 18:34:58 2019-06-18 18:34:58.952  INFO 30245 --- [           main] o.s.b.w.embedded.tomcat.TomcatWebServer  : Tomcat started on port(s): 41163 (http) with context path ''
18-Jun-2019 18:34:58 2019-06-18 18:34:58.954  INFO 30245 --- [           main] i.p.c.b.scs.PlainTextDefaultLabelTests   : Started PlainTextDefaultLabelTests in 1.73 seconds (JVM running for 13.061)
18-Jun-2019 18:34:59 2019-06-18 18:34:59.061  INFO 30245 --- [o-auto-1-exec-1] o.a.c.c.C.[Tomcat].[localhost].[/]       : Initializing Spring DispatcherServlet 'dispatcherServlet'
18-Jun-2019 18:34:59 2019-06-18 18:34:59.062  INFO 30245 --- [o-auto-1-exec-1] o.s.web.servlet.DispatcherServlet        : Initializing Servlet 'dispatcherServlet'
18-Jun-2019 18:34:59 2019-06-18 18:34:59.081  INFO 30245 --- [o-auto-1-exec-1] o.s.web.servlet.DispatcherServlet        : Completed initialization in 19 ms
18-Jun-2019 18:34:59 2019-06-18 18:34:59.158  INFO 30245 --- [   scheduling-1] c.b.s.VaultTokenRenewalAutoConfiguration : Renewing Vault token foot[*]oken for 300000 milliseconds.
18-Jun-2019 18:34:59 [INFO] Tests run: 1, Failures: 0, Errors: 0, Skipped: 0, Time elapsed: 2.139 s - in io.pivotal.cfenv.boot.scs.PlainTextDefaultLabelTests
18-Jun-2019 18:34:59 [INFO] Running io.pivotal.cfenv.boot.scs.DisabledPlainTextConfigClientTests
18-Jun-2019 18:34:59 2019-06-18 18:34:59.356  INFO 30245 --- [           main] .b.t.c.SpringBootTestContextBootstrapper : Neither @ContextConfiguration nor @ContextHierarchy found for test class [io.pivotal.cfenv.boot.scs.DisabledPlainTextConfigClientTests], using SpringBootContextLoader
18-Jun-2019 18:34:59 2019-06-18 18:34:59.356  INFO 30245 --- [           main] o.s.t.c.support.AbstractContextLoader    : Could not detect default resource locations for test class [io.pivotal.cfenv.boot.scs.DisabledPlainTextConfigClientTests]: no resource found for suffixes {-context.xml, Context.groovy}.
18-Jun-2019 18:34:59 2019-06-18 18:34:59.365  INFO 30245 --- [           main] .b.t.c.SpringBootTestContextBootstrapper : Loaded default TestExecutionListener class names from location [META-INF/spring.factories]: [org.springframework.boot.test.mock.mockito.MockitoTestExecutionListener, org.springframework.boot.test.mock.mockito.ResetMocksTestExecutionListener, org.springframework.boot.test.autoconfigure.restdocs.RestDocsTestExecutionListener, org.springframework.boot.test.autoconfigure.web.client.MockRestServiceServerResetTestExecutionListener, org.springframework.boot.test.autoconfigure.web.servlet.MockMvcPrintOnlyOnFailureTestExecutionListener, org.springframework.boot.test.autoconfigure.web.servlet.WebDriverTestExecutionListener, org.springframework.test.context.web.ServletTestExecutionListener, org.springframework.test.context.support.DirtiesContextBeforeModesTestExecutionListener, org.springframework.test.context.support.DependencyInjectionTestExecutionListener, org.springframework.test.context.support.DirtiesContextTestExecutionListener, org.springframework.test.context.transaction.TransactionalTestExecutionListener, org.springframework.test.context.jdbc.SqlScriptsTestExecutionListener]
18-Jun-2019 18:34:59 2019-06-18 18:34:59.368  INFO 30245 --- [           main] .b.t.c.SpringBootTestContextBootstrapper : Using TestExecutionListeners: [org.springframework.test.context.web.ServletTestExecutionListener@7796fa50, org.springframework.test.context.support.DirtiesContextBeforeModesTestExecutionListener@172b5c8d, org.springframework.boot.test.mock.mockito.MockitoTestExecutionListener@56927ed5, org.springframework.boot.test.autoconfigure.SpringBootDependencyInjectionTestExecutionListener@22f9fb05, org.springframework.test.context.support.DirtiesContextTestExecutionListener@627dc170, org.springframework.boot.test.mock.mockito.ResetMocksTestExecutionListener@2f7f2686, org.springframework.boot.test.autoconfigure.restdocs.RestDocsTestExecutionListener@6a5e916a, org.springframework.boot.test.autoconfigure.web.client.MockRestServiceServerResetTestExecutionListener@7926ef7, org.springframework.boot.test.autoconfigure.web.servlet.MockMvcPrintOnlyOnFailureTestExecutionListener@be84934, org.springframework.boot.test.autoconfigure.web.servlet.WebDriverTestExecutionListener@5d7505d9]
18-Jun-2019 18:34:59 2019-06-18 18:34:59.422  INFO 30245 --- [           main] trationDelegate$BeanPostProcessorChecker : Bean 'org.springframework.cloud.autoconfigure.ConfigurationPropertiesRebinderAutoConfiguration' of type [org.springframework.cloud.autoconfigure.ConfigurationPropertiesRebinderAutoConfiguration$$EnhancerBySpringCGLIB$$fdaea27c] is not eligible for getting processed by all BeanPostProcessors (for example: not eligible for auto-proxying)
18-Jun-2019 18:34:59 2019-06-18 18:34:59.462  INFO 30245 --- [           main] c.b.s.DisabledPlainTextConfigClientTests : The following profiles are active: integration-test
18-Jun-2019 18:34:59 2019-06-18 18:34:59.473  INFO 30245 --- [           main] c.b.s.DisabledPlainTextConfigClientTests : Started DisabledPlainTextConfigClientTests in 0.102 seconds (JVM running for 13.58)
18-Jun-2019 18:34:59 [INFO] Tests run: 1, Failures: 0, Errors: 0, Skipped: 0, Time elapsed: 0.121 s - in io.pivotal.cfenv.boot.scs.DisabledPlainTextConfigClientTests
18-Jun-2019 18:34:59 [INFO] Running io.pivotal.cfenv.boot.scs.PlainTextOauth2ConfigClientTests
18-Jun-2019 18:34:59 2019-06-18 18:34:59.478  INFO 30245 --- [           main] .b.t.c.SpringBootTestContextBootstrapper : Neither @ContextConfiguration nor @ContextHierarchy found for test class [io.pivotal.cfenv.boot.scs.PlainTextOauth2ConfigClientTests], using SpringBootContextLoader
18-Jun-2019 18:34:59 2019-06-18 18:34:59.479  INFO 30245 --- [           main] o.s.t.c.support.AbstractContextLoader    : Could not detect default resource locations for test class [io.pivotal.cfenv.boot.scs.PlainTextOauth2ConfigClientTests]: no resource found for suffixes {-context.xml, Context.groovy}.
18-Jun-2019 18:34:59 2019-06-18 18:34:59.481  INFO 30245 --- [           main] .b.t.c.SpringBootTestContextBootstrapper : Loaded default TestExecutionListener class names from location [META-INF/spring.factories]: [org.springframework.boot.test.mock.mockito.MockitoTestExecutionListener, org.springframework.boot.test.mock.mockito.ResetMocksTestExecutionListener, org.springframework.boot.test.autoconfigure.restdocs.RestDocsTestExecutionListener, org.springframework.boot.test.autoconfigure.web.client.MockRestServiceServerResetTestExecutionListener, org.springframework.boot.test.autoconfigure.web.servlet.MockMvcPrintOnlyOnFailureTestExecutionListener, org.springframework.boot.test.autoconfigure.web.servlet.WebDriverTestExecutionListener, org.springframework.test.context.web.ServletTestExecutionListener, org.springframework.test.context.support.DirtiesContextBeforeModesTestExecutionListener, org.springframework.test.context.support.DependencyInjectionTestExecutionListener, org.springframework.test.context.support.DirtiesContextTestExecutionListener, org.springframework.test.context.transaction.TransactionalTestExecutionListener, org.springframework.test.context.jdbc.SqlScriptsTestExecutionListener]
18-Jun-2019 18:34:59 2019-06-18 18:34:59.484  INFO 30245 --- [           main] .b.t.c.SpringBootTestContextBootstrapper : Using TestExecutionListeners: [org.springframework.test.context.web.ServletTestExecutionListener@12c5c98d, org.springframework.test.context.support.DirtiesContextBeforeModesTestExecutionListener@563c243a, org.springframework.boot.test.mock.mockito.MockitoTestExecutionListener@4b98b42e, org.springframework.boot.test.autoconfigure.SpringBootDependencyInjectionTestExecutionListener@1ae3194c, org.springframework.test.context.support.DirtiesContextTestExecutionListener@2656223c, org.springframework.boot.test.mock.mockito.ResetMocksTestExecutionListener@117cdf38, org.springframework.boot.test.autoconfigure.restdocs.RestDocsTestExecutionListener@1f4b30fd, org.springframework.boot.test.autoconfigure.web.client.MockRestServiceServerResetTestExecutionListener@1de07321, org.springframework.boot.test.autoconfigure.web.servlet.MockMvcPrintOnlyOnFailureTestExecutionListener@ab0f563, org.springframework.boot.test.autoconfigure.web.servlet.WebDriverTestExecutionListener@7d426e12]
18-Jun-2019 18:34:59 2019-06-18 18:34:59.535  INFO 30245 --- [           main] trationDelegate$BeanPostProcessorChecker : Bean 'org.springframework.cloud.autoconfigure.ConfigurationPropertiesRebinderAutoConfiguration' of type [org.springframework.cloud.autoconfigure.ConfigurationPropertiesRebinderAutoConfiguration$$EnhancerBySpringCGLIB$$fdaea27c] is not eligible for getting processed by all BeanPostProcessors (for example: not eligible for auto-proxying)
18-Jun-2019 18:34:59
18-Jun-2019 18:34:59   .   ____          _            __ _ _
18-Jun-2019 18:34:59 /\\ / ___'_ __ _ _(_)_ __  __ _ \ \ \ \
18-Jun-2019 18:34:59 ( ( )\___ | '_ | '_| | '_ \/ _` | \ \ \ \
18-Jun-2019 18:34:59 \\/  ___)| |_)| | | | | || (_| |  ) ) ) )
18-Jun-2019 18:34:59   '  |____| .__|_| |_|_| |_\__, | / / / /
18-Jun-2019 18:34:59 =========|_|==============|___/=/_/_/_/
18-Jun-2019 18:34:59 :: Spring Boot ::        (v2.1.1.RELEASE)
18-Jun-2019 18:34:59
18-Jun-2019 18:34:59 2019-06-18 18:34:59.577  INFO 30245 --- [           main] c.c.c.ConfigServicePropertySourceLocator : Fetching config from server at : http://localhost:8888
18-Jun-2019 18:34:59 2019-06-18 18:34:59.582  INFO 30245 --- [           main] c.c.c.ConfigServicePropertySourceLocator : Connect Timeout Exception on Url - http://localhost:8888. Will be trying the next url if available
18-Jun-2019 18:34:59 2019-06-18 18:34:59.583  WARN 30245 --- [           main] c.c.c.ConfigServicePropertySourceLocator : Could not locate PropertySource: I/O error on GET request for "http://localhost:8888/test-app/plaintext,native": Connection refused (Connection refused); nested exception is java.net.ConnectException: Connection refused (Connection refused)
18-Jun-2019 18:34:59 2019-06-18 18:34:59.585  INFO 30245 --- [           main] p.c.b.s.PlainTextOauth2ConfigClientTests : The following profiles are active: plaintext,native
18-Jun-2019 18:34:59 2019-06-18 18:34:59.872  INFO 30245 --- [           main] o.s.cloud.context.scope.GenericScope     : BeanFactory id=83448aeb-d0e8-3032-981d-a064b2c9f11d
18-Jun-2019 18:34:59 2019-06-18 18:34:59.887  INFO 30245 --- [           main] trationDelegate$BeanPostProcessorChecker : Bean 'org.springframework.cloud.autoconfigure.ConfigurationPropertiesRebinderAutoConfiguration' of type [org.springframework.cloud.autoconfigure.ConfigurationPropertiesRebinderAutoConfiguration$$EnhancerBySpringCGLIB$$fdaea27c] is not eligible for getting processed by all BeanPostProcessors (for example: not eligible for auto-proxying)
18-Jun-2019 18:34:59 2019-06-18 18:34:59.936  INFO 30245 --- [           main] o.s.b.w.embedded.tomcat.TomcatWebServer  : Tomcat initialized with port(s): 0 (http)
18-Jun-2019 18:34:59 2019-06-18 18:34:59.937  INFO 30245 --- [           main] o.apache.catalina.core.StandardService   : Starting service [Tomcat]
18-Jun-2019 18:34:59 2019-06-18 18:34:59.938  INFO 30245 --- [           main] org.apache.catalina.core.StandardEngine  : Starting Servlet Engine: Apache Tomcat/9.0.13
18-Jun-2019 18:34:59 2019-06-18 18:34:59.941  INFO 30245 --- [           main] o.a.c.c.C.[Tomcat-1].[localhost].[/]     : Initializing Spring embedded WebApplicationContext
18-Jun-2019 18:34:59 2019-06-18 18:34:59.941  INFO 30245 --- [           main] o.s.web.context.ContextLoader            : Root WebApplicationContext: initialization completed in 354 ms
18-Jun-2019 18:35:00 2019-06-18 18:35:00.158  INFO 30245 --- [   scheduling-1] c.b.s.VaultTokenRenewalAutoConfiguration : Renewing Vault token foot[*]oken for 300000 milliseconds.
18-Jun-2019 18:35:00 2019-06-18 18:35:00.163  INFO 30245 --- [           main] .s.s.UserDetailsServiceAutoConfiguration :
18-Jun-2019 18:35:00
18-Jun-2019 18:35:00 Using generated security password: d678f5a8-45ff-49a2-8dc3-5d64dcde5c5d
18-Jun-2019 18:35:00
18-Jun-2019 18:35:00 2019-06-18 18:35:00.207  INFO 30245 --- [           main] a.OAuth2AuthorizationServerConfiguration : Initialized OAuth2 Client
18-Jun-2019 18:35:00
18-Jun-2019 18:35:00 security.oauth2.client.client-id = acme
18-Jun-2019 18:35:00 security.oauth2.client.client-secret = ****
18-Jun-2019 18:35:00
18-Jun-2019 18:35:00
18-Jun-2019 18:35:00 2019-06-18 18:35:00.233  INFO 30245 --- [           main] o.s.s.concurrent.ThreadPoolTaskExecutor  : Initializing ExecutorService 'applicationTaskExecutor'
18-Jun-2019 18:35:00 2019-06-18 18:35:00.350  INFO 30245 --- [           main] o.s.s.web.DefaultSecurityFilterChain     : Creating filter chain: OrRequestMatcher [requestMatchers=[Ant [pattern='/oauth/token'], Ant [pattern='/oauth/token_key'], Ant [pattern='/oauth/check_token']]], [org.springframework.security.web.context.request.async.WebAsyncManagerIntegrationFilter@17c6e5, org.springframework.security.web.context.SecurityContextPersistenceFilter@e208b0d, org.springframework.security.web.header.HeaderWriterFilter@41b50719, org.springframework.security.web.authentication.logout.LogoutFilter@13081cc, org.springframework.security.web.authentication.www.BasicAuthenticationFilter@305cfb10, org.springframework.security.web.savedrequest.RequestCacheAwareFilter@3ed37821, org.springframework.security.web.servletapi.SecurityContextHolderAwareRequestFilter@57372d2d, org.springframework.security.web.authentication.AnonymousAuthenticationFilter@66074820, org.springframework.security.web.session.SessionManagementFilter@5ea6760, org.springframework.security.web.access.ExceptionTranslationFilter@7b897959, org.springframework.security.web.access.intercept.FilterSecurityInterceptor@5b4e365d]
18-Jun-2019 18:35:00 2019-06-18 18:35:00.357  INFO 30245 --- [           main] o.s.s.web.DefaultSecurityFilterChain     : Creating filter chain: Ant [pattern='/**'], [org.springframework.security.web.context.request.async.WebAsyncManagerIntegrationFilter@5d707a77, org.springframework.security.web.context.SecurityContextPersistenceFilter@1d497bb8, org.springframework.security.web.header.HeaderWriterFilter@761eb590, org.springframework.security.web.authentication.logout.LogoutFilter@128772d3, org.springframework.security.oauth2.provider.authentication.OAuth2AuthenticationProcessingFilter@29e1c6d1, org.springframework.security.web.savedrequest.RequestCacheAwareFilter@7aae75d5, org.springframework.security.web.servletapi.SecurityContextHolderAwareRequestFilter@791ffd25, org.springframework.security.web.authentication.AnonymousAuthenticationFilter@4ce19e3d, org.springframework.security.web.session.SessionManagementFilter@3d6ac326, org.springframework.security.web.access.ExceptionTranslationFilter@31aac549, org.springframework.security.web.access.intercept.FilterSecurityInterceptor@7a00eca8]
18-Jun-2019 18:35:00 2019-06-18 18:35:00.361  INFO 30245 --- [           main] o.s.s.web.DefaultSecurityFilterChain     : Creating filter chain: any request, [org.springframework.security.web.context.request.async.WebAsyncManagerIntegrationFilter@25db3266, org.springframework.security.web.context.SecurityContextPersistenceFilter@773d2ea8, org.springframework.security.web.header.HeaderWriterFilter@c5318fe, org.springframework.security.web.csrf.CsrfFilter@2150acdb, org.springframework.security.web.authentication.logout.LogoutFilter@58d82023, org.springframework.security.web.authentication.UsernamePasswordAuthenticationFilter@592d7cec, org.springframework.security.web.authentication.ui.DefaultLoginPageGeneratingFilter@468e0e34, org.springframework.security.web.authentication.ui.DefaultLogoutPageGeneratingFilter@2690c47e, org.springframework.security.web.authentication.www.BasicAuthenticationFilter@38bfc844, org.springframework.security.web.savedrequest.RequestCacheAwareFilter@7a3a0a26, org.springframework.security.web.servletapi.SecurityContextHolderAwareRequestFilter@6e3a6977, org.springframework.security.web.authentication.AnonymousAuthenticationFilter@14e8165c, org.springframework.security.web.session.SessionManagementFilter@53af6672, org.springframework.security.web.access.ExceptionTranslationFilter@4ac8f859, org.springframework.security.web.access.intercept.FilterSecurityInterceptor@60dc6289]
18-Jun-2019 18:35:00 2019-06-18 18:35:00.371  INFO 30245 --- [           main] o.s.b.a.e.web.EndpointLinksResolver      : Exposing 2 endpoint(s) beneath base path '/actuator'
18-Jun-2019 18:35:00 2019-06-18 18:35:00.468  INFO 30245 --- [           main] o.s.b.w.embedded.tomcat.TomcatWebServer  : Tomcat started on port(s): 43287 (http) with context path ''
18-Jun-2019 18:35:00 2019-06-18 18:35:00.469  INFO 30245 --- [           main] p.c.b.s.PlainTextOauth2ConfigClientTests : Started PlainTextOauth2ConfigClientTests in 0.983 seconds (JVM running for 14.576)
18-Jun-2019 18:35:00 2019-06-18 18:35:00.485  INFO 30245 --- [o-auto-2-exec-2] o.a.c.c.C.[Tomcat-1].[localhost].[/]     : Initializing Spring DispatcherServlet 'dispatcherServlet'
18-Jun-2019 18:35:00 2019-06-18 18:35:00.486  INFO 30245 --- [o-auto-2-exec-2] o.s.web.servlet.DispatcherServlet        : Initializing Servlet 'dispatcherServlet'
18-Jun-2019 18:35:00 2019-06-18 18:35:00.497  INFO 30245 --- [o-auto-2-exec-2] o.s.web.servlet.DispatcherServlet        : Completed initialization in 11 ms
18-Jun-2019 18:35:00 [INFO] Tests run: 5, Failures: 0, Errors: 0, Skipped: 0, Time elapsed: 1.247 s - in io.pivotal.cfenv.boot.scs.PlainTextOauth2ConfigClientTests
18-Jun-2019 18:35:00 [INFO] Running io.pivotal.cfenv.boot.scs.CloudEnvironmentBootstrapConfigurationIntegrationTest
18-Jun-2019 18:35:00 2019-06-18 18:35:00.725  INFO 30245 --- [           main] .b.t.c.SpringBootTestContextBootstrapper : Neither @ContextConfiguration nor @ContextHierarchy found for test class [io.pivotal.cfenv.boot.scs.CloudEnvironmentBootstrapConfigurationIntegrationTest], using SpringBootContextLoader
18-Jun-2019 18:35:00 2019-06-18 18:35:00.726  INFO 30245 --- [           main] o.s.t.c.support.AbstractContextLoader    : Could not detect default resource locations for test class [io.pivotal.cfenv.boot.scs.CloudEnvironmentBootstrapConfigurationIntegrationTest]: no resource found for suffixes {-context.xml, Context.groovy}.
18-Jun-2019 18:35:00 2019-06-18 18:35:00.727  INFO 30245 --- [           main] .b.t.c.SpringBootTestContextBootstrapper : Loaded default TestExecutionListener class names from location [META-INF/spring.factories]: [org.springframework.boot.test.mock.mockito.MockitoTestExecutionListener, org.springframework.boot.test.mock.mockito.ResetMocksTestExecutionListener, org.springframework.boot.test.autoconfigure.restdocs.RestDocsTestExecutionListener, org.springframework.boot.test.autoconfigure.web.client.MockRestServiceServerResetTestExecutionListener, org.springframework.boot.test.autoconfigure.web.servlet.MockMvcPrintOnlyOnFailureTestExecutionListener, org.springframework.boot.test.autoconfigure.web.servlet.WebDriverTestExecutionListener, org.springframework.test.context.web.ServletTestExecutionListener, org.springframework.test.context.support.DirtiesContextBeforeModesTestExecutionListener, org.springframework.test.context.support.DependencyInjectionTestExecutionListener, org.springframework.test.context.support.DirtiesContextTestExecutionListener, org.springframework.test.context.transaction.TransactionalTestExecutionListener, org.springframework.test.context.jdbc.SqlScriptsTestExecutionListener]
18-Jun-2019 18:35:00 2019-06-18 18:35:00.728  INFO 30245 --- [           main] .b.t.c.SpringBootTestContextBootstrapper : Using TestExecutionListeners: [org.springframework.test.context.web.ServletTestExecutionListener@1473a1a8, org.springframework.test.context.support.DirtiesContextBeforeModesTestExecutionListener@68dee80d, org.springframework.boot.test.mock.mockito.MockitoTestExecutionListener@8313d99, org.springframework.boot.test.autoconfigure.SpringBootDependencyInjectionTestExecutionListener@1f84ac7, org.springframework.test.context.support.DirtiesContextTestExecutionListener@88fd5b1, org.springframework.boot.test.mock.mockito.ResetMocksTestExecutionListener@170eca2d, org.springframework.boot.test.autoconfigure.restdocs.RestDocsTestExecutionListener@16d2e0a0, org.springframework.boot.test.autoconfigure.web.client.MockRestServiceServerResetTestExecutionListener@55bf3ecf, org.springframework.boot.test.autoconfigure.web.servlet.MockMvcPrintOnlyOnFailureTestExecutionListener@23eb5b94, org.springframework.boot.test.autoconfigure.web.servlet.WebDriverTestExecutionListener@42d5b266]
18-Jun-2019 18:35:00 2019-06-18 18:35:00.764  INFO 30245 --- [           main] trationDelegate$BeanPostProcessorChecker : Bean 'org.springframework.cloud.autoconfigure.ConfigurationPropertiesRebinderAutoConfiguration' of type [org.springframework.cloud.autoconfigure.ConfigurationPropertiesRebinderAutoConfiguration$$EnhancerBySpringCGLIB$$fdaea27c] is not eligible for getting processed by all BeanPostProcessors (for example: not eligible for auto-proxying)
18-Jun-2019 18:35:00
18-Jun-2019 18:35:00   .   ____          _            __ _ _
18-Jun-2019 18:35:00 /\\ / ___'_ __ _ _(_)_ __  __ _ \ \ \ \
18-Jun-2019 18:35:00 ( ( )\___ | '_ | '_| | '_ \/ _` | \ \ \ \
18-Jun-2019 18:35:00 \\/  ___)| |_)| | | | | || (_| |  ) ) ) )
18-Jun-2019 18:35:00   '  |____| .__|_| |_|_| |_\__, | / / / /
18-Jun-2019 18:35:00 =========|_|==============|___/=/_/_/_/
18-Jun-2019 18:35:00 :: Spring Boot ::        (v2.1.1.RELEASE)
18-Jun-2019 18:35:00
18-Jun-2019 18:35:00 2019-06-18 18:35:00.789  INFO 30245 --- [           main] entBootstrapConfigurationIntegrationTest : The following profiles are active: native
18-Jun-2019 18:35:01 2019-06-18 18:35:01.010  INFO 30245 --- [           main] o.s.cloud.context.scope.GenericScope     : BeanFactory id=6dc56b84-5ae1-336c-bf9e-3daddb29015a
18-Jun-2019 18:35:01 2019-06-18 18:35:01.025  INFO 30245 --- [           main] trationDelegate$BeanPostProcessorChecker : Bean 'org.springframework.cloud.autoconfigure.ConfigurationPropertiesRebinderAutoConfiguration' of type [org.springframework.cloud.autoconfigure.ConfigurationPropertiesRebinderAutoConfiguration$$EnhancerBySpringCGLIB$$fdaea27c] is not eligible for getting processed by all BeanPostProcessors (for example: not eligible for auto-proxying)
18-Jun-2019 18:35:01 2019-06-18 18:35:01.107  INFO 30245 --- [           main] .s.s.UserDetailsServiceAutoConfiguration :
18-Jun-2019 18:35:01
18-Jun-2019 18:35:01 Using generated security password: 4358bb59-25fb-458b-99cb-b568bb86dbbd
18-Jun-2019 18:35:01
18-Jun-2019 18:35:01 2019-06-18 18:35:01.158  INFO 30245 --- [   scheduling-1] c.b.s.VaultTokenRenewalAutoConfiguration : Renewing Vault token foot[*]oken for 300000 milliseconds.
18-Jun-2019 18:35:01 2019-06-18 18:35:01.162  INFO 30245 --- [           main] a.OAuth2AuthorizationServerConfiguration : Initialized OAuth2 Client
18-Jun-2019 18:35:01
18-Jun-2019 18:35:01 security.oauth2.client.client-id = 3cde68fc-c3a7-42b9-bca2-94104ae3483b
18-Jun-2019 18:35:01 security.oauth2.client.client-secret = bbd3cbb1-22f4-4d7c-b39e-8e41b50118c7
18-Jun-2019 18:35:01
18-Jun-2019 18:35:01
18-Jun-2019 18:35:01 2019-06-18 18:35:01.181  INFO 30245 --- [           main] o.s.s.concurrent.ThreadPoolTaskExecutor  : Initializing ExecutorService 'applicationTaskExecutor'
18-Jun-2019 18:35:01 2019-06-18 18:35:01.347  INFO 30245 --- [           main] o.s.s.web.DefaultSecurityFilterChain     : Creating filter chain: OrRequestMatcher [requestMatchers=[Ant [pattern='/oauth/token'], Ant [pattern='/oauth/token_key'], Ant [pattern='/oauth/check_token']]], [org.springframework.security.web.context.request.async.WebAsyncManagerIntegrationFilter@5225e15b, org.springframework.security.web.context.SecurityContextPersistenceFilter@122cbf1b, org.springframework.security.web.header.HeaderWriterFilter@2801fbaf, org.springframework.security.web.authentication.logout.LogoutFilter@4324d349, org.springframework.security.web.authentication.www.BasicAuthenticationFilter@1dfa51df, org.springframework.security.web.savedrequest.RequestCacheAwareFilter@2f250754, org.springframework.security.web.servletapi.SecurityContextHolderAwareRequestFilter@85e4d9c, org.springframework.security.web.authentication.AnonymousAuthenticationFilter@436fa324, org.springframework.security.web.session.SessionManagementFilter@7ec6aef0, org.springframework.security.web.access.ExceptionTranslationFilter@3cc03e94, org.springframework.security.web.access.intercept.FilterSecurityInterceptor@6e252f34]
18-Jun-2019 18:35:01 2019-06-18 18:35:01.352  INFO 30245 --- [           main] o.s.s.web.DefaultSecurityFilterChain     : Creating filter chain: Ant [pattern='/**'], [org.springframework.security.web.context.request.async.WebAsyncManagerIntegrationFilter@6effb485, org.springframework.security.web.context.SecurityContextPersistenceFilter@4343626e, org.springframework.security.web.header.HeaderWriterFilter@4286e8f3, org.springframework.security.web.authentication.logout.LogoutFilter@1fae0655, org.springframework.security.oauth2.provider.authentication.OAuth2AuthenticationProcessingFilter@226ca31f, org.springframework.security.web.savedrequest.RequestCacheAwareFilter@5aedd9e0, org.springframework.security.web.servletapi.SecurityContextHolderAwareRequestFilter@2fd9633e, org.springframework.security.web.authentication.AnonymousAuthenticationFilter@423ed07f, org.springframework.security.web.session.SessionManagementFilter@603a0fa7, org.springframework.security.web.access.ExceptionTranslationFilter@191014e2, org.springframework.security.web.access.intercept.FilterSecurityInterceptor@29cc9ef8]
18-Jun-2019 18:35:01 2019-06-18 18:35:01.355  INFO 30245 --- [           main] o.s.s.web.DefaultSecurityFilterChain     : Creating filter chain: any request, [org.springframework.security.web.context.request.async.WebAsyncManagerIntegrationFilter@38744b9b, org.springframework.security.web.context.SecurityContextPersistenceFilter@bd21918, org.springframework.security.web.header.HeaderWriterFilter@2d7ddc6a, org.springframework.security.web.csrf.CsrfFilter@6c255c40, org.springframework.security.web.authentication.logout.LogoutFilter@cada959, org.springframework.security.web.authentication.UsernamePasswordAuthenticationFilter@1398ca52, org.springframework.security.web.authentication.ui.DefaultLoginPageGeneratingFilter@17ac686d, org.springframework.security.web.authentication.ui.DefaultLogoutPageGeneratingFilter@2a1d622a, org.springframework.security.web.authentication.www.BasicAuthenticationFilter@7f2c820f, org.springframework.security.web.savedrequest.RequestCacheAwareFilter@5ae17b5, org.springframework.security.web.servletapi.SecurityContextHolderAwareRequestFilter@467305e6, org.springframework.security.web.authentication.AnonymousAuthenticationFilter@7f82f761, org.springframework.security.web.session.SessionManagementFilter@4d539bae, org.springframework.security.web.access.ExceptionTranslationFilter@571b3d3a, org.springframework.security.web.access.intercept.FilterSecurityInterceptor@325405ea]
18-Jun-2019 18:35:01 2019-06-18 18:35:01.367  INFO 30245 --- [           main] o.s.b.a.e.web.EndpointLinksResolver      : Exposing 2 endpoint(s) beneath base path '/actuator'
18-Jun-2019 18:35:01 2019-06-18 18:35:01.442  INFO 30245 --- [           main] entBootstrapConfigurationIntegrationTest : Started CloudEnvironmentBootstrapConfigurationIntegrationTest in 0.713 seconds (JVM running for 15.549)
18-Jun-2019 18:35:01 [INFO] Tests run: 1, Failures: 0, Errors: 0, Skipped: 0, Time elapsed: 0.723 s - in io.pivotal.cfenv.boot.scs.CloudEnvironmentBootstrapConfigurationIntegrationTest
18-Jun-2019 18:35:01 [INFO] Running io.pivotal.cfenv.boot.scs.BootIntegrationTest
18-Jun-2019 18:35:01 2019-06-18 18:35:01.450  INFO 30245 --- [           main] .b.t.c.SpringBootTestContextBootstrapper : Neither @ContextConfiguration nor @ContextHierarchy found for test class [io.pivotal.cfenv.boot.scs.BootIntegrationTest], using SpringBootContextLoader
18-Jun-2019 18:35:01 2019-06-18 18:35:01.450  INFO 30245 --- [           main] o.s.t.c.support.AbstractContextLoader    : Could not detect default resource locations for test class [io.pivotal.cfenv.boot.scs.BootIntegrationTest]: no resource found for suffixes {-context.xml, Context.groovy}.
18-Jun-2019 18:35:01 2019-06-18 18:35:01.452  INFO 30245 --- [           main] .b.t.c.SpringBootTestContextBootstrapper : Loaded default TestExecutionListener class names from location [META-INF/spring.factories]: [org.springframework.boot.test.mock.mockito.MockitoTestExecutionListener, org.springframework.boot.test.mock.mockito.ResetMocksTestExecutionListener, org.springframework.boot.test.autoconfigure.restdocs.RestDocsTestExecutionListener, org.springframework.boot.test.autoconfigure.web.client.MockRestServiceServerResetTestExecutionListener, org.springframework.boot.test.autoconfigure.web.servlet.MockMvcPrintOnlyOnFailureTestExecutionListener, org.springframework.boot.test.autoconfigure.web.servlet.WebDriverTestExecutionListener, org.springframework.test.context.web.ServletTestExecutionListener, org.springframework.test.context.support.DirtiesContextBeforeModesTestExecutionListener, org.springframework.test.context.support.DependencyInjectionTestExecutionListener, org.springframework.test.context.support.DirtiesContextTestExecutionListener, org.springframework.test.context.transaction.TransactionalTestExecutionListener, org.springframework.test.context.jdbc.SqlScriptsTestExecutionListener]
18-Jun-2019 18:35:01 2019-06-18 18:35:01.452  INFO 30245 --- [           main] .b.t.c.SpringBootTestContextBootstrapper : Using TestExecutionListeners: [org.springframework.test.context.web.ServletTestExecutionListener@3653de91, org.springframework.test.context.support.DirtiesContextBeforeModesTestExecutionListener@4a21741c, org.springframework.boot.test.mock.mockito.MockitoTestExecutionListener@290caab7, org.springframework.boot.test.autoconfigure.SpringBootDependencyInjectionTestExecutionListener@63c3a3c2, org.springframework.test.context.support.DirtiesContextTestExecutionListener@4bcc4e7d, org.springframework.boot.test.mock.mockito.ResetMocksTestExecutionListener@a0c528c, org.springframework.boot.test.autoconfigure.restdocs.RestDocsTestExecutionListener@46191868, org.springframework.boot.test.autoconfigure.web.client.MockRestServiceServerResetTestExecutionListener@383a7eda, org.springframework.boot.test.autoconfigure.web.servlet.MockMvcPrintOnlyOnFailureTestExecutionListener@11ac7006, org.springframework.boot.test.autoconfigure.web.servlet.WebDriverTestExecutionListener@795cc88d]
18-Jun-2019 18:35:01 2019-06-18 18:35:01.488  INFO 30245 --- [           main] trationDelegate$BeanPostProcessorChecker : Bean 'org.springframework.cloud.autoconfigure.ConfigurationPropertiesRebinderAutoConfiguration' of type [org.springframework.cloud.autoconfigure.ConfigurationPropertiesRebinderAutoConfiguration$$EnhancerBySpringCGLIB$$fdaea27c] is not eligible for getting processed by all BeanPostProcessors (for example: not eligible for auto-proxying)
18-Jun-2019 18:35:01
18-Jun-2019 18:35:01   .   ____          _            __ _ _
18-Jun-2019 18:35:01 /\\ / ___'_ __ _ _(_)_ __  __ _ \ \ \ \
18-Jun-2019 18:35:01 ( ( )\___ | '_ | '_| | '_ \/ _` | \ \ \ \
18-Jun-2019 18:35:01 \\/  ___)| |_)| | | | | || (_| |  ) ) ) )
18-Jun-2019 18:35:01   '  |____| .__|_| |_|_| |_\__, | / / / /
18-Jun-2019 18:35:01 =========|_|==============|___/=/_/_/_/
18-Jun-2019 18:35:01 :: Spring Boot ::        (v2.1.1.RELEASE)
18-Jun-2019 18:35:01
18-Jun-2019 18:35:01 2019-06-18 18:35:01.515  INFO 30245 --- [           main] i.p.cfenv.boot.scs.BootIntegrationTest   : The following profiles are active: native
18-Jun-2019 18:35:01 2019-06-18 18:35:01.522  INFO 30245 --- [           main] i.p.cfenv.boot.scs.BootIntegrationTest   : Started BootIntegrationTest in 0.068 seconds (JVM running for 15.629)
18-Jun-2019 18:35:02 [INFO] Tests run: 1, Failures: 0, Errors: 0, Skipped: 0, Time elapsed: 0.571 s - in io.pivotal.cfenv.boot.scs.BootIntegrationTest
18-Jun-2019 18:35:02 2019-06-18 18:35:02.055  INFO 30245 --- [      Thread-10] o.s.s.c.ThreadPoolTaskScheduler          : Shutting down ExecutorService 'taskScheduler'
18-Jun-2019 18:35:02 2019-06-18 18:35:02.067  INFO 30245 --- [      Thread-31] o.s.s.concurrent.ThreadPoolTaskExecutor  : Shutting down ExecutorService 'applicationTaskExecutor'
18-Jun-2019 18:35:02 2019-06-18 18:35:02.069  INFO 30245 --- [      Thread-46] o.s.s.concurrent.ThreadPoolTaskExecutor  : Shutting down ExecutorService 'applicationTaskExecutor'
18-Jun-2019 18:35:02 2019-06-18 18:35:02.073  INFO 30245 --- [      Thread-17] o.s.s.concurrent.ThreadPoolTaskExecutor  : Shutting down ExecutorService 'applicationTaskExecutor'
18-Jun-2019 18:35:02 2019-06-18 18:35:02.085  INFO 30245 --- [      Thread-10] o.s.s.concurrent.ThreadPoolTaskExecutor  : Shutting down ExecutorService 'applicationTaskExecutor'
18-Jun-2019 18:35:02 [INFO]
18-Jun-2019 18:35:02 [INFO] Results:
18-Jun-2019 18:35:02 [INFO]
18-Jun-2019 18:35:02 [INFO] Tests run: 13, Failures: 0, Errors: 0, Skipped: 0
18-Jun-2019 18:35:02 [INFO]
18-Jun-2019 18:35:02 [INFO]
18-Jun-2019 18:35:02 [INFO] --- jacoco-maven-plugin:0.7.9:report (report) @ java-cfenv-boot-pivotal-scs ---
18-Jun-2019 18:35:02 [INFO] Loading execution data file /opt/bamboo-home/xml-data/build-dir/CFENV-BMASTER-JOB1/java-cfenv-boot-pivotal-scs/target/jacoco.exec
18-Jun-2019 18:35:02 [INFO] Analyzed bundle 'Java CF Env Pivotal Spring Cloud Services' with 9 classes
18-Jun-2019 18:35:02 [INFO]
18-Jun-2019 18:35:02 [INFO] --- maven-jar-plugin:3.0.2:jar (default-jar) @ java-cfenv-boot-pivotal-scs ---
18-Jun-2019 18:35:02 [INFO] Building jar: /opt/bamboo-home/xml-data/build-dir/CFENV-BMASTER-JOB1/java-cfenv-boot-pivotal-scs/target/java-cfenv-boot-pivotal-scs-1.1.1.BUILD-SNAPSHOT.jar
18-Jun-2019 18:35:02 [INFO]
18-Jun-2019 18:35:02 [INFO] >>> maven-source-plugin:3.0.1:jar (attach-sources) > generate-sources @ java-cfenv-boot-pivotal-scs >>>
18-Jun-2019 18:35:02 [INFO]
18-Jun-2019 18:35:02 [INFO] --- maven-checkstyle-plugin:3.0.0:check (validate) @ java-cfenv-boot-pivotal-scs ---
18-Jun-2019 18:35:02 [INFO]
18-Jun-2019 18:35:02 [INFO] --- jacoco-maven-plugin:0.7.9:prepare-agent (agent) @ java-cfenv-boot-pivotal-scs ---
18-Jun-2019 18:35:02 [INFO] argLine set to -javaagent:/home/bamboo/.m2/repository/org/jacoco/org.jacoco.agent/0.7.9/org.jacoco.agent-0.7.9-runtime.jar=destfile=/opt/bamboo-home/xml-data/build-dir/CFENV-BMASTER-JOB1/java-cfenv-boot-pivotal-scs/target/jacoco.exec
18-Jun-2019 18:35:02 [INFO]
18-Jun-2019 18:35:02 [INFO] <<< maven-source-plugin:3.0.1:jar (attach-sources) < generate-sources @ java-cfenv-boot-pivotal-scs <<<
18-Jun-2019 18:35:02 [INFO]
18-Jun-2019 18:35:02 [INFO]
18-Jun-2019 18:35:02 [INFO] --- maven-source-plugin:3.0.1:jar (attach-sources) @ java-cfenv-boot-pivotal-scs ---
18-Jun-2019 18:35:02 [INFO] Building jar: /opt/bamboo-home/xml-data/build-dir/CFENV-BMASTER-JOB1/java-cfenv-boot-pivotal-scs/target/java-cfenv-boot-pivotal-scs-1.1.1.BUILD-SNAPSHOT-sources.jar
18-Jun-2019 18:35:02 [INFO]
18-Jun-2019 18:35:02 [INFO] --- maven-javadoc-plugin:3.0.1:jar (attach-javadocs) @ java-cfenv-boot-pivotal-scs ---
18-Jun-2019 18:35:03 [INFO] Building jar: /opt/bamboo-home/xml-data/build-dir/CFENV-BMASTER-JOB1/java-cfenv-boot-pivotal-scs/target/java-cfenv-boot-pivotal-scs-1.1.1.BUILD-SNAPSHOT-javadoc.jar
18-Jun-2019 18:35:03 [INFO]
18-Jun-2019 18:35:03 [INFO] --- maven-javadoc-plugin:3.0.1:jar (javadoc) @ java-cfenv-boot-pivotal-scs ---
18-Jun-2019 18:35:04 [INFO] Building jar: /opt/bamboo-home/xml-data/build-dir/CFENV-BMASTER-JOB1/java-cfenv-boot-pivotal-scs/target/java-cfenv-boot-pivotal-scs-1.1.1.BUILD-SNAPSHOT-javadoc.jar
18-Jun-2019 18:35:04 [INFO]
18-Jun-2019 18:35:04 [INFO] --- maven-install-plugin:2.4:install (default-install) @ java-cfenv-boot-pivotal-scs ---
18-Jun-2019 18:35:04 [INFO] Installing /opt/bamboo-home/xml-data/build-dir/CFENV-BMASTER-JOB1/java-cfenv-boot-pivotal-scs/target/java-cfenv-boot-pivotal-scs-1.1.1.BUILD-SNAPSHOT.jar to /home/bamboo/.m2/repository/io/pivotal/cfenv/java-cfenv-boot-pivotal-scs/1.1.1.BUILD-SNAPSHOT/java-cfenv-boot-pivotal-scs-1.1.1.BUILD-SNAPSHOT.jar
18-Jun-2019 18:35:04 [INFO] Installing /opt/bamboo-home/xml-data/build-dir/CFENV-BMASTER-JOB1/java-cfenv-boot-pivotal-scs/pom.xml to /home/bamboo/.m2/repository/io/pivotal/cfenv/java-cfenv-boot-pivotal-scs/1.1.1.BUILD-SNAPSHOT/java-cfenv-boot-pivotal-scs-1.1.1.BUILD-SNAPSHOT.pom
18-Jun-2019 18:35:04 [INFO] Installing /opt/bamboo-home/xml-data/build-dir/CFENV-BMASTER-JOB1/java-cfenv-boot-pivotal-scs/target/java-cfenv-boot-pivotal-scs-1.1.1.BUILD-SNAPSHOT-sources.jar to /home/bamboo/.m2/repository/io/pivotal/cfenv/java-cfenv-boot-pivotal-scs/1.1.1.BUILD-SNAPSHOT/java-cfenv-boot-pivotal-scs-1.1.1.BUILD-SNAPSHOT-sources.jar
18-Jun-2019 18:35:04 [INFO] Installing /opt/bamboo-home/xml-data/build-dir/CFENV-BMASTER-JOB1/java-cfenv-boot-pivotal-scs/target/java-cfenv-boot-pivotal-scs-1.1.1.BUILD-SNAPSHOT-javadoc.jar to /home/bamboo/.m2/repository/io/pivotal/cfenv/java-cfenv-boot-pivotal-scs/1.1.1.BUILD-SNAPSHOT/java-cfenv-boot-pivotal-scs-1.1.1.BUILD-SNAPSHOT-javadoc.jar
18-Jun-2019 18:35:04 [INFO] Installing /opt/bamboo-home/xml-data/build-dir/CFENV-BMASTER-JOB1/java-cfenv-boot-pivotal-scs/target/java-cfenv-boot-pivotal-scs-1.1.1.BUILD-SNAPSHOT-javadoc.jar to /home/bamboo/.m2/repository/io/pivotal/cfenv/java-cfenv-boot-pivotal-scs/1.1.1.BUILD-SNAPSHOT/java-cfenv-boot-pivotal-scs-1.1.1.BUILD-SNAPSHOT-javadoc.jar
18-Jun-2019 18:35:04 [INFO]
18-Jun-2019 18:35:04 [INFO] ------------< io.pivotal.cfenv:java-cfenv-boot-pivotal-sso >------------
18-Jun-2019 18:35:04 [INFO] Building Java CF Env Pivotal Single Sign On 1.1.1.BUILD-SNAPSHOT   [7/7]
18-Jun-2019 18:35:04 [INFO] --------------------------------[ jar ]---------------------------------
18-Jun-2019 18:35:04 [INFO]
18-Jun-2019 18:35:04 [INFO] --- maven-clean-plugin:2.5:clean (default-clean) @ java-cfenv-boot-pivotal-sso ---
18-Jun-2019 18:35:04 [INFO]
18-Jun-2019 18:35:04 [INFO] --- maven-checkstyle-plugin:3.0.0:check (validate) @ java-cfenv-boot-pivotal-sso ---
18-Jun-2019 18:35:04 [INFO]
18-Jun-2019 18:35:04 [INFO] --- jacoco-maven-plugin:0.7.9:prepare-agent (agent) @ java-cfenv-boot-pivotal-sso ---
18-Jun-2019 18:35:04 [INFO] argLine set to -javaagent:/home/bamboo/.m2/repository/org/jacoco/org.jacoco.agent/0.7.9/org.jacoco.agent-0.7.9-runtime.jar=destfile=/opt/bamboo-home/xml-data/build-dir/CFENV-BMASTER-JOB1/java-cfenv-boot-pivotal-sso/target/jacoco.exec
18-Jun-2019 18:35:04 [INFO]
18-Jun-2019 18:35:04 [INFO] --- maven-resources-plugin:2.6:resources (default-resources) @ java-cfenv-boot-pivotal-sso ---
18-Jun-2019 18:35:04 [INFO] Using 'UTF-8' encoding to copy filtered resources.
18-Jun-2019 18:35:04 [INFO] Copying 1 resource
18-Jun-2019 18:35:04 [INFO]
18-Jun-2019 18:35:04 [INFO] --- maven-compiler-plugin:3.8.0:compile (default-compile) @ java-cfenv-boot-pivotal-sso ---
18-Jun-2019 18:35:04 [INFO] Changes detected - recompiling the module!
18-Jun-2019 18:35:04 [INFO] Compiling 3 source files to /opt/bamboo-home/xml-data/build-dir/CFENV-BMASTER-JOB1/java-cfenv-boot-pivotal-sso/target/classes
18-Jun-2019 18:35:04 [INFO]
18-Jun-2019 18:35:04 [INFO] --- maven-resources-plugin:2.6:testResources (default-testResources) @ java-cfenv-boot-pivotal-sso ---
18-Jun-2019 18:35:04 [INFO] Using 'UTF-8' encoding to copy filtered resources.
18-Jun-2019 18:35:04 [INFO] Copying 1 resource
18-Jun-2019 18:35:04 [INFO]
18-Jun-2019 18:35:04 [INFO] --- maven-compiler-plugin:3.8.0:testCompile (default-testCompile) @ java-cfenv-boot-pivotal-sso ---
18-Jun-2019 18:35:04 [INFO] Changes detected - recompiling the module!
18-Jun-2019 18:35:04 [INFO] Compiling 4 source files to /opt/bamboo-home/xml-data/build-dir/CFENV-BMASTER-JOB1/java-cfenv-boot-pivotal-sso/target/test-classes
18-Jun-2019 18:35:04 [INFO]
18-Jun-2019 18:35:04 [INFO] --- maven-surefire-plugin:2.20:test (default-test) @ java-cfenv-boot-pivotal-sso ---
18-Jun-2019 18:35:04 [INFO]
18-Jun-2019 18:35:04 [INFO] -------------------------------------------------------
18-Jun-2019 18:35:04 [INFO]  T E S T S
18-Jun-2019 18:35:04 [INFO] -------------------------------------------------------
18-Jun-2019 18:35:05 [INFO] Running io.pivotal.cfenv.boot.sso.FromAuthDomainTests
18-Jun-2019 18:35:05 [INFO] Tests run: 7, Failures: 0, Errors: 0, Skipped: 0, Time elapsed: 0.152 s - in io.pivotal.cfenv.boot.sso.FromAuthDomainTests
18-Jun-2019 18:35:05 [INFO] Running io.pivotal.cfenv.boot.sso.CfSingleSignOnProcessorTest
18-Jun-2019 18:35:07 2019-06-18 18:35:07.405  INFO 30445 --- [           main] o.a.maven.surefire.booter.ForkedBooter   : Starting ForkedBooter v2.20 on bamboo-16 with PID 30445 (started by bamboo in /opt/bamboo-home/xml-data/build-dir/CFENV-BMASTER-JOB1/java-cfenv-boot-pivotal-sso)
18-Jun-2019 18:35:07 2019-06-18 18:35:07.412  INFO 30445 --- [           main] o.a.maven.surefire.booter.ForkedBooter   : No active profile set, falling back to default profiles: default
18-Jun-2019 18:35:07 2019-06-18 18:35:07.465  INFO 30445 --- [           main] i.p.c.s.boot.CfEnvironmentPostProcessor  : Setting ssoServiceUrl,spring.security.oauth2.client properties from bound service [my-sso-instance] using io.pivotal.cfenv.boot.sso.CfSingleSignOnProcessor
18-Jun-2019 18:35:08 2019-06-18 18:35:08.102  INFO 30445 --- [           main] o.a.maven.surefire.booter.ForkedBooter   : Started ForkedBooter in 1.287 seconds (JVM running for 3.2)
18-Jun-2019 18:35:08 2019-06-18 18:35:08.219  INFO 30445 --- [           main] o.a.maven.surefire.booter.ForkedBooter   : Starting ForkedBooter v2.20 on bamboo-16 with PID 30445 (started by bamboo in /opt/bamboo-home/xml-data/build-dir/CFENV-BMASTER-JOB1/java-cfenv-boot-pivotal-sso)
18-Jun-2019 18:35:08 2019-06-18 18:35:08.220  INFO 30445 --- [           main] o.a.maven.surefire.booter.ForkedBooter   : No active profile set, falling back to default profiles: default
18-Jun-2019 18:35:08 2019-06-18 18:35:08.319  INFO 30445 --- [           main] o.a.maven.surefire.booter.ForkedBooter   : Started ForkedBooter in 0.132 seconds (JVM running for 3.418)
18-Jun-2019 18:35:08 2019-06-18 18:35:08.446  INFO 30445 --- [           main] o.a.maven.surefire.booter.ForkedBooter   : Starting ForkedBooter v2.20 on bamboo-16 with PID 30445 (started by bamboo in /opt/bamboo-home/xml-data/build-dir/CFENV-BMASTER-JOB1/java-cfenv-boot-pivotal-sso)
18-Jun-2019 18:35:08 2019-06-18 18:35:08.447  INFO 30445 --- [           main] o.a.maven.surefire.booter.ForkedBooter   : No active profile set, falling back to default profiles: default
18-Jun-2019 18:35:08 2019-06-18 18:35:08.532  INFO 30445 --- [           main] o.a.maven.surefire.booter.ForkedBooter   : Started ForkedBooter in 0.128 seconds (JVM running for 3.631)
18-Jun-2019 18:35:08 [INFO] Tests run: 3, Failures: 0, Errors: 0, Skipped: 0, Time elapsed: 3.074 s - in io.pivotal.cfenv.boot.sso.CfSingleSignOnProcessorTest
18-Jun-2019 18:35:08 [INFO] Running io.pivotal.cfenv.boot.sso.BootIntegrationTest
18-Jun-2019 18:35:08 2019-06-18 18:35:08.568  INFO 30445 --- [           main] .b.t.c.SpringBootTestContextBootstrapper : Neither @ContextConfiguration nor @ContextHierarchy found for test class [io.pivotal.cfenv.boot.sso.BootIntegrationTest], using SpringBootContextLoader
18-Jun-2019 18:35:08 2019-06-18 18:35:08.569  INFO 30445 --- [           main] o.s.t.c.support.AbstractContextLoader    : Could not detect default resource locations for test class [io.pivotal.cfenv.boot.sso.BootIntegrationTest]: no resource found for suffixes {-context.xml, Context.groovy}.
18-Jun-2019 18:35:08 2019-06-18 18:35:08.596  INFO 30445 --- [           main] .b.t.c.SpringBootTestContextBootstrapper : Loaded default TestExecutionListener class names from location [META-INF/spring.factories]: [org.springframework.boot.test.mock.mockito.MockitoTestExecutionListener, org.springframework.boot.test.mock.mockito.ResetMocksTestExecutionListener, org.springframework.boot.test.autoconfigure.restdocs.RestDocsTestExecutionListener, org.springframework.boot.test.autoconfigure.web.client.MockRestServiceServerResetTestExecutionListener, org.springframework.boot.test.autoconfigure.web.servlet.MockMvcPrintOnlyOnFailureTestExecutionListener, org.springframework.boot.test.autoconfigure.web.servlet.WebDriverTestExecutionListener, org.springframework.test.context.web.ServletTestExecutionListener, org.springframework.test.context.support.DirtiesContextBeforeModesTestExecutionListener, org.springframework.test.context.support.DependencyInjectionTestExecutionListener, org.springframework.test.context.support.DirtiesContextTestExecutionListener, org.springframework.test.context.transaction.TransactionalTestExecutionListener, org.springframework.test.context.jdbc.SqlScriptsTestExecutionListener]
18-Jun-2019 18:35:08 2019-06-18 18:35:08.609  INFO 30445 --- [           main] .b.t.c.SpringBootTestContextBootstrapper : Using TestExecutionListeners: [org.springframework.test.context.support.DirtiesContextBeforeModesTestExecutionListener@248cc861, org.springframework.boot.test.mock.mockito.MockitoTestExecutionListener@325a7c9, org.springframework.boot.test.autoconfigure.SpringBootDependencyInjectionTestExecutionListener@5d81c34a, org.springframework.test.context.support.DirtiesContextTestExecutionListener@66968a15, org.springframework.boot.test.mock.mockito.ResetMocksTestExecutionListener@249b8966, org.springframework.boot.test.autoconfigure.restdocs.RestDocsTestExecutionListener@aae69d3, org.springframework.boot.test.autoconfigure.web.client.MockRestServiceServerResetTestExecutionListener@59e6705f, org.springframework.boot.test.autoconfigure.web.servlet.MockMvcPrintOnlyOnFailureTestExecutionListener@bf29f54, org.springframework.boot.test.autoconfigure.web.servlet.WebDriverTestExecutionListener@735ae7f5]
18-Jun-2019 18:35:08
18-Jun-2019 18:35:08   .   ____          _            __ _ _
18-Jun-2019 18:35:08 /\\ / ___'_ __ _ _(_)_ __  __ _ \ \ \ \
18-Jun-2019 18:35:08 ( ( )\___ | '_ | '_| | '_ \/ _` | \ \ \ \
18-Jun-2019 18:35:08 \\/  ___)| |_)| | | | | || (_| |  ) ) ) )
18-Jun-2019 18:35:08   '  |____| .__|_| |_|_| |_\__, | / / / /
18-Jun-2019 18:35:08 =========|_|==============|___/=/_/_/_/
18-Jun-2019 18:35:08 :: Spring Boot ::        (v2.1.1.RELEASE)
18-Jun-2019 18:35:08
18-Jun-2019 18:35:08 2019-06-18 18:35:08.652  INFO 30445 --- [           main] i.p.cfenv.boot.sso.BootIntegrationTest   : Starting BootIntegrationTest on bamboo-16 with PID 30445 (started by bamboo in /opt/bamboo-home/xml-data/build-dir/CFENV-BMASTER-JOB1/java-cfenv-boot-pivotal-sso)
18-Jun-2019 18:35:08 2019-06-18 18:35:08.653  INFO 30445 --- [           main] i.p.cfenv.boot.sso.BootIntegrationTest   : No active profile set, falling back to default profiles: default
18-Jun-2019 18:35:08 2019-06-18 18:35:08.671  INFO 30445 --- [           main] i.p.cfenv.boot.sso.BootIntegrationTest   : Started BootIntegrationTest in 0.051 seconds (JVM running for 3.77)
18-Jun-2019 18:35:08 [INFO] Tests run: 1, Failures: 0, Errors: 0, Skipped: 0, Time elapsed: 0.214 s - in io.pivotal.cfenv.boot.sso.BootIntegrationTest
18-Jun-2019 18:35:09 [INFO]
18-Jun-2019 18:35:09 [INFO] Results:
18-Jun-2019 18:35:09 [INFO]
18-Jun-2019 18:35:09 [INFO] Tests run: 11, Failures: 0, Errors: 0, Skipped: 0
18-Jun-2019 18:35:09 [INFO]
18-Jun-2019 18:35:09 [INFO]
18-Jun-2019 18:35:09 [INFO] --- jacoco-maven-plugin:0.7.9:report (report) @ java-cfenv-boot-pivotal-sso ---
18-Jun-2019 18:35:09 [INFO] Loading execution data file /opt/bamboo-home/xml-data/build-dir/CFENV-BMASTER-JOB1/java-cfenv-boot-pivotal-sso/target/jacoco.exec
18-Jun-2019 18:35:09 [INFO] Analyzed bundle 'Java CF Env Pivotal Single Sign On' with 3 classes
18-Jun-2019 18:35:09 [INFO]
18-Jun-2019 18:35:09 [INFO] --- maven-jar-plugin:3.0.2:jar (default-jar) @ java-cfenv-boot-pivotal-sso ---
18-Jun-2019 18:35:09 [INFO] Building jar: /opt/bamboo-home/xml-data/build-dir/CFENV-BMASTER-JOB1/java-cfenv-boot-pivotal-sso/target/java-cfenv-boot-pivotal-sso-1.1.1.BUILD-SNAPSHOT.jar
18-Jun-2019 18:35:09 [INFO]
18-Jun-2019 18:35:09 [INFO] >>> maven-source-plugin:3.0.1:jar (attach-sources) > generate-sources @ java-cfenv-boot-pivotal-sso >>>
18-Jun-2019 18:35:09 [INFO]
18-Jun-2019 18:35:09 [INFO] --- maven-checkstyle-plugin:3.0.0:check (validate) @ java-cfenv-boot-pivotal-sso ---
18-Jun-2019 18:35:09 [INFO]
18-Jun-2019 18:35:09 [INFO] --- jacoco-maven-plugin:0.7.9:prepare-agent (agent) @ java-cfenv-boot-pivotal-sso ---
18-Jun-2019 18:35:09 [INFO] argLine set to -javaagent:/home/bamboo/.m2/repository/org/jacoco/org.jacoco.agent/0.7.9/org.jacoco.agent-0.7.9-runtime.jar=destfile=/opt/bamboo-home/xml-data/build-dir/CFENV-BMASTER-JOB1/java-cfenv-boot-pivotal-sso/target/jacoco.exec
18-Jun-2019 18:35:09 [INFO]
18-Jun-2019 18:35:09 [INFO] <<< maven-source-plugin:3.0.1:jar (attach-sources) < generate-sources @ java-cfenv-boot-pivotal-sso <<<
18-Jun-2019 18:35:09 [INFO]
18-Jun-2019 18:35:09 [INFO]
18-Jun-2019 18:35:09 [INFO] --- maven-source-plugin:3.0.1:jar (attach-sources) @ java-cfenv-boot-pivotal-sso ---
18-Jun-2019 18:35:09 [INFO] Building jar: /opt/bamboo-home/xml-data/build-dir/CFENV-BMASTER-JOB1/java-cfenv-boot-pivotal-sso/target/java-cfenv-boot-pivotal-sso-1.1.1.BUILD-SNAPSHOT-sources.jar
18-Jun-2019 18:35:09 [INFO]
18-Jun-2019 18:35:09 [INFO] --- maven-javadoc-plugin:3.0.1:jar (attach-javadocs) @ java-cfenv-boot-pivotal-sso ---
18-Jun-2019 18:35:09 [INFO] Building jar: /opt/bamboo-home/xml-data/build-dir/CFENV-BMASTER-JOB1/java-cfenv-boot-pivotal-sso/target/java-cfenv-boot-pivotal-sso-1.1.1.BUILD-SNAPSHOT-javadoc.jar
18-Jun-2019 18:35:09 [INFO]
18-Jun-2019 18:35:09 [INFO] --- maven-javadoc-plugin:3.0.1:jar (javadoc) @ java-cfenv-boot-pivotal-sso ---
18-Jun-2019 18:35:10 [INFO] Building jar: /opt/bamboo-home/xml-data/build-dir/CFENV-BMASTER-JOB1/java-cfenv-boot-pivotal-sso/target/java-cfenv-boot-pivotal-sso-1.1.1.BUILD-SNAPSHOT-javadoc.jar
18-Jun-2019 18:35:10 [INFO]
18-Jun-2019 18:35:10 [INFO] --- maven-install-plugin:2.4:install (default-install) @ java-cfenv-boot-pivotal-sso ---
18-Jun-2019 18:35:10 [INFO] Installing /opt/bamboo-home/xml-data/build-dir/CFENV-BMASTER-JOB1/java-cfenv-boot-pivotal-sso/target/java-cfenv-boot-pivotal-sso-1.1.1.BUILD-SNAPSHOT.jar to /home/bamboo/.m2/repository/io/pivotal/cfenv/java-cfenv-boot-pivotal-sso/1.1.1.BUILD-SNAPSHOT/java-cfenv-boot-pivotal-sso-1.1.1.BUILD-SNAPSHOT.jar
18-Jun-2019 18:35:10 [INFO] Installing /opt/bamboo-home/xml-data/build-dir/CFENV-BMASTER-JOB1/java-cfenv-boot-pivotal-sso/pom.xml to /home/bamboo/.m2/repository/io/pivotal/cfenv/java-cfenv-boot-pivotal-sso/1.1.1.BUILD-SNAPSHOT/java-cfenv-boot-pivotal-sso-1.1.1.BUILD-SNAPSHOT.pom
18-Jun-2019 18:35:10 [INFO] Installing /opt/bamboo-home/xml-data/build-dir/CFENV-BMASTER-JOB1/java-cfenv-boot-pivotal-sso/target/java-cfenv-boot-pivotal-sso-1.1.1.BUILD-SNAPSHOT-sources.jar to /home/bamboo/.m2/repository/io/pivotal/cfenv/java-cfenv-boot-pivotal-sso/1.1.1.BUILD-SNAPSHOT/java-cfenv-boot-pivotal-sso-1.1.1.BUILD-SNAPSHOT-sources.jar
18-Jun-2019 18:35:10 [INFO] Installing /opt/bamboo-home/xml-data/build-dir/CFENV-BMASTER-JOB1/java-cfenv-boot-pivotal-sso/target/java-cfenv-boot-pivotal-sso-1.1.1.BUILD-SNAPSHOT-javadoc.jar to /home/bamboo/.m2/repository/io/pivotal/cfenv/java-cfenv-boot-pivotal-sso/1.1.1.BUILD-SNAPSHOT/java-cfenv-boot-pivotal-sso-1.1.1.BUILD-SNAPSHOT-javadoc.jar
18-Jun-2019 18:35:10 [INFO] Installing /opt/bamboo-home/xml-data/build-dir/CFENV-BMASTER-JOB1/java-cfenv-boot-pivotal-sso/target/java-cfenv-boot-pivotal-sso-1.1.1.BUILD-SNAPSHOT-javadoc.jar to /home/bamboo/.m2/repository/io/pivotal/cfenv/java-cfenv-boot-pivotal-sso/1.1.1.BUILD-SNAPSHOT/java-cfenv-boot-pivotal-sso-1.1.1.BUILD-SNAPSHOT-javadoc.jar
18-Jun-2019 18:35:10 [INFO] Artifactory Build Info Recorder: Saving Build Info to '/opt/bamboo-home/xml-data/build-dir/CFENV-BMASTER-JOB1/target/build-info.json'
18-Jun-2019 18:35:10 [INFO] Deploying artifact: https://repo.spring.io/libs-snapshot-local/io/pivotal/cfenv/java-cfenv-jdbc/1.1.1.BUILD-SNAPSHOT/java-cfenv-jdbc-1.1.1.BUILD-SNAPSHOT-sources.jar
18-Jun-2019 18:35:11 [INFO] Deploying artifact: https://repo.spring.io/libs-snapshot-local/io/pivotal/cfenv/java-cfenv-jdbc/1.1.1.BUILD-SNAPSHOT/java-cfenv-jdbc-1.1.1.BUILD-SNAPSHOT.jar
18-Jun-2019 18:35:11 [INFO] Deploying artifact: https://repo.spring.io/libs-snapshot-local/io/pivotal/cfenv/java-cfenv-jdbc/1.1.1.BUILD-SNAPSHOT/java-cfenv-jdbc-1.1.1.BUILD-SNAPSHOT-javadoc.jar
18-Jun-2019 18:35:12 [INFO] Deploying artifact: https://repo.spring.io/libs-snapshot-local/io/pivotal/cfenv/java-cfenv-jdbc/1.1.1.BUILD-SNAPSHOT/java-cfenv-jdbc-1.1.1.BUILD-SNAPSHOT.pom
18-Jun-2019 18:35:12 [INFO] Deploying artifact: https://repo.spring.io/libs-snapshot-local/io/pivotal/cfenv/java-cfenv-test-support/1.1.1.BUILD-SNAPSHOT/java-cfenv-test-support-1.1.1.BUILD-SNAPSHOT-javadoc.jar
18-Jun-2019 18:35:12 [INFO] Deploying artifact: https://repo.spring.io/libs-snapshot-local/io/pivotal/cfenv/java-cfenv-test-support/1.1.1.BUILD-SNAPSHOT/java-cfenv-test-support-1.1.1.BUILD-SNAPSHOT.jar
18-Jun-2019 18:35:13 [INFO] Deploying artifact: https://repo.spring.io/libs-snapshot-local/io/pivotal/cfenv/java-cfenv-test-support/1.1.1.BUILD-SNAPSHOT/java-cfenv-test-support-1.1.1.BUILD-SNAPSHOT-sources.jar
18-Jun-2019 18:35:13 [INFO] Deploying artifact: https://repo.spring.io/libs-snapshot-local/io/pivotal/cfenv/java-cfenv-test-support/1.1.1.BUILD-SNAPSHOT/java-cfenv-test-support-1.1.1.BUILD-SNAPSHOT.pom
18-Jun-2019 18:35:13 [INFO] Deploying artifact: https://repo.spring.io/libs-snapshot-local/io/pivotal/cfenv/java-cfenv-boot/1.1.1.BUILD-SNAPSHOT/java-cfenv-boot-1.1.1.BUILD-SNAPSHOT-javadoc.jar
18-Jun-2019 18:35:14 [INFO] Deploying artifact: https://repo.spring.io/libs-snapshot-local/io/pivotal/cfenv/java-cfenv-boot/1.1.1.BUILD-SNAPSHOT/java-cfenv-boot-1.1.1.BUILD-SNAPSHOT.jar
18-Jun-2019 18:35:14 [INFO] Deploying artifact: https://repo.spring.io/libs-snapshot-local/io/pivotal/cfenv/java-cfenv-boot/1.1.1.BUILD-SNAPSHOT/java-cfenv-boot-1.1.1.BUILD-SNAPSHOT-sources.jar
18-Jun-2019 18:35:15 [INFO] Deploying artifact: https://repo.spring.io/libs-snapshot-local/io/pivotal/cfenv/java-cfenv-boot/1.1.1.BUILD-SNAPSHOT/java-cfenv-boot-1.1.1.BUILD-SNAPSHOT.pom
18-Jun-2019 18:35:15 [INFO] Deploying artifact: https://repo.spring.io/libs-snapshot-local/io/pivotal/cfenv/java-cfenv/1.1.1.BUILD-SNAPSHOT/java-cfenv-1.1.1.BUILD-SNAPSHOT-sources.jar
18-Jun-2019 18:35:15 [INFO] Deploying artifact: https://repo.spring.io/libs-snapshot-local/io/pivotal/cfenv/java-cfenv/1.1.1.BUILD-SNAPSHOT/java-cfenv-1.1.1.BUILD-SNAPSHOT-javadoc.jar
18-Jun-2019 18:35:16 [INFO] Deploying artifact: https://repo.spring.io/libs-snapshot-local/io/pivotal/cfenv/java-cfenv/1.1.1.BUILD-SNAPSHOT/java-cfenv-1.1.1.BUILD-SNAPSHOT.jar
18-Jun-2019 18:35:16 [INFO] Deploying artifact: https://repo.spring.io/libs-snapshot-local/io/pivotal/cfenv/java-cfenv/1.1.1.BUILD-SNAPSHOT/java-cfenv-1.1.1.BUILD-SNAPSHOT.pom
18-Jun-2019 18:35:16 [INFO] Deploying artifact: https://repo.spring.io/libs-snapshot-local/io/pivotal/cfenv/java-cfenv-boot-pivotal-scs/1.1.1.BUILD-SNAPSHOT/java-cfenv-boot-pivotal-scs-1.1.1.BUILD-SNAPSHOT.jar
18-Jun-2019 18:35:17 [INFO] Deploying artifact: https://repo.spring.io/libs-snapshot-local/io/pivotal/cfenv/java-cfenv-boot-pivotal-scs/1.1.1.BUILD-SNAPSHOT/java-cfenv-boot-pivotal-scs-1.1.1.BUILD-SNAPSHOT-javadoc.jar
18-Jun-2019 18:35:17 [INFO] Deploying artifact: https://repo.spring.io/libs-snapshot-local/io/pivotal/cfenv/java-cfenv-boot-pivotal-scs/1.1.1.BUILD-SNAPSHOT/java-cfenv-boot-pivotal-scs-1.1.1.BUILD-SNAPSHOT-sources.jar
18-Jun-2019 18:35:18 [INFO] Deploying artifact: https://repo.spring.io/libs-snapshot-local/io/pivotal/cfenv/java-cfenv-boot-pivotal-scs/1.1.1.BUILD-SNAPSHOT/java-cfenv-boot-pivotal-scs-1.1.1.BUILD-SNAPSHOT.pom
18-Jun-2019 18:35:18 [INFO] Deploying artifact: https://repo.spring.io/libs-snapshot-local/io/pivotal/cfenv/java-cfenv-parent/1.1.1.BUILD-SNAPSHOT/java-cfenv-parent-1.1.1.BUILD-SNAPSHOT.pom
18-Jun-2019 18:35:18 [INFO] Deploying artifact: https://repo.spring.io/libs-snapshot-local/io/pivotal/cfenv/java-cfenv-boot-pivotal-sso/1.1.1.BUILD-SNAPSHOT/java-cfenv-boot-pivotal-sso-1.1.1.BUILD-SNAPSHOT.jar
18-Jun-2019 18:35:19 [INFO] Deploying artifact: https://repo.spring.io/libs-snapshot-local/io/pivotal/cfenv/java-cfenv-boot-pivotal-sso/1.1.1.BUILD-SNAPSHOT/java-cfenv-boot-pivotal-sso-1.1.1.BUILD-SNAPSHOT-javadoc.jar
18-Jun-2019 18:35:19 [INFO] Deploying artifact: https://repo.spring.io/libs-snapshot-local/io/pivotal/cfenv/java-cfenv-boot-pivotal-sso/1.1.1.BUILD-SNAPSHOT/java-cfenv-boot-pivotal-sso-1.1.1.BUILD-SNAPSHOT-sources.jar
18-Jun-2019 18:35:19 [INFO] Deploying artifact: https://repo.spring.io/libs-snapshot-local/io/pivotal/cfenv/java-cfenv-boot-pivotal-sso/1.1.1.BUILD-SNAPSHOT/java-cfenv-boot-pivotal-sso-1.1.1.BUILD-SNAPSHOT.pom
18-Jun-2019 18:35:20 [INFO] Artifactory Build Info Recorder: Deploying build info ...
18-Jun-2019 18:35:20 [INFO] Deploying build descriptor to: https://repo.spring.io/api/build
18-Jun-2019 18:35:21 [INFO] Build successfully deployed. Browse it in Artifactory under https://repo.spring.io/webapp/builds/Java%20CfEnv%20-%20Java%20CfEnv%20-%20Master%20-%20Build%20and%20install%20CfEnv/72
18-Jun-2019 18:35:21 [INFO] ------------------------------------------------------------------------
18-Jun-2019 18:35:21 [INFO] Reactor Summary:
18-Jun-2019 18:35:21 [INFO]
18-Jun-2019 18:35:21 [INFO] Java CF Env Parent 1.1.1.BUILD-SNAPSHOT ............ SUCCESS [  1.542 s]
18-Jun-2019 18:35:21 [INFO] Java CF Env ........................................ SUCCESS [ 17.621 s]
18-Jun-2019 18:35:21 [INFO] Java CF Env Test Support ........................... SUCCESS [  1.738 s]
18-Jun-2019 18:35:21 [INFO] Java CF Env JDBC ................................... SUCCESS [  4.446 s]
18-Jun-2019 18:35:21 [INFO] Java CF Env Spring Boot ............................ SUCCESS [  8.999 s]
18-Jun-2019 18:35:21 [INFO] Java CF Env Pivotal Spring Cloud Services .......... SUCCESS [ 28.266 s]
18-Jun-2019 18:35:21 [INFO] Java CF Env Pivotal Single Sign On 1.1.1.BUILD-SNAPSHOT SUCCESS [  5.799 s]
18-Jun-2019 18:35:21 [INFO] ------------------------------------------------------------------------
18-Jun-2019 18:35:21 [INFO] BUILD SUCCESS
18-Jun-2019 18:35:21 [INFO] ------------------------------------------------------------------------
18-Jun-2019 18:35:21 [INFO] Total time: 01:20 min
18-Jun-2019 18:35:21 [INFO] Finished at: 2019-06-18T18:35:21Z
18-Jun-2019 18:35:21 [INFO] ------------------------------------------------------------------------
18-Jun-2019 18:35:21 Parsing test results under /opt/bamboo-home/xml-data/build-dir/CFENV-BMASTER-JOB1...
18-Jun-2019 18:35:21 Finished task 'Build and publish Java Cf Env' with result: Success
18-Jun-2019 18:35:21 Running post build plugin 'Docker Container Cleanup'
18-Jun-2019 18:35:21 Running post build plugin 'NCover Results Collector'
18-Jun-2019 18:35:21 Running post build plugin 'Artifactory Release Management Staging'
18-Jun-2019 18:35:21 Running post build plugin 'Artifactory Build Info Copier'
18-Jun-2019 18:35:21 Copying the buildinfo artifacts for build: CFENV-BMASTER-JOB1-72
18-Jun-2019 18:35:21 Running post build plugin 'Artifactory Gradle Properties Info Copier'
18-Jun-2019 18:35:21 Running post build plugin 'Clover Results Collector'
18-Jun-2019 18:35:21 Running post build plugin 'npm Cache Cleanup'
18-Jun-2019 18:35:21 Running post build plugin 'Artifact Copier'
18-Jun-2019 18:35:21 Publishing an artifact: Test Results
18-Jun-2019 18:35:21 Finished publishing of artifact Non required shared artifact: [Test Results], pattern: [**/target/surefire-reports/**/*.*] in 49.08 ms
18-Jun-2019 18:35:21 Successfully removed working directory at '/opt/bamboo-home/xml-data/build-dir/CFENV-BMASTER-JOB1'
18-Jun-2019 18:35:21 Finalising the build...
18-Jun-2019 18:35:21 Stopping timer.
18-Jun-2019 18:35:21 Build CFENV-BMASTER-JOB1-72 completed.
18-Jun-2019 18:35:21 Running on server: post build plugin 'NCover Results Collector'
18-Jun-2019 18:35:21 Running on server: post build plugin 'Build Hanging Detection Configuration'
18-Jun-2019 18:35:21 Running on server: post build plugin 'Clover Delta Calculator'
18-Jun-2019 18:35:21 Running on server: post build plugin 'Maven Dependencies Postprocessor'
18-Jun-2019 18:35:21 All post build plugins have finished
18-Jun-2019 18:35:21 Generating build results summary...
18-Jun-2019 18:35:21 Saving build results to disk...
18-Jun-2019 18:35:21 Logging substituted variables...
18-Jun-2019 18:35:21 Indexing build results...
18-Jun-2019 18:35:21 Finished building CFENV-BMASTER-JOB1-72.