Build result summary

Details

Completed
Duration
32 seconds
Labels
None
Revision
d9160e839b46669c7d2de428b7aa17cc3a6052a6 d9160e839b46669c7d2de428b7aa17cc3a6052a6
Total tests
435
Fixed in
#68 (Changes by Scott Frederick)

Tests

Responsible

No one has taken responsibility for this failure

Code commits

Author Commit Message Commit date
Spring Operator <spring-operator@users.noreply.github.com> Spring Operator <spring-operator@users.noreply.github.com> d9160e839b46669c7d2de428b7aa17cc3a6052a6 d9160e839b46669c7d2de428b7aa17cc3a6052a6 URL Cleanup
This commit updates URLs to prefer the https protocol. Redirects are not followed to avoid accidentally expanding intentionally shortened URLs (i.e. if using a URL shortener).

# Fixed URLs

## Fixed Success
These URLs were switched to an https URL with a 2xx status. While the status was successful, your review is still recommended.

* [ ] http://www.apache.org/licenses/ with 2 occurrences migrated to:
  https://www.apache.org/licenses/ ([https](https://www.apache.org/licenses/) result 200).
* [ ] http://www.apache.org/licenses/LICENSE-2.0 with 20 occurrences migrated to:
  https://www.apache.org/licenses/LICENSE-2.0 ([https](https://www.apache.org/licenses/LICENSE-2.0) result 200).
Spring Operator <spring-operator@users.noreply.github.com> Spring Operator <spring-operator@users.noreply.github.com> 029878b80a1e1e8ab63728146b851bb99b5bd2a5 029878b80a1e1e8ab63728146b851bb99b5bd2a5 URL Cleanup
This commit updates URLs to prefer the https protocol. Redirects are not followed to avoid accidentally expanding intentionally shortened URLs (i.e. if using a URL shortener).

# Fixed URLs

## Fixed Success
These URLs were switched to an https URL with a 2xx status. While the status was successful, your review is still recommended.

* http://www.springframework.org/schema/beans/spring-beans.xsd with 21 occurrences migrated to:
  https://www.springframework.org/schema/beans/spring-beans.xsd ([https](https://www.springframework.org/schema/beans/spring-beans.xsd) result 200).
* http://www.springframework.org/schema/cloud/spring-cloud.xsd with 21 occurrences migrated to:
  https://www.springframework.org/schema/cloud/spring-cloud.xsd ([https](https://www.springframework.org/schema/cloud/spring-cloud.xsd) result 200).

# Ignored
These URLs were intentionally ignored.

* http://www.springframework.org/schema/beans with 42 occurrences
* http://www.springframework.org/schema/cloud with 42 occurrences
* http://www.w3.org/2001/XMLSchema-instance with 21 occurrences

Tests

New test failures 30
Status Test View job Duration
Collapse Failed CassandraClusterXmlConfigTest cloudConnectorWithServiceNameSpecified_UniqueServiceExists History
Default Job < 1 sec
org.springframework.beans.factory.xml.XmlBeanDefinitionStoreException: org.springframework.beans.factory.xml.XmlBeanDefinitionStoreException: Line 8 in XML document from class path resource [org/springframework/cloud/config/xml/cloud-cassandra-with-service-id.xml] is invalid; nested exception is org.xml.sax.SAXParseException; lineNumber: 8; columnNumber: 62; cvc-complex-type.2.4.c: The matching wildcard is strict, but no declaration can be found for element 'cloud:cassandra-session-factory'.
org.springframework.beans.factory.xml.XmlBeanDefinitionStoreException: Line 8 in XML document from class path resource [org/springframework/cloud/config/xml/cloud-cassandra-with-service-id.xml] is invalid; nested exception is org.xml.sax.SAXParseException; lineNumber: 8; columnNumber: 62; cvc-complex-type.2.4.c: The matching wildcard is strict, but no declaration can be found for element 'cloud:cassandra-session-factory'.
	at org.springframework.beans.factory.xml.XmlBeanDefinitionReader.doLoadBeanDefinitions(XmlBeanDefinitionReader.java:398)
	at org.springframework.beans.factory.xml.XmlBeanDefinitionReader.loadBeanDefinitions(XmlBeanDefinitionReader.java:335)
	at org.springframework.beans.factory.xml.XmlBeanDefinitionReader.loadBeanDefinitions(XmlBeanDefinitionReader.java:303)
	at org.springframework.beans.factory.support.AbstractBeanDefinitionReader.loadBeanDefinitions(AbstractBeanDefinitionReader.java:187)
	at org.springframework.beans.factory.support.AbstractBeanDefinitionReader.loadBeanDefinitions(AbstractBeanDefinitionReader.java:223)
	at org.springframework.beans.factory.support.AbstractBeanDefinitionReader.loadBeanDefinitions(AbstractBeanDefinitionReader.java:194)
(80 more lines...)
Collapse Failed CassandraClusterXmlConfigTest cloudConnectorWithoutServiceNameSpecified_TwoServiceExist_byId History
Default Job < 1 sec
java.lang.Exception: java.lang.Exception: Unexpected exception, expected<org.springframework.beans.factory.BeanCreationException> but was<org.springframework.beans.factory.xml.XmlBeanDefinitionStoreException>
java.lang.Exception: Unexpected exception, expected<org.springframework.beans.factory.BeanCreationException> but was<org.springframework.beans.factory.xml.XmlBeanDefinitionStoreException>
	at org.junit.internal.runners.statements.ExpectException.evaluate(ExpectException.java:28)
	at org.junit.runners.ParentRunner.runLeaf(ParentRunner.java:325)
	at org.junit.runners.BlockJUnit4ClassRunner.runChild(BlockJUnit4ClassRunner.java:78)
	at org.junit.runners.BlockJUnit4ClassRunner.runChild(BlockJUnit4ClassRunner.java:57)
	at org.junit.runners.ParentRunner$3.run(ParentRunner.java:290)
	at org.junit.runners.ParentRunner$1.schedule(ParentRunner.java:71)
(84 more lines...)
Collapse Failed CassandraClusterXmlConfigTest cassandraSessionWithConfiguration History
Default Job < 1 sec
org.springframework.beans.factory.xml.XmlBeanDefinitionStoreException: org.springframework.beans.factory.xml.XmlBeanDefinitionStoreException: Line 18 in XML document from class path resource [org/springframework/cloud/config/xml/cloud-cassandra-with-config.xml] is invalid; nested exception is org.xml.sax.SAXParseException; lineNumber: 18; columnNumber: 92; cvc-complex-type.2.4.c: The matching wildcard is strict, but no declaration can be found for element 'cloud:cassandra-session-factory'.
org.springframework.beans.factory.xml.XmlBeanDefinitionStoreException: Line 18 in XML document from class path resource [org/springframework/cloud/config/xml/cloud-cassandra-with-config.xml] is invalid; nested exception is org.xml.sax.SAXParseException; lineNumber: 18; columnNumber: 92; cvc-complex-type.2.4.c: The matching wildcard is strict, but no declaration can be found for element 'cloud:cassandra-session-factory'.
	at org.springframework.beans.factory.xml.XmlBeanDefinitionReader.doLoadBeanDefinitions(XmlBeanDefinitionReader.java:398)
	at org.springframework.beans.factory.xml.XmlBeanDefinitionReader.loadBeanDefinitions(XmlBeanDefinitionReader.java:335)
	at org.springframework.beans.factory.xml.XmlBeanDefinitionReader.loadBeanDefinitions(XmlBeanDefinitionReader.java:303)
	at org.springframework.beans.factory.support.AbstractBeanDefinitionReader.loadBeanDefinitions(AbstractBeanDefinitionReader.java:187)
	at org.springframework.beans.factory.support.AbstractBeanDefinitionReader.loadBeanDefinitions(AbstractBeanDefinitionReader.java:223)
	at org.springframework.beans.factory.support.AbstractBeanDefinitionReader.loadBeanDefinitions(AbstractBeanDefinitionReader.java:194)
(79 more lines...)
Collapse Failed CassandraClusterXmlConfigTest cloudConnectorWithoutServiceNameSpecified_NoServiceExists_byId History
Default Job < 1 sec
java.lang.Exception: java.lang.Exception: Unexpected exception, expected<org.springframework.beans.factory.BeanCreationException> but was<org.springframework.beans.factory.xml.XmlBeanDefinitionStoreException>
java.lang.Exception: Unexpected exception, expected<org.springframework.beans.factory.BeanCreationException> but was<org.springframework.beans.factory.xml.XmlBeanDefinitionStoreException>
	at org.junit.internal.runners.statements.ExpectException.evaluate(ExpectException.java:28)
	at org.junit.runners.ParentRunner.runLeaf(ParentRunner.java:325)
	at org.junit.runners.BlockJUnit4ClassRunner.runChild(BlockJUnit4ClassRunner.java:78)
	at org.junit.runners.BlockJUnit4ClassRunner.runChild(BlockJUnit4ClassRunner.java:57)
	at org.junit.runners.ParentRunner$3.run(ParentRunner.java:290)
	at org.junit.runners.ParentRunner$1.schedule(ParentRunner.java:71)
(84 more lines...)
Collapse Failed CassandraClusterXmlConfigTest cloudConnectorWithoutServiceNameSpecified_TwoServiceExist_byType History
Default Job < 1 sec
java.lang.Exception: java.lang.Exception: Unexpected exception, expected<org.springframework.beans.factory.BeanCreationException> but was<org.springframework.beans.factory.xml.XmlBeanDefinitionStoreException>
java.lang.Exception: Unexpected exception, expected<org.springframework.beans.factory.BeanCreationException> but was<org.springframework.beans.factory.xml.XmlBeanDefinitionStoreException>
	at org.junit.internal.runners.statements.ExpectException.evaluate(ExpectException.java:28)
	at org.junit.runners.ParentRunner.runLeaf(ParentRunner.java:325)
	at org.junit.runners.BlockJUnit4ClassRunner.runChild(BlockJUnit4ClassRunner.java:78)
	at org.junit.runners.BlockJUnit4ClassRunner.runChild(BlockJUnit4ClassRunner.java:57)
	at org.junit.runners.ParentRunner$3.run(ParentRunner.java:290)
	at org.junit.runners.ParentRunner$1.schedule(ParentRunner.java:71)
(84 more lines...)
Collapse Failed CassandraClusterXmlConfigTest cloudConnectorWithoutServiceNameSpecified_NoServiceExists_byType History
Default Job < 1 sec
java.lang.Exception: java.lang.Exception: Unexpected exception, expected<org.springframework.beans.factory.BeanCreationException> but was<org.springframework.beans.factory.xml.XmlBeanDefinitionStoreException>
java.lang.Exception: Unexpected exception, expected<org.springframework.beans.factory.BeanCreationException> but was<org.springframework.beans.factory.xml.XmlBeanDefinitionStoreException>
	at org.junit.internal.runners.statements.ExpectException.evaluate(ExpectException.java:28)
	at org.junit.runners.ParentRunner.runLeaf(ParentRunner.java:325)
	at org.junit.runners.BlockJUnit4ClassRunner.runChild(BlockJUnit4ClassRunner.java:78)
	at org.junit.runners.BlockJUnit4ClassRunner.runChild(BlockJUnit4ClassRunner.java:57)
	at org.junit.runners.ParentRunner$3.run(ParentRunner.java:290)
	at org.junit.runners.ParentRunner$1.schedule(ParentRunner.java:71)
(84 more lines...)
Collapse Failed CassandraClusterXmlConfigTest cloudConnectorWithServiceNameSpecified_NoServiceExists_byType History
Default Job < 1 sec
java.lang.Exception: java.lang.Exception: Unexpected exception, expected<org.springframework.beans.factory.BeanCreationException> but was<org.springframework.beans.factory.xml.XmlBeanDefinitionStoreException>
java.lang.Exception: Unexpected exception, expected<org.springframework.beans.factory.BeanCreationException> but was<org.springframework.beans.factory.xml.XmlBeanDefinitionStoreException>
	at org.junit.internal.runners.statements.ExpectException.evaluate(ExpectException.java:28)
	at org.junit.runners.ParentRunner.runLeaf(ParentRunner.java:325)
	at org.junit.runners.BlockJUnit4ClassRunner.runChild(BlockJUnit4ClassRunner.java:78)
	at org.junit.runners.BlockJUnit4ClassRunner.runChild(BlockJUnit4ClassRunner.java:57)
	at org.junit.runners.ParentRunner$3.run(ParentRunner.java:290)
	at org.junit.runners.ParentRunner$1.schedule(ParentRunner.java:71)
(84 more lines...)
Collapse Failed CassandraClusterXmlConfigTest cloudConnectorWithServiceNameSpecified_NoServiceExists_byId History
Default Job < 1 sec
java.lang.Exception: java.lang.Exception: Unexpected exception, expected<org.springframework.beans.factory.BeanCreationException> but was<org.springframework.beans.factory.xml.XmlBeanDefinitionStoreException>
java.lang.Exception: Unexpected exception, expected<org.springframework.beans.factory.BeanCreationException> but was<org.springframework.beans.factory.xml.XmlBeanDefinitionStoreException>
	at org.junit.internal.runners.statements.ExpectException.evaluate(ExpectException.java:28)
	at org.junit.runners.ParentRunner.runLeaf(ParentRunner.java:325)
	at org.junit.runners.BlockJUnit4ClassRunner.runChild(BlockJUnit4ClassRunner.java:78)
	at org.junit.runners.BlockJUnit4ClassRunner.runChild(BlockJUnit4ClassRunner.java:57)
	at org.junit.runners.ParentRunner$3.run(ParentRunner.java:290)
	at org.junit.runners.ParentRunner$1.schedule(ParentRunner.java:71)
(84 more lines...)
Collapse Failed CassandraClusterXmlConfigTest cloudConnectorWithoutServiceNameSpecified_UniqueServiceExists History
Default Job < 1 sec
org.springframework.beans.factory.xml.XmlBeanDefinitionStoreException: org.springframework.beans.factory.xml.XmlBeanDefinitionStoreException: Line 8 in XML document from class path resource [org/springframework/cloud/config/xml/cloud-cassandra-without-service-id.xml] is invalid; nested exception is org.xml.sax.SAXParseException; lineNumber: 8; columnNumber: 36; cvc-complex-type.2.4.c: The matching wildcard is strict, but no declaration can be found for element 'cloud:cassandra-session-factory'.
org.springframework.beans.factory.xml.XmlBeanDefinitionStoreException: Line 8 in XML document from class path resource [org/springframework/cloud/config/xml/cloud-cassandra-without-service-id.xml] is invalid; nested exception is org.xml.sax.SAXParseException; lineNumber: 8; columnNumber: 36; cvc-complex-type.2.4.c: The matching wildcard is strict, but no declaration can be found for element 'cloud:cassandra-session-factory'.
	at org.springframework.beans.factory.xml.XmlBeanDefinitionReader.doLoadBeanDefinitions(XmlBeanDefinitionReader.java:398)
	at org.springframework.beans.factory.xml.XmlBeanDefinitionReader.loadBeanDefinitions(XmlBeanDefinitionReader.java:335)
	at org.springframework.beans.factory.xml.XmlBeanDefinitionReader.loadBeanDefinitions(XmlBeanDefinitionReader.java:303)
	at org.springframework.beans.factory.support.AbstractBeanDefinitionReader.loadBeanDefinitions(AbstractBeanDefinitionReader.java:187)
	at org.springframework.beans.factory.support.AbstractBeanDefinitionReader.loadBeanDefinitions(AbstractBeanDefinitionReader.java:223)
	at org.springframework.beans.factory.support.AbstractBeanDefinitionReader.loadBeanDefinitions(AbstractBeanDefinitionReader.java:194)
(80 more lines...)
Collapse Failed CassandraClusterXmlConfigTest cloudConnectorWithServiceNameSpecified_TwoServiceExist History
Default Job < 1 sec
org.springframework.beans.factory.xml.XmlBeanDefinitionStoreException: org.springframework.beans.factory.xml.XmlBeanDefinitionStoreException: Line 8 in XML document from class path resource [org/springframework/cloud/config/xml/cloud-cassandra-with-service-id.xml] is invalid; nested exception is org.xml.sax.SAXParseException; lineNumber: 8; columnNumber: 62; cvc-complex-type.2.4.c: The matching wildcard is strict, but no declaration can be found for element 'cloud:cassandra-session-factory'.
org.springframework.beans.factory.xml.XmlBeanDefinitionStoreException: Line 8 in XML document from class path resource [org/springframework/cloud/config/xml/cloud-cassandra-with-service-id.xml] is invalid; nested exception is org.xml.sax.SAXParseException; lineNumber: 8; columnNumber: 62; cvc-complex-type.2.4.c: The matching wildcard is strict, but no declaration can be found for element 'cloud:cassandra-session-factory'.
	at org.springframework.beans.factory.xml.XmlBeanDefinitionReader.doLoadBeanDefinitions(XmlBeanDefinitionReader.java:398)
	at org.springframework.beans.factory.xml.XmlBeanDefinitionReader.loadBeanDefinitions(XmlBeanDefinitionReader.java:335)
	at org.springframework.beans.factory.xml.XmlBeanDefinitionReader.loadBeanDefinitions(XmlBeanDefinitionReader.java:303)
	at org.springframework.beans.factory.support.AbstractBeanDefinitionReader.loadBeanDefinitions(AbstractBeanDefinitionReader.java:187)
	at org.springframework.beans.factory.support.AbstractBeanDefinitionReader.loadBeanDefinitions(AbstractBeanDefinitionReader.java:223)
	at org.springframework.beans.factory.support.AbstractBeanDefinitionReader.loadBeanDefinitions(AbstractBeanDefinitionReader.java:194)
(80 more lines...)
Collapse Failed CloudAllServicesTest noServices History
Default Job < 1 sec
java.lang.Exception: java.lang.Exception: Unexpected exception, expected<org.springframework.beans.factory.BeanCreationException> but was<org.springframework.beans.factory.xml.XmlBeanDefinitionStoreException>
java.lang.Exception: Unexpected exception, expected<org.springframework.beans.factory.BeanCreationException> but was<org.springframework.beans.factory.xml.XmlBeanDefinitionStoreException>
	at org.junit.internal.runners.statements.ExpectException.evaluate(ExpectException.java:28)
	at org.junit.runners.ParentRunner.runLeaf(ParentRunner.java:325)
	at org.junit.runners.BlockJUnit4ClassRunner.runChild(BlockJUnit4ClassRunner.java:78)
	at org.junit.runners.BlockJUnit4ClassRunner.runChild(BlockJUnit4ClassRunner.java:57)
	at org.junit.runners.ParentRunner$3.run(ParentRunner.java:290)
	at org.junit.runners.ParentRunner$1.schedule(ParentRunner.java:71)
(83 more lines...)
Collapse Failed CloudAllServicesTest partialServicesProvisioned History
Default Job < 1 sec
java.lang.Exception: java.lang.Exception: Unexpected exception, expected<org.springframework.beans.factory.BeanCreationException> but was<org.springframework.beans.factory.xml.XmlBeanDefinitionStoreException>
java.lang.Exception: Unexpected exception, expected<org.springframework.beans.factory.BeanCreationException> but was<org.springframework.beans.factory.xml.XmlBeanDefinitionStoreException>
	at org.junit.internal.runners.statements.ExpectException.evaluate(ExpectException.java:28)
	at org.junit.runners.ParentRunner.runLeaf(ParentRunner.java:325)
	at org.junit.runners.BlockJUnit4ClassRunner.runChild(BlockJUnit4ClassRunner.java:78)
	at org.junit.runners.BlockJUnit4ClassRunner.runChild(BlockJUnit4ClassRunner.java:57)
	at org.junit.runners.ParentRunner$3.run(ParentRunner.java:290)
	at org.junit.runners.ParentRunner$1.schedule(ParentRunner.java:71)
(83 more lines...)
Collapse Failed CloudAllServicesTest allServicesProvisioned History
Default Job < 1 sec
org.springframework.beans.factory.xml.XmlBeanDefinitionStoreException: org.springframework.beans.factory.xml.XmlBeanDefinitionStoreException: Line 13 in XML document from class path resource [org/springframework/cloud/config/xml/cloud-all-services.xml] is invalid; nested exception is org.xml.sax.SAXParseException; lineNumber: 13; columnNumber: 61; cvc-complex-type.2.4.c: The matching wildcard is strict, but no declaration can be found for element 'cloud:cassandra-session-factory'.
org.springframework.beans.factory.xml.XmlBeanDefinitionStoreException: Line 13 in XML document from class path resource [org/springframework/cloud/config/xml/cloud-all-services.xml] is invalid; nested exception is org.xml.sax.SAXParseException; lineNumber: 13; columnNumber: 61; cvc-complex-type.2.4.c: The matching wildcard is strict, but no declaration can be found for element 'cloud:cassandra-session-factory'.
	at org.springframework.beans.factory.xml.XmlBeanDefinitionReader.doLoadBeanDefinitions(XmlBeanDefinitionReader.java:398)
	at org.springframework.beans.factory.xml.XmlBeanDefinitionReader.loadBeanDefinitions(XmlBeanDefinitionReader.java:335)
	at org.springframework.beans.factory.xml.XmlBeanDefinitionReader.loadBeanDefinitions(XmlBeanDefinitionReader.java:303)
	at org.springframework.beans.factory.support.AbstractBeanDefinitionReader.loadBeanDefinitions(AbstractBeanDefinitionReader.java:187)
	at org.springframework.beans.factory.support.AbstractBeanDefinitionReader.loadBeanDefinitions(AbstractBeanDefinitionReader.java:223)
	at org.springframework.beans.factory.support.AbstractBeanDefinitionReader.loadBeanDefinitions(AbstractBeanDefinitionReader.java:194)
(79 more lines...)
Collapse Failed DataSourceXmlConfigMysqlTest cloudDataSourceWithMinMaxPool History
Default Job < 1 sec
org.springframework.beans.factory.xml.XmlBeanDefinitionStoreException: org.springframework.beans.factory.xml.XmlBeanDefinitionStoreException: Line 13 in XML document from class path resource [org/springframework/cloud/config/xml/cloud-datasource-with-config.xml] is invalid; nested exception is org.xml.sax.SAXParseException; lineNumber: 13; columnNumber: 28; cvc-complex-type.2.4.d: Invalid content was found starting with element 'cloud:pool-data-sources'. No child element is expected at this point.
org.springframework.beans.factory.xml.XmlBeanDefinitionStoreException: Line 13 in XML document from class path resource [org/springframework/cloud/config/xml/cloud-datasource-with-config.xml] is invalid; nested exception is org.xml.sax.SAXParseException; lineNumber: 13; columnNumber: 28; cvc-complex-type.2.4.d: Invalid content was found starting with element 'cloud:pool-data-sources'. No child element is expected at this point.
	at org.springframework.beans.factory.xml.XmlBeanDefinitionReader.doLoadBeanDefinitions(XmlBeanDefinitionReader.java:398)
	at org.springframework.beans.factory.xml.XmlBeanDefinitionReader.loadBeanDefinitions(XmlBeanDefinitionReader.java:335)
	at org.springframework.beans.factory.xml.XmlBeanDefinitionReader.loadBeanDefinitions(XmlBeanDefinitionReader.java:303)
	at org.springframework.beans.factory.support.AbstractBeanDefinitionReader.loadBeanDefinitions(AbstractBeanDefinitionReader.java:187)
	at org.springframework.beans.factory.support.AbstractBeanDefinitionReader.loadBeanDefinitions(AbstractBeanDefinitionReader.java:223)
	at org.springframework.beans.factory.support.AbstractBeanDefinitionReader.loadBeanDefinitions(AbstractBeanDefinitionReader.java:194)
(81 more lines...)
Collapse Failed DataSourceXmlConfigMysqlTest cloudDataSourceWithHikariCpDataSource History
Default Job < 1 sec
org.springframework.beans.factory.xml.XmlBeanDefinitionStoreException: org.springframework.beans.factory.xml.XmlBeanDefinitionStoreException: Line 13 in XML document from class path resource [org/springframework/cloud/config/xml/cloud-datasource-with-config.xml] is invalid; nested exception is org.xml.sax.SAXParseException; lineNumber: 13; columnNumber: 28; cvc-complex-type.2.4.d: Invalid content was found starting with element 'cloud:pool-data-sources'. No child element is expected at this point.
org.springframework.beans.factory.xml.XmlBeanDefinitionStoreException: Line 13 in XML document from class path resource [org/springframework/cloud/config/xml/cloud-datasource-with-config.xml] is invalid; nested exception is org.xml.sax.SAXParseException; lineNumber: 13; columnNumber: 28; cvc-complex-type.2.4.d: Invalid content was found starting with element 'cloud:pool-data-sources'. No child element is expected at this point.
	at org.springframework.beans.factory.xml.XmlBeanDefinitionReader.doLoadBeanDefinitions(XmlBeanDefinitionReader.java:398)
	at org.springframework.beans.factory.xml.XmlBeanDefinitionReader.loadBeanDefinitions(XmlBeanDefinitionReader.java:335)
	at org.springframework.beans.factory.xml.XmlBeanDefinitionReader.loadBeanDefinitions(XmlBeanDefinitionReader.java:303)
	at org.springframework.beans.factory.support.AbstractBeanDefinitionReader.loadBeanDefinitions(AbstractBeanDefinitionReader.java:187)
	at org.springframework.beans.factory.support.AbstractBeanDefinitionReader.loadBeanDefinitions(AbstractBeanDefinitionReader.java:223)
	at org.springframework.beans.factory.support.AbstractBeanDefinitionReader.loadBeanDefinitions(AbstractBeanDefinitionReader.java:194)
(81 more lines...)
Collapse Failed DataSourceXmlConfigMysqlTest cloudDataSourceWithTomcatJdbcDataSource History
Default Job < 1 sec
org.springframework.beans.factory.xml.XmlBeanDefinitionStoreException: org.springframework.beans.factory.xml.XmlBeanDefinitionStoreException: Line 13 in XML document from class path resource [org/springframework/cloud/config/xml/cloud-datasource-with-config.xml] is invalid; nested exception is org.xml.sax.SAXParseException; lineNumber: 13; columnNumber: 28; cvc-complex-type.2.4.d: Invalid content was found starting with element 'cloud:pool-data-sources'. No child element is expected at this point.
org.springframework.beans.factory.xml.XmlBeanDefinitionStoreException: Line 13 in XML document from class path resource [org/springframework/cloud/config/xml/cloud-datasource-with-config.xml] is invalid; nested exception is org.xml.sax.SAXParseException; lineNumber: 13; columnNumber: 28; cvc-complex-type.2.4.d: Invalid content was found starting with element 'cloud:pool-data-sources'. No child element is expected at this point.
	at org.springframework.beans.factory.xml.XmlBeanDefinitionReader.doLoadBeanDefinitions(XmlBeanDefinitionReader.java:398)
	at org.springframework.beans.factory.xml.XmlBeanDefinitionReader.loadBeanDefinitions(XmlBeanDefinitionReader.java:335)
	at org.springframework.beans.factory.xml.XmlBeanDefinitionReader.loadBeanDefinitions(XmlBeanDefinitionReader.java:303)
	at org.springframework.beans.factory.support.AbstractBeanDefinitionReader.loadBeanDefinitions(AbstractBeanDefinitionReader.java:187)
	at org.springframework.beans.factory.support.AbstractBeanDefinitionReader.loadBeanDefinitions(AbstractBeanDefinitionReader.java:223)
	at org.springframework.beans.factory.support.AbstractBeanDefinitionReader.loadBeanDefinitions(AbstractBeanDefinitionReader.java:194)
(81 more lines...)
Collapse Failed DataSourceXmlConfigMysqlTest cloudDataSourceWithConnectionProperties History
Default Job < 1 sec
org.springframework.beans.factory.xml.XmlBeanDefinitionStoreException: org.springframework.beans.factory.xml.XmlBeanDefinitionStoreException: Line 13 in XML document from class path resource [org/springframework/cloud/config/xml/cloud-datasource-with-config.xml] is invalid; nested exception is org.xml.sax.SAXParseException; lineNumber: 13; columnNumber: 28; cvc-complex-type.2.4.d: Invalid content was found starting with element 'cloud:pool-data-sources'. No child element is expected at this point.
org.springframework.beans.factory.xml.XmlBeanDefinitionStoreException: Line 13 in XML document from class path resource [org/springframework/cloud/config/xml/cloud-datasource-with-config.xml] is invalid; nested exception is org.xml.sax.SAXParseException; lineNumber: 13; columnNumber: 28; cvc-complex-type.2.4.d: Invalid content was found starting with element 'cloud:pool-data-sources'. No child element is expected at this point.
	at org.springframework.beans.factory.xml.XmlBeanDefinitionReader.doLoadBeanDefinitions(XmlBeanDefinitionReader.java:398)
	at org.springframework.beans.factory.xml.XmlBeanDefinitionReader.loadBeanDefinitions(XmlBeanDefinitionReader.java:335)
	at org.springframework.beans.factory.xml.XmlBeanDefinitionReader.loadBeanDefinitions(XmlBeanDefinitionReader.java:303)
	at org.springframework.beans.factory.support.AbstractBeanDefinitionReader.loadBeanDefinitions(AbstractBeanDefinitionReader.java:187)
	at org.springframework.beans.factory.support.AbstractBeanDefinitionReader.loadBeanDefinitions(AbstractBeanDefinitionReader.java:223)
	at org.springframework.beans.factory.support.AbstractBeanDefinitionReader.loadBeanDefinitions(AbstractBeanDefinitionReader.java:194)
(81 more lines...)
Collapse Failed DataSourceXmlConfigMysqlTest cloudDataSourceWithMaxPool History
Default Job < 1 sec
org.springframework.beans.factory.xml.XmlBeanDefinitionStoreException: org.springframework.beans.factory.xml.XmlBeanDefinitionStoreException: Line 13 in XML document from class path resource [org/springframework/cloud/config/xml/cloud-datasource-with-config.xml] is invalid; nested exception is org.xml.sax.SAXParseException; lineNumber: 13; columnNumber: 28; cvc-complex-type.2.4.d: Invalid content was found starting with element 'cloud:pool-data-sources'. No child element is expected at this point.
org.springframework.beans.factory.xml.XmlBeanDefinitionStoreException: Line 13 in XML document from class path resource [org/springframework/cloud/config/xml/cloud-datasource-with-config.xml] is invalid; nested exception is org.xml.sax.SAXParseException; lineNumber: 13; columnNumber: 28; cvc-complex-type.2.4.d: Invalid content was found starting with element 'cloud:pool-data-sources'. No child element is expected at this point.
	at org.springframework.beans.factory.xml.XmlBeanDefinitionReader.doLoadBeanDefinitions(XmlBeanDefinitionReader.java:398)
	at org.springframework.beans.factory.xml.XmlBeanDefinitionReader.loadBeanDefinitions(XmlBeanDefinitionReader.java:335)
	at org.springframework.beans.factory.xml.XmlBeanDefinitionReader.loadBeanDefinitions(XmlBeanDefinitionReader.java:303)
	at org.springframework.beans.factory.support.AbstractBeanDefinitionReader.loadBeanDefinitions(AbstractBeanDefinitionReader.java:187)
	at org.springframework.beans.factory.support.AbstractBeanDefinitionReader.loadBeanDefinitions(AbstractBeanDefinitionReader.java:223)
	at org.springframework.beans.factory.support.AbstractBeanDefinitionReader.loadBeanDefinitions(AbstractBeanDefinitionReader.java:194)
(81 more lines...)
Collapse Failed DataSourceXmlConfigMysqlTest cloudDataSourceWithInvalidDataSource History
Default Job < 1 sec
org.springframework.beans.factory.xml.XmlBeanDefinitionStoreException: org.springframework.beans.factory.xml.XmlBeanDefinitionStoreException: Line 13 in XML document from class path resource [org/springframework/cloud/config/xml/cloud-datasource-with-config.xml] is invalid; nested exception is org.xml.sax.SAXParseException; lineNumber: 13; columnNumber: 28; cvc-complex-type.2.4.d: Invalid content was found starting with element 'cloud:pool-data-sources'. No child element is expected at this point.
org.springframework.beans.factory.xml.XmlBeanDefinitionStoreException: Line 13 in XML document from class path resource [org/springframework/cloud/config/xml/cloud-datasource-with-config.xml] is invalid; nested exception is org.xml.sax.SAXParseException; lineNumber: 13; columnNumber: 28; cvc-complex-type.2.4.d: Invalid content was found starting with element 'cloud:pool-data-sources'. No child element is expected at this point.
	at org.springframework.beans.factory.xml.XmlBeanDefinitionReader.doLoadBeanDefinitions(XmlBeanDefinitionReader.java:398)
	at org.springframework.beans.factory.xml.XmlBeanDefinitionReader.loadBeanDefinitions(XmlBeanDefinitionReader.java:335)
	at org.springframework.beans.factory.xml.XmlBeanDefinitionReader.loadBeanDefinitions(XmlBeanDefinitionReader.java:303)
	at org.springframework.beans.factory.support.AbstractBeanDefinitionReader.loadBeanDefinitions(AbstractBeanDefinitionReader.java:187)
	at org.springframework.beans.factory.support.AbstractBeanDefinitionReader.loadBeanDefinitions(AbstractBeanDefinitionReader.java:223)
	at org.springframework.beans.factory.support.AbstractBeanDefinitionReader.loadBeanDefinitions(AbstractBeanDefinitionReader.java:194)
(81 more lines...)
Collapse Failed DataSourceXmlConfigMysqlTest cloudDataSourceWithNoConfig History
Default Job < 1 sec
org.springframework.beans.factory.xml.XmlBeanDefinitionStoreException: org.springframework.beans.factory.xml.XmlBeanDefinitionStoreException: Line 13 in XML document from class path resource [org/springframework/cloud/config/xml/cloud-datasource-with-config.xml] is invalid; nested exception is org.xml.sax.SAXParseException; lineNumber: 13; columnNumber: 28; cvc-complex-type.2.4.d: Invalid content was found starting with element 'cloud:pool-data-sources'. No child element is expected at this point.
org.springframework.beans.factory.xml.XmlBeanDefinitionStoreException: Line 13 in XML document from class path resource [org/springframework/cloud/config/xml/cloud-datasource-with-config.xml] is invalid; nested exception is org.xml.sax.SAXParseException; lineNumber: 13; columnNumber: 28; cvc-complex-type.2.4.d: Invalid content was found starting with element 'cloud:pool-data-sources'. No child element is expected at this point.
	at org.springframework.beans.factory.xml.XmlBeanDefinitionReader.doLoadBeanDefinitions(XmlBeanDefinitionReader.java:398)
	at org.springframework.beans.factory.xml.XmlBeanDefinitionReader.loadBeanDefinitions(XmlBeanDefinitionReader.java:335)
	at org.springframework.beans.factory.xml.XmlBeanDefinitionReader.loadBeanDefinitions(XmlBeanDefinitionReader.java:303)
	at org.springframework.beans.factory.support.AbstractBeanDefinitionReader.loadBeanDefinitions(AbstractBeanDefinitionReader.java:187)
	at org.springframework.beans.factory.support.AbstractBeanDefinitionReader.loadBeanDefinitions(AbstractBeanDefinitionReader.java:223)
	at org.springframework.beans.factory.support.AbstractBeanDefinitionReader.loadBeanDefinitions(AbstractBeanDefinitionReader.java:194)
(81 more lines...)
Collapse Failed DataSourceXmlConfigPostgresqlTest cloudDataSourceWithMinMaxPool History
Default Job < 1 sec
org.springframework.beans.factory.xml.XmlBeanDefinitionStoreException: org.springframework.beans.factory.xml.XmlBeanDefinitionStoreException: Line 13 in XML document from class path resource [org/springframework/cloud/config/xml/cloud-datasource-with-config.xml] is invalid; nested exception is org.xml.sax.SAXParseException; lineNumber: 13; columnNumber: 28; cvc-complex-type.2.4.d: Invalid content was found starting with element 'cloud:pool-data-sources'. No child element is expected at this point.
org.springframework.beans.factory.xml.XmlBeanDefinitionStoreException: Line 13 in XML document from class path resource [org/springframework/cloud/config/xml/cloud-datasource-with-config.xml] is invalid; nested exception is org.xml.sax.SAXParseException; lineNumber: 13; columnNumber: 28; cvc-complex-type.2.4.d: Invalid content was found starting with element 'cloud:pool-data-sources'. No child element is expected at this point.
	at org.springframework.beans.factory.xml.XmlBeanDefinitionReader.doLoadBeanDefinitions(XmlBeanDefinitionReader.java:398)
	at org.springframework.beans.factory.xml.XmlBeanDefinitionReader.loadBeanDefinitions(XmlBeanDefinitionReader.java:335)
	at org.springframework.beans.factory.xml.XmlBeanDefinitionReader.loadBeanDefinitions(XmlBeanDefinitionReader.java:303)
	at org.springframework.beans.factory.support.AbstractBeanDefinitionReader.loadBeanDefinitions(AbstractBeanDefinitionReader.java:187)
	at org.springframework.beans.factory.support.AbstractBeanDefinitionReader.loadBeanDefinitions(AbstractBeanDefinitionReader.java:223)
	at org.springframework.beans.factory.support.AbstractBeanDefinitionReader.loadBeanDefinitions(AbstractBeanDefinitionReader.java:194)
(81 more lines...)
Collapse Failed DataSourceXmlConfigPostgresqlTest cloudDataSourceWithInvalidDataSource History
Default Job < 1 sec
org.springframework.beans.factory.xml.XmlBeanDefinitionStoreException: org.springframework.beans.factory.xml.XmlBeanDefinitionStoreException: Line 13 in XML document from class path resource [org/springframework/cloud/config/xml/cloud-datasource-with-config.xml] is invalid; nested exception is org.xml.sax.SAXParseException; lineNumber: 13; columnNumber: 28; cvc-complex-type.2.4.d: Invalid content was found starting with element 'cloud:pool-data-sources'. No child element is expected at this point.
org.springframework.beans.factory.xml.XmlBeanDefinitionStoreException: Line 13 in XML document from class path resource [org/springframework/cloud/config/xml/cloud-datasource-with-config.xml] is invalid; nested exception is org.xml.sax.SAXParseException; lineNumber: 13; columnNumber: 28; cvc-complex-type.2.4.d: Invalid content was found starting with element 'cloud:pool-data-sources'. No child element is expected at this point.
	at org.springframework.beans.factory.xml.XmlBeanDefinitionReader.doLoadBeanDefinitions(XmlBeanDefinitionReader.java:398)
	at org.springframework.beans.factory.xml.XmlBeanDefinitionReader.loadBeanDefinitions(XmlBeanDefinitionReader.java:335)
	at org.springframework.beans.factory.xml.XmlBeanDefinitionReader.loadBeanDefinitions(XmlBeanDefinitionReader.java:303)
	at org.springframework.beans.factory.support.AbstractBeanDefinitionReader.loadBeanDefinitions(AbstractBeanDefinitionReader.java:187)
	at org.springframework.beans.factory.support.AbstractBeanDefinitionReader.loadBeanDefinitions(AbstractBeanDefinitionReader.java:223)
	at org.springframework.beans.factory.support.AbstractBeanDefinitionReader.loadBeanDefinitions(AbstractBeanDefinitionReader.java:194)
(81 more lines...)
Collapse Failed DataSourceXmlConfigPostgresqlTest cloudDataSourceWithHikariCpDataSource History
Default Job < 1 sec
org.springframework.beans.factory.xml.XmlBeanDefinitionStoreException: org.springframework.beans.factory.xml.XmlBeanDefinitionStoreException: Line 13 in XML document from class path resource [org/springframework/cloud/config/xml/cloud-datasource-with-config.xml] is invalid; nested exception is org.xml.sax.SAXParseException; lineNumber: 13; columnNumber: 28; cvc-complex-type.2.4.d: Invalid content was found starting with element 'cloud:pool-data-sources'. No child element is expected at this point.
org.springframework.beans.factory.xml.XmlBeanDefinitionStoreException: Line 13 in XML document from class path resource [org/springframework/cloud/config/xml/cloud-datasource-with-config.xml] is invalid; nested exception is org.xml.sax.SAXParseException; lineNumber: 13; columnNumber: 28; cvc-complex-type.2.4.d: Invalid content was found starting with element 'cloud:pool-data-sources'. No child element is expected at this point.
	at org.springframework.beans.factory.xml.XmlBeanDefinitionReader.doLoadBeanDefinitions(XmlBeanDefinitionReader.java:398)
	at org.springframework.beans.factory.xml.XmlBeanDefinitionReader.loadBeanDefinitions(XmlBeanDefinitionReader.java:335)
	at org.springframework.beans.factory.xml.XmlBeanDefinitionReader.loadBeanDefinitions(XmlBeanDefinitionReader.java:303)
	at org.springframework.beans.factory.support.AbstractBeanDefinitionReader.loadBeanDefinitions(AbstractBeanDefinitionReader.java:187)
	at org.springframework.beans.factory.support.AbstractBeanDefinitionReader.loadBeanDefinitions(AbstractBeanDefinitionReader.java:223)
	at org.springframework.beans.factory.support.AbstractBeanDefinitionReader.loadBeanDefinitions(AbstractBeanDefinitionReader.java:194)
(81 more lines...)
Collapse Failed DataSourceXmlConfigPostgresqlTest cloudDataSourceWithNoConfig History
Default Job < 1 sec
org.springframework.beans.factory.xml.XmlBeanDefinitionStoreException: org.springframework.beans.factory.xml.XmlBeanDefinitionStoreException: Line 13 in XML document from class path resource [org/springframework/cloud/config/xml/cloud-datasource-with-config.xml] is invalid; nested exception is org.xml.sax.SAXParseException; lineNumber: 13; columnNumber: 28; cvc-complex-type.2.4.d: Invalid content was found starting with element 'cloud:pool-data-sources'. No child element is expected at this point.
org.springframework.beans.factory.xml.XmlBeanDefinitionStoreException: Line 13 in XML document from class path resource [org/springframework/cloud/config/xml/cloud-datasource-with-config.xml] is invalid; nested exception is org.xml.sax.SAXParseException; lineNumber: 13; columnNumber: 28; cvc-complex-type.2.4.d: Invalid content was found starting with element 'cloud:pool-data-sources'. No child element is expected at this point.
	at org.springframework.beans.factory.xml.XmlBeanDefinitionReader.doLoadBeanDefinitions(XmlBeanDefinitionReader.java:398)
	at org.springframework.beans.factory.xml.XmlBeanDefinitionReader.loadBeanDefinitions(XmlBeanDefinitionReader.java:335)
	at org.springframework.beans.factory.xml.XmlBeanDefinitionReader.loadBeanDefinitions(XmlBeanDefinitionReader.java:303)
	at org.springframework.beans.factory.support.AbstractBeanDefinitionReader.loadBeanDefinitions(AbstractBeanDefinitionReader.java:187)
	at org.springframework.beans.factory.support.AbstractBeanDefinitionReader.loadBeanDefinitions(AbstractBeanDefinitionReader.java:223)
	at org.springframework.beans.factory.support.AbstractBeanDefinitionReader.loadBeanDefinitions(AbstractBeanDefinitionReader.java:194)
(81 more lines...)
Collapse Failed DataSourceXmlConfigPostgresqlTest cloudDataSourceWithTomcatJdbcDataSource History
Default Job < 1 sec
org.springframework.beans.factory.xml.XmlBeanDefinitionStoreException: org.springframework.beans.factory.xml.XmlBeanDefinitionStoreException: Line 13 in XML document from class path resource [org/springframework/cloud/config/xml/cloud-datasource-with-config.xml] is invalid; nested exception is org.xml.sax.SAXParseException; lineNumber: 13; columnNumber: 28; cvc-complex-type.2.4.d: Invalid content was found starting with element 'cloud:pool-data-sources'. No child element is expected at this point.
org.springframework.beans.factory.xml.XmlBeanDefinitionStoreException: Line 13 in XML document from class path resource [org/springframework/cloud/config/xml/cloud-datasource-with-config.xml] is invalid; nested exception is org.xml.sax.SAXParseException; lineNumber: 13; columnNumber: 28; cvc-complex-type.2.4.d: Invalid content was found starting with element 'cloud:pool-data-sources'. No child element is expected at this point.
	at org.springframework.beans.factory.xml.XmlBeanDefinitionReader.doLoadBeanDefinitions(XmlBeanDefinitionReader.java:398)
	at org.springframework.beans.factory.xml.XmlBeanDefinitionReader.loadBeanDefinitions(XmlBeanDefinitionReader.java:335)
	at org.springframework.beans.factory.xml.XmlBeanDefinitionReader.loadBeanDefinitions(XmlBeanDefinitionReader.java:303)
	at org.springframework.beans.factory.support.AbstractBeanDefinitionReader.loadBeanDefinitions(AbstractBeanDefinitionReader.java:187)
	at org.springframework.beans.factory.support.AbstractBeanDefinitionReader.loadBeanDefinitions(AbstractBeanDefinitionReader.java:223)
	at org.springframework.beans.factory.support.AbstractBeanDefinitionReader.loadBeanDefinitions(AbstractBeanDefinitionReader.java:194)
(81 more lines...)
Collapse Failed DataSourceXmlConfigPostgresqlTest cloudDataSourceWithMaxPool History
Default Job < 1 sec
org.springframework.beans.factory.xml.XmlBeanDefinitionStoreException: org.springframework.beans.factory.xml.XmlBeanDefinitionStoreException: Line 13 in XML document from class path resource [org/springframework/cloud/config/xml/cloud-datasource-with-config.xml] is invalid; nested exception is org.xml.sax.SAXParseException; lineNumber: 13; columnNumber: 28; cvc-complex-type.2.4.d: Invalid content was found starting with element 'cloud:pool-data-sources'. No child element is expected at this point.
org.springframework.beans.factory.xml.XmlBeanDefinitionStoreException: Line 13 in XML document from class path resource [org/springframework/cloud/config/xml/cloud-datasource-with-config.xml] is invalid; nested exception is org.xml.sax.SAXParseException; lineNumber: 13; columnNumber: 28; cvc-complex-type.2.4.d: Invalid content was found starting with element 'cloud:pool-data-sources'. No child element is expected at this point.
	at org.springframework.beans.factory.xml.XmlBeanDefinitionReader.doLoadBeanDefinitions(XmlBeanDefinitionReader.java:398)
	at org.springframework.beans.factory.xml.XmlBeanDefinitionReader.loadBeanDefinitions(XmlBeanDefinitionReader.java:335)
	at org.springframework.beans.factory.xml.XmlBeanDefinitionReader.loadBeanDefinitions(XmlBeanDefinitionReader.java:303)
	at org.springframework.beans.factory.support.AbstractBeanDefinitionReader.loadBeanDefinitions(AbstractBeanDefinitionReader.java:187)
	at org.springframework.beans.factory.support.AbstractBeanDefinitionReader.loadBeanDefinitions(AbstractBeanDefinitionReader.java:223)
	at org.springframework.beans.factory.support.AbstractBeanDefinitionReader.loadBeanDefinitions(AbstractBeanDefinitionReader.java:194)
(81 more lines...)
Collapse Failed DataSourceXmlConfigPostgresqlTest cloudDataSourceWithConnectionProperties History
Default Job < 1 sec
org.springframework.beans.factory.xml.XmlBeanDefinitionStoreException: org.springframework.beans.factory.xml.XmlBeanDefinitionStoreException: Line 13 in XML document from class path resource [org/springframework/cloud/config/xml/cloud-datasource-with-config.xml] is invalid; nested exception is org.xml.sax.SAXParseException; lineNumber: 13; columnNumber: 28; cvc-complex-type.2.4.d: Invalid content was found starting with element 'cloud:pool-data-sources'. No child element is expected at this point.
org.springframework.beans.factory.xml.XmlBeanDefinitionStoreException: Line 13 in XML document from class path resource [org/springframework/cloud/config/xml/cloud-datasource-with-config.xml] is invalid; nested exception is org.xml.sax.SAXParseException; lineNumber: 13; columnNumber: 28; cvc-complex-type.2.4.d: Invalid content was found starting with element 'cloud:pool-data-sources'. No child element is expected at this point.
	at org.springframework.beans.factory.xml.XmlBeanDefinitionReader.doLoadBeanDefinitions(XmlBeanDefinitionReader.java:398)
	at org.springframework.beans.factory.xml.XmlBeanDefinitionReader.loadBeanDefinitions(XmlBeanDefinitionReader.java:335)
	at org.springframework.beans.factory.xml.XmlBeanDefinitionReader.loadBeanDefinitions(XmlBeanDefinitionReader.java:303)
	at org.springframework.beans.factory.support.AbstractBeanDefinitionReader.loadBeanDefinitions(AbstractBeanDefinitionReader.java:187)
	at org.springframework.beans.factory.support.AbstractBeanDefinitionReader.loadBeanDefinitions(AbstractBeanDefinitionReader.java:223)
	at org.springframework.beans.factory.support.AbstractBeanDefinitionReader.loadBeanDefinitions(AbstractBeanDefinitionReader.java:194)
(81 more lines...)
Collapse Failed RabbitConnectionFactoryXmlConfigTest cloudRabbitConnectionFactoryWithConfigurationAndProperties History
Default Job < 1 sec
org.springframework.beans.factory.xml.XmlBeanDefinitionStoreException: org.springframework.beans.factory.xml.XmlBeanDefinitionStoreException: Line 14 in XML document from class path resource [org/springframework/cloud/config/xml/cloud-rabbit-with-config.xml] is invalid; nested exception is org.xml.sax.SAXParseException; lineNumber: 14; columnNumber: 32; cvc-complex-type.2.4.d: Invalid content was found starting with element 'cloud:connection-properties'. No child element is expected at this point.
org.springframework.beans.factory.xml.XmlBeanDefinitionStoreException: Line 14 in XML document from class path resource [org/springframework/cloud/config/xml/cloud-rabbit-with-config.xml] is invalid; nested exception is org.xml.sax.SAXParseException; lineNumber: 14; columnNumber: 32; cvc-complex-type.2.4.d: Invalid content was found starting with element 'cloud:connection-properties'. No child element is expected at this point.
	at org.springframework.beans.factory.xml.XmlBeanDefinitionReader.doLoadBeanDefinitions(XmlBeanDefinitionReader.java:398)
	at org.springframework.beans.factory.xml.XmlBeanDefinitionReader.loadBeanDefinitions(XmlBeanDefinitionReader.java:335)
	at org.springframework.beans.factory.xml.XmlBeanDefinitionReader.loadBeanDefinitions(XmlBeanDefinitionReader.java:303)
	at org.springframework.beans.factory.support.AbstractBeanDefinitionReader.loadBeanDefinitions(AbstractBeanDefinitionReader.java:187)
	at org.springframework.beans.factory.support.AbstractBeanDefinitionReader.loadBeanDefinitions(AbstractBeanDefinitionReader.java:223)
	at org.springframework.beans.factory.support.AbstractBeanDefinitionReader.loadBeanDefinitions(AbstractBeanDefinitionReader.java:194)
(79 more lines...)
Collapse Failed RabbitConnectionFactoryXmlConfigTest cloudRabbitConnectionFactoryWithProperties History
Default Job < 1 sec
org.springframework.beans.factory.xml.XmlBeanDefinitionStoreException: org.springframework.beans.factory.xml.XmlBeanDefinitionStoreException: Line 14 in XML document from class path resource [org/springframework/cloud/config/xml/cloud-rabbit-with-config.xml] is invalid; nested exception is org.xml.sax.SAXParseException; lineNumber: 14; columnNumber: 32; cvc-complex-type.2.4.d: Invalid content was found starting with element 'cloud:connection-properties'. No child element is expected at this point.
org.springframework.beans.factory.xml.XmlBeanDefinitionStoreException: Line 14 in XML document from class path resource [org/springframework/cloud/config/xml/cloud-rabbit-with-config.xml] is invalid; nested exception is org.xml.sax.SAXParseException; lineNumber: 14; columnNumber: 32; cvc-complex-type.2.4.d: Invalid content was found starting with element 'cloud:connection-properties'. No child element is expected at this point.
	at org.springframework.beans.factory.xml.XmlBeanDefinitionReader.doLoadBeanDefinitions(XmlBeanDefinitionReader.java:398)
	at org.springframework.beans.factory.xml.XmlBeanDefinitionReader.loadBeanDefinitions(XmlBeanDefinitionReader.java:335)
	at org.springframework.beans.factory.xml.XmlBeanDefinitionReader.loadBeanDefinitions(XmlBeanDefinitionReader.java:303)
	at org.springframework.beans.factory.support.AbstractBeanDefinitionReader.loadBeanDefinitions(AbstractBeanDefinitionReader.java:187)
	at org.springframework.beans.factory.support.AbstractBeanDefinitionReader.loadBeanDefinitions(AbstractBeanDefinitionReader.java:223)
	at org.springframework.beans.factory.support.AbstractBeanDefinitionReader.loadBeanDefinitions(AbstractBeanDefinitionReader.java:194)
(79 more lines...)
Collapse Failed RabbitConnectionFactoryXmlConfigTest cloudRabbitConnectionFactoryWithConfiguration History
Default Job < 1 sec
org.springframework.beans.factory.xml.XmlBeanDefinitionStoreException: org.springframework.beans.factory.xml.XmlBeanDefinitionStoreException: Line 14 in XML document from class path resource [org/springframework/cloud/config/xml/cloud-rabbit-with-config.xml] is invalid; nested exception is org.xml.sax.SAXParseException; lineNumber: 14; columnNumber: 32; cvc-complex-type.2.4.d: Invalid content was found starting with element 'cloud:connection-properties'. No child element is expected at this point.
org.springframework.beans.factory.xml.XmlBeanDefinitionStoreException: Line 14 in XML document from class path resource [org/springframework/cloud/config/xml/cloud-rabbit-with-config.xml] is invalid; nested exception is org.xml.sax.SAXParseException; lineNumber: 14; columnNumber: 32; cvc-complex-type.2.4.d: Invalid content was found starting with element 'cloud:connection-properties'. No child element is expected at this point.
	at org.springframework.beans.factory.xml.XmlBeanDefinitionReader.doLoadBeanDefinitions(XmlBeanDefinitionReader.java:398)
	at org.springframework.beans.factory.xml.XmlBeanDefinitionReader.loadBeanDefinitions(XmlBeanDefinitionReader.java:335)
	at org.springframework.beans.factory.xml.XmlBeanDefinitionReader.loadBeanDefinitions(XmlBeanDefinitionReader.java:303)
	at org.springframework.beans.factory.support.AbstractBeanDefinitionReader.loadBeanDefinitions(AbstractBeanDefinitionReader.java:187)
	at org.springframework.beans.factory.support.AbstractBeanDefinitionReader.loadBeanDefinitions(AbstractBeanDefinitionReader.java:223)
	at org.springframework.beans.factory.support.AbstractBeanDefinitionReader.loadBeanDefinitions(AbstractBeanDefinitionReader.java:194)
(79 more lines...)

Jira issues

IssueDescriptionStatus
Unknown Issue TypeLICENSE-2Could not obtain issue details from Jira