Build: #80 failed

Job: Default Job failed

Stages & jobs

  1. Default Stage

Job result summary

Completed
Duration
40 seconds
Agent
bamboo-21.af.pivotal.io
Revision
94dff58ae283d7b368b612930a28b2998f4c4c0a 94dff58ae283d7b368b612930a28b2998f4c4c0a
Total tests
435
Fixed in
#81 (Code changes detected)
No failed test found. A possible compilation error occurred.

Tests

  • 435 tests in total
  • 5 seconds taken in total.

Error summary

The build generated some errors. See the full build log for more details.

Note: Some input files use or override a deprecated API.
Note: Recompile with -Xlint:deprecation for details.

FAILURE: Build failed with an exception.

* What went wrong:
Execution failed for task ':artifactoryDeploy'.
> java.io.IOException: Failed to deploy file. Status code: 403 Response message: Artifactory returned the following errors:
  'buildmaster' is blocked due to recurrent login failures, please try again in 2 seconds Status code: 403

* Try:
Run with --stacktrace option to get the stack trace. Run with --info or --debug option to get more log output. Run with --scan to get full insights.

* Get more help at https://help.gradle.org

BUILD FAILED in 39s