Build: #82 failed

Job: Default Job failed

Stages & jobs

  1. Default Stage

Build log

The build generated 610 lines of output. Download or view full build log

17-Oct-2019 14:01:03 Build Spring Cloud Services - Spring Cloud Connectors Core 2.x - Default Job #82 (CLOUD-CONNECTORS2-JOB1-82) started building on agent bamboo-22.af.pivotal.io
17-Oct-2019 14:01:03 Remote agent on host bamboo-22.af.pivotal.io
17-Oct-2019 14:01:03 Build working directory is /opt/bamboo-home/xml-data/build-dir/CLOUD-CONNECTORS2-JOB1
17-Oct-2019 14:01:03 Executing build Spring Cloud Services - Spring Cloud Connectors Core 2.x - Default Job #82 (CLOUD-CONNECTORS2-JOB1-82)
17-Oct-2019 14:01:03 Starting task 'Checkout Default Repository' of type 'com.atlassian.bamboo.plugins.vcs:task.vcs.checkout'
17-Oct-2019 14:01:03 Checking out into /opt/bamboo-home/xml-data/build-dir/CLOUD-CONNECTORS2-JOB1
17-Oct-2019 14:01:03 Updating source code to revision: a3c61d44567731dd9ae5df91074fad9475221a5c
17-Oct-2019 14:01:03 Creating local git repository in '/opt/bamboo-home/xml-data/build-dir/CLOUD-CONNECTORS2-JOB1/.git'.
17-Oct-2019 14:01:03 Initialized empty Git repository in /opt/bamboo-home/xml-data/build-dir/CLOUD-CONNECTORS2-JOB1/.git/
17-Oct-2019 14:01:03 Fetching 'refs/heads/*' from 'https://github.com/spring-cloud/spring-cloud-connectors'.
17-Oct-2019 14:01:07 From https://github.com/spring-cloud/spring-cloud-connectors
17-Oct-2019 14:01:07 * [new branch]      1.x        -> 1.x
17-Oct-2019 14:01:07 * [new branch]      docs-site  -> docs-site
17-Oct-2019 14:01:07 * [new branch]      gh-pages   -> gh-pages
17-Oct-2019 14:01:07 * [new branch]      master     -> master
17-Oct-2019 14:01:07 * [new tag]         0.9.2          -> 0.9.2
17-Oct-2019 14:01:07 * [new tag]         v1.1.1.RELEASE -> v1.1.1.RELEASE
17-Oct-2019 14:01:07 * [new tag]         v1.2.0.RELEASE -> v1.2.0.RELEASE
17-Oct-2019 14:01:07 * [new tag]         v1.2.9.RELEASE -> v1.2.9.RELEASE
17-Oct-2019 14:01:07 * [new tag]         v2.0.6.RELEASE -> v2.0.6.RELEASE
17-Oct-2019 14:01:07 Checking out revision a3c61d44567731dd9ae5df91074fad9475221a5c.
17-Oct-2019 14:01:07 Already on 'master'
17-Oct-2019 14:01:07 Updated source code to revision: a3c61d44567731dd9ae5df91074fad9475221a5c
17-Oct-2019 14:01:07 Finished task 'Checkout Default Repository' with result: Success
17-Oct-2019 14:01:07 Running pre-build action: Artifactory Release Staging
17-Oct-2019 14:01:07 Running pre-build action: VCS Version Collector
17-Oct-2019 14:01:07 Starting task 'Build' of type 'org.jfrog.bamboo.bamboo-artifactory-plugin:artifactoryGradleTask'
17-Oct-2019 14:01:07 Bamboo Artifactory Plugin version: 2.6.3
17-Oct-2019 14:01:07
Beginning to execute external process for build 'Spring Cloud Services - Spring Cloud Connectors Core 2.x - Default Job #82 (CLOUD-CONNECTORS2-JOB1-82)'
... running command line:
./gradlew clean matrixTests test build dist -I /tmp/artifactory.init.script8018729136781532307gradle -DbuildInfoConfig.propertiesFile=/tmp/buildinfo1958633005934409342properties artifactoryPublish -Dartifactory.resolve.password=******** -Dartifactory.publish.password=********
... in: /opt/bamboo-home/xml-data/build-dir/CLOUD-CONNECTORS2-JOB1
... using extra environment variables:
bamboo_planRepository_1_branch=master
bamboo_********_username_password=********
bamboo_signing_store_password=********
bamboo_capability_system_builder_ant_Ant_1_9=/opt/ant-1.9
bamboo_capability_system_builder_ant_Ant_1_8=/opt/ant-1.8
bamboo_planRepository_1_branchDisplayName=master
bamboo_artifactory_override_resolve_repo=libs-milestone
bamboo_capability_system_builder_node_Node_js_10_16=/opt/node-10.16/bin/node
bamboo_repository_revision_number=a3c61d44567731dd9ae5df91074fad9475221a5c
bamboo_repository_244875283_git_branch=master
bamboo_RIAK_BIN=/usr/sbin/riak
WRAPPER_BITS=32
bamboo_buildKey=CLOUD-CONNECTORS2-JOB1
bamboo_repository_244875283_git_username=spring-buildmaster
bamboo_bintray_password=********
bamboo_sonar_token_password=********
PWD=/opt/bamboo-home/bin
bamboo_shortJobName=Default Job
bamboo_artifactory_override_resolver_password=********
bamboo_sonatype_token=RSJChaox
bamboo_capability_system_builder_gradle___gradlew=./gradlew
bamboo_buildResultsUrl=https://build.spring.io/browse/CLOUD-CONNECTORS2-JOB1-82
bamboo_capability_system_builder_mvn3_Maven_3_3=/opt/maven-3.3
bamboo_capability_system_builder_mvn3_Maven_3_2=/opt/maven-3.2
bamboo_capability_system_builder_mvn3_Maven_3_1=/opt/maven-3.1
bamboo_planRepository_repositoryUrl=https://github.com/spring-cloud/spring-cloud-connectors
bamboo_capability_system_builder_mvn3_Maven_3_6=/opt/maven-3.6
bamboo_agentId=286195714
bamboo_capability_system_builder_mvn3_Maven_3_5=/opt/maven-3.5
bamboo_capability_system_builder_mvn3_Maven_3_0=/opt/maven-3.0
bamboo_planRepository_revision=a3c61d44567731dd9ae5df91074fad9475221a5c
bamboo_planRepository_previousRevision=0ebd0c419081fb14f4e416ddc2239a3f065942b7
bamboo_capability_remote_build=true
bamboo_repository_branch_name=master
bamboo_sonatype_token_password=********
bamboo_repository_244875283_branch_name=master
bamboo_sonatype_user=springsource
SHLVL=1
bamboo_org_jfrog_bamboo_buildInfo_serverUrl=https://repo.spring.io
bamboo_scdf_acceptance_tests_password=********
WRAPPER_OS=linux
JAVA_HOME=/opt/jdk-8/
bamboo_repository_244875283_git_repositoryUrl=https://github.com/spring-cloud/spring-cloud-connectors
TERM=linux
XDG_SESSION_ID=c1
bamboo_planRepository_branch=master
bamboo_org_jfrog_bamboo_release_activated=false
bamboo_repository_244875283_previous_revision_number=0ebd0c419081fb14f4e416ddc2239a3f065942b7
bamboo_capability_system_jdk_JDK_13=/opt/jdk-13
bamboo_planRepository_1_type=gitv2
bamboo_planRepository_branchName=master
bamboo_capability_system_jdk_JDK_12=/opt/jdk-12
WRAPPER_FILE_SEPARATOR=/
_=/opt/bamboo-home/bin/bamboo-agent.sh
bamboo_capability_system_builder_gradlew_gradlew=./
bamboo_capability_system_builder_ant_Ant_1_10=/opt/ant-1.10
WRAPPER_PATH_SEPARATOR=:
bamboo_sonar_password=********
bamboo_hg_cache_directory=/opt/bamboo-home/xml-data/build-dir/_hg-repositories-cache
bamboo_planRepository_1_username=spring-buildmaster
bamboo_planRepository_type=gitv2
bamboo_git_cache_directory=/opt/bamboo-home/xml-data/build-dir/_git-repositories-cache
bamboo_artifactory_username=buildmaster
bamboo_tmp_directory=/opt/bamboo-home/temp
bamboo_planKey=CLOUD-CONNECTORS2
bamboo_planRepository_username=spring-buildmaster
bamboo_JDK8_HOME=/opt/jdk-8
bamboo_planRepository_1_branchName=master
bamboo_sonar_version=5.6.3
bamboo_sonar_jdbc_password=********
bamboo_bintray_api_key_password=********
GRADLE_OPTS=-Xms128m -Xmx1024m
XDG_DATA_DIRS=/usr/local/share:/usr/share:/var/lib/snapd/desktop
bamboo_capability_system_jdk_JDK_1_11=/opt/jdk-11
bamboo_resultsUrl=https://build.spring.io/browse/CLOUD-CONNECTORS2-JOB1-82
bamboo_capability_system_jdk_JDK_1_10=/opt/jdk-10
bamboo_build_working_directory=/opt/bamboo-home/xml-data/build-dir/CLOUD-CONNECTORS2-JOB1
bamboo_planRepository_1_name=Git
bamboo_capability_system_os=ubuntu1804
bamboo_nexusPush_stagingProfile=buildmaster
bamboo_shortPlanName=Spring Cloud Connectors Core 2.x
MAIL=/var/mail/bamboo
bamboo_planRepository_name=Git
LOGNAME=bamboo
bamboo_buildNumber=82
SHELL=/bin/bash
bamboo_planName=Spring Cloud Services - Spring Cloud Connectors Core 2.x
bamboo_JDK7_HOME=/opt/jdk-7
bamboo_shortPlanKey=CONNECTORS2
OLDPWD=/opt/users/bamboo
bamboo_shortJobKey=JOB1
bamboo_artifactory_password=********
bamboo_buildTimeStamp=2019-10-17T14:01:03.406Z
bamboo_repository_previous_revision_number=0ebd0c419081fb14f4e416ddc2239a3f065942b7
bamboo_sonar_username=buildmaster
bamboo_********_password=********
bamboo_repository_git_branch=master
bamboo_buildResultKey=CLOUD-CONNECTORS2-JOB1-82
bamboo_nexusPush_close=true
bamboo_artifactory_override_resolver_username=buildmaster
bamboo_buildPlanName=Spring Cloud Services - Spring Cloud Connectors Core 2.x - Default Job
bamboo_planRepository_1_revision=a3c61d44567731dd9ae5df91074fad9475221a5c
bamboo_repository_name=Git
bamboo_signing_key_password=********
bamboo_repository_244875283_revision_number=a3c61d44567731dd9ae5df91074fad9475221a5c
bamboo_capability_system_builder_groovy_Groovy_2_5=/opt/groovy-2.5
LANG=en_US.UTF-8
bamboo_buildFailed=false
bamboo_capability_system_docker_executable=/usr/bin/docker
DISPLAY=localhost:1.0
bamboo_capability_system_jdk_OpenJDK_7=/opt/jdk-7
bamboo_capability_system_builder_groovy_Groovy_2_4=/opt/groovy-2.4
bamboo_artifactory_override_deployer_username=buildmaster
bamboo_artifactory_password_mask_b=********
bamboo_capability_system_builder_command_Bash=/bin/bash
bamboo_repository_244875283_name=Git
bamboo_artifactory_password_mask_a=********
bamboo_agentWorkingDirectory=/opt/bamboo-home/xml-data/build-dir
bamboo_capability_system_git_executable=/usr/bin/git
bamboo_repository_git_username=spring-buildmaster
bamboo_planRepository_1_previousRevision=0ebd0c419081fb14f4e416ddc2239a3f065942b7
bamboo_capability_os_family=unix
bamboo_planRepository_branchDisplayName=master
bamboo_capability_system_builder_maven_Artifactory_Maven_3_6=/opt/maven-3.6
bamboo_capability_system_builder_maven_Artifactory_Maven_3_5=/opt/maven-3.5
GIT_SSL_NO_VERIFY=true
bamboo_capability_system_builder_maven_Artifactory_Maven_3_3=/opt/maven-3.3
bamboo_capability_system_builder_maven_Artifactory_Maven_3_2=/opt/maven-3.2
bamboo_s3_properties=/home/bamboo/tools/s3.properties
bamboo_capability_system_builder_maven_Artifactory_Maven_3_1=/opt/maven-3.1
bamboo_artifactory_override_deploy_repo=libs-snapshot-local
bamboo_capability_system_builder_maven_Artifactory_Maven_3_0=/opt/maven-3.0
bamboo_plan_storageTag=plan-244678693
bamboo_bintray_username_password=********
USER=bamboo
bamboo_repository_git_repositoryUrl=https://github.com/spring-cloud/spring-cloud-connectors
bamboo_working_directory=/opt/bamboo-home/xml-data/build-dir/CLOUD-CONNECTORS2-JOB1
bamboo_org_jfrog_bamboo_buildInfo_activated=true
bamboo_planRepository_1_repositoryUrl=https://github.com/spring-cloud/spring-cloud-connectors
bamboo_capability_system_jdk_JDK_1_8=/opt/jdk-8
bamboo_artifactory_override_deployer_password=********
bamboo_capability_system_jdk_JDK_1_9=/opt/jdk-9
WRAPPER_ARCH=x86
bamboo_capability_system_jdk_JDK_1_6=/opt/jdk-6
bamboo_sonatype_password=********
bamboo_capability_system_jdk_JDK_1_7=/opt/jdk-7
bamboo_sonar_ip=10.194.6.9
XDG_RUNTIME_DIR=/run/user/1002
HOME=/home/bamboo
PATH=/bin:/home/bamboo/bin:/usr/local/sbin:/usr/local/bin:/usr/sbin:/usr/bin:/sbin:/bin:/usr/games:/usr/local/games:/snap/bin:/home/bamboo/bin:/usr/local/bin:/bin:/home/bamboo/bin:/usr/local/sbin:/usr/local/bin:/usr/sbin:/usr/bin:/sbin:/bin:/usr/games:/usr/local/games:/snap/bin:/home/bamboo/bin:/usr/local/bin
17-Oct-2019 14:01:08 Downloading https://services.gradle.org/distributions/gradle-4.10-bin.zip
17-Oct-2019 14:01:10 ..........................................................................
17-Oct-2019 14:01:11 Starting a Gradle Daemon (subsequent builds will be faster)
17-Oct-2019 14:01:19 Cannot publish pom for project ':' since it does not contain the Maven plugin install task and task ':artifactoryPublish' does not specify a custom pom path.
17-Oct-2019 14:01:19 > Task :clean UP-TO-DATE
17-Oct-2019 14:01:19 > Task :spring-cloud-cloudfoundry-connector:clean UP-TO-DATE
17-Oct-2019 14:01:19 > Task :spring-cloud-connectors-core:clean UP-TO-DATE
17-Oct-2019 14:01:19 > Task :spring-cloud-heroku-connector:clean UP-TO-DATE
17-Oct-2019 14:01:19 > Task :spring-cloud-localconfig-connector:clean UP-TO-DATE
17-Oct-2019 14:01:19 > Task :spring-cloud-spring-service-connector:clean UP-TO-DATE
17-Oct-2019 14:01:20 > Task :spring-cloud:spring-cloud-connectors-core:compileJava
17-Oct-2019 14:01:20 > Task :spring-cloud:spring-cloud-connectors-core:processResources NO-SOURCE
17-Oct-2019 14:01:20 > Task :spring-cloud:spring-cloud-connectors-core:classes
17-Oct-2019 14:01:20 > Task :spring-cloud:spring-cloud-connectors-core:jar
17-Oct-2019 14:01:21 > Task :spring-cloud:spring-cloud-cloudfoundry-connector:compileJava
17-Oct-2019 14:01:21 > Task :spring-cloud:spring-cloud-cloudfoundry-connector:processResources
17-Oct-2019 14:01:21 > Task :spring-cloud:spring-cloud-cloudfoundry-connector:classes
17-Oct-2019 14:01:22 > Task :spring-cloud:spring-cloud-cloudfoundry-connector:compileTestJava
17-Oct-2019 14:01:22 > Task :spring-cloud:spring-cloud-cloudfoundry-connector:processTestResources
17-Oct-2019 14:01:22 > Task :spring-cloud:spring-cloud-cloudfoundry-connector:testClasses
17-Oct-2019 14:01:23 > Task :spring-cloud:spring-cloud-cloudfoundry-connector:test
17-Oct-2019 14:01:24 > Task :spring-cloud:spring-cloud-connectors-core:compileTestJava
17-Oct-2019 14:01:24 > Task :spring-cloud:spring-cloud-connectors-core:processTestResources
17-Oct-2019 14:01:24 > Task :spring-cloud:spring-cloud-connectors-core:testClasses
17-Oct-2019 14:01:24 > Task :spring-cloud:spring-cloud-connectors-core:test
17-Oct-2019 14:01:24 > Task :spring-cloud:spring-cloud-heroku-connector:compileJava
17-Oct-2019 14:01:24 > Task :spring-cloud:spring-cloud-heroku-connector:processResources
17-Oct-2019 14:01:24 > Task :spring-cloud:spring-cloud-heroku-connector:classes
17-Oct-2019 14:01:24 > Task :spring-cloud:spring-cloud-heroku-connector:compileTestJava
17-Oct-2019 14:01:24 > Task :spring-cloud:spring-cloud-heroku-connector:processTestResources NO-SOURCE
17-Oct-2019 14:01:24 > Task :spring-cloud:spring-cloud-heroku-connector:testClasses
17-Oct-2019 14:01:25 > Task :spring-cloud:spring-cloud-heroku-connector:test
17-Oct-2019 14:01:25 > Task :spring-cloud:spring-cloud-localconfig-connector:compileJava
17-Oct-2019 14:01:25 > Task :spring-cloud:spring-cloud-localconfig-connector:processResources
17-Oct-2019 14:01:25 > Task :spring-cloud:spring-cloud-localconfig-connector:classes
17-Oct-2019 14:01:25 > Task :spring-cloud:spring-cloud-localconfig-connector:compileTestJava
17-Oct-2019 14:01:25 > Task :spring-cloud:spring-cloud-localconfig-connector:processTestResources
17-Oct-2019 14:01:25 > Task :spring-cloud:spring-cloud-localconfig-connector:testClasses
17-Oct-2019 14:01:26 > Task :spring-cloud:spring-cloud-localconfig-connector:test
17-Oct-2019 14:01:26 > Task :spring-cloud:spring-cloud-connectors-core:testJar
17-Oct-2019 14:01:29
17-Oct-2019 14:01:29 > Task :spring-cloud:spring-cloud-spring-service-connector:compileJava
17-Oct-2019 14:01:29 Note: Some input files use or override a deprecated API.
17-Oct-2019 14:01:29 Note: Recompile with -Xlint:deprecation for details.
17-Oct-2019 14:01:31
17-Oct-2019 14:01:31 > Task :spring-cloud:spring-cloud-spring-service-connector:processResources
17-Oct-2019 14:01:31 > Task :spring-cloud:spring-cloud-spring-service-connector:classes
17-Oct-2019 14:01:32 > Task :spring-cloud:spring-cloud-spring-service-connector:compileTestJava
17-Oct-2019 14:01:32 > Task :spring-cloud:spring-cloud-spring-service-connector:processTestResources
17-Oct-2019 14:01:32 > Task :spring-cloud:spring-cloud-spring-service-connector:testClasses
17-Oct-2019 14:01:38 > Task :spring-cloud:spring-cloud-spring-service-connector:test
17-Oct-2019 14:01:38 > Task :amqp200
17-Oct-2019 14:01:38 > Task :spring-cloud:spring-cloud-connectors-core:compileJava UP-TO-DATE
17-Oct-2019 14:01:38 > Task :spring-cloud:spring-cloud-connectors-core:processResources NO-SOURCE
17-Oct-2019 14:01:38 > Task :spring-cloud:spring-cloud-connectors-core:classes UP-TO-DATE
17-Oct-2019 14:01:38 > Task :spring-cloud:spring-cloud-connectors-core:jar UP-TO-DATE
17-Oct-2019 14:01:38 > Task :spring-cloud:spring-cloud-cloudfoundry-connector:compileJava UP-TO-DATE
17-Oct-2019 14:01:38 > Task :spring-cloud:spring-cloud-cloudfoundry-connector:processResources UP-TO-DATE
17-Oct-2019 14:01:38 > Task :spring-cloud:spring-cloud-cloudfoundry-connector:classes UP-TO-DATE
17-Oct-2019 14:01:38 > Task :spring-cloud:spring-cloud-cloudfoundry-connector:compileTestJava UP-TO-DATE
17-Oct-2019 14:01:38 > Task :spring-cloud:spring-cloud-cloudfoundry-connector:processTestResources UP-TO-DATE
17-Oct-2019 14:01:38 > Task :spring-cloud:spring-cloud-cloudfoundry-connector:testClasses UP-TO-DATE
17-Oct-2019 14:01:38 > Task :spring-cloud:spring-cloud-cloudfoundry-connector:test UP-TO-DATE
17-Oct-2019 14:01:38 > Task :spring-cloud:spring-cloud-connectors-core:compileTestJava UP-TO-DATE
17-Oct-2019 14:01:38 > Task :spring-cloud:spring-cloud-connectors-core:processTestResources UP-TO-DATE
17-Oct-2019 14:01:38 > Task :spring-cloud:spring-cloud-connectors-core:testClasses UP-TO-DATE
17-Oct-2019 14:01:38 > Task :spring-cloud:spring-cloud-connectors-core:test UP-TO-DATE
17-Oct-2019 14:01:38 > Task :spring-cloud:spring-cloud-heroku-connector:compileJava UP-TO-DATE
17-Oct-2019 14:01:38 > Task :spring-cloud:spring-cloud-heroku-connector:processResources UP-TO-DATE
17-Oct-2019 14:01:38 > Task :spring-cloud:spring-cloud-heroku-connector:classes UP-TO-DATE
17-Oct-2019 14:01:38 > Task :spring-cloud:spring-cloud-heroku-connector:compileTestJava UP-TO-DATE
17-Oct-2019 14:01:38 > Task :spring-cloud:spring-cloud-heroku-connector:processTestResources NO-SOURCE
17-Oct-2019 14:01:38 > Task :spring-cloud:spring-cloud-heroku-connector:testClasses UP-TO-DATE
17-Oct-2019 14:01:38 > Task :spring-cloud:spring-cloud-heroku-connector:test UP-TO-DATE
17-Oct-2019 14:01:38 > Task :spring-cloud:spring-cloud-localconfig-connector:compileJava UP-TO-DATE
17-Oct-2019 14:01:38 > Task :spring-cloud:spring-cloud-localconfig-connector:processResources UP-TO-DATE
17-Oct-2019 14:01:38 > Task :spring-cloud:spring-cloud-localconfig-connector:classes UP-TO-DATE
17-Oct-2019 14:01:38 > Task :spring-cloud:spring-cloud-localconfig-connector:compileTestJava UP-TO-DATE
17-Oct-2019 14:01:38 > Task :spring-cloud:spring-cloud-localconfig-connector:processTestResources UP-TO-DATE
17-Oct-2019 14:01:38 > Task :spring-cloud:spring-cloud-localconfig-connector:testClasses UP-TO-DATE
17-Oct-2019 14:01:38 > Task :spring-cloud:spring-cloud-localconfig-connector:test UP-TO-DATE
17-Oct-2019 14:01:38 > Task :spring-cloud:spring-cloud-connectors-core:testJar UP-TO-DATE
17-Oct-2019 14:01:38 > Task :spring-cloud:spring-cloud-spring-service-connector:compileJava UP-TO-DATE
17-Oct-2019 14:01:38 > Task :spring-cloud:spring-cloud-spring-service-connector:processResources UP-TO-DATE
17-Oct-2019 14:01:38 > Task :spring-cloud:spring-cloud-spring-service-connector:classes UP-TO-DATE
17-Oct-2019 14:01:38 > Task :spring-cloud:spring-cloud-spring-service-connector:compileTestJava UP-TO-DATE
17-Oct-2019 14:01:38 > Task :spring-cloud:spring-cloud-spring-service-connector:processTestResources UP-TO-DATE
17-Oct-2019 14:01:38 > Task :spring-cloud:spring-cloud-spring-service-connector:testClasses UP-TO-DATE
17-Oct-2019 14:01:38 > Task :spring-cloud:spring-cloud-spring-service-connector:test UP-TO-DATE
17-Oct-2019 14:01:38 > Task :amqp205-rabbit541
17-Oct-2019 14:01:38 > Task :spring-cloud:spring-cloud-connectors-core:compileJava UP-TO-DATE
17-Oct-2019 14:01:38 > Task :spring-cloud:spring-cloud-connectors-core:processResources NO-SOURCE
17-Oct-2019 14:01:38 > Task :spring-cloud:spring-cloud-connectors-core:classes UP-TO-DATE
17-Oct-2019 14:01:38 > Task :spring-cloud:spring-cloud-connectors-core:jar UP-TO-DATE
17-Oct-2019 14:01:38 > Task :spring-cloud:spring-cloud-cloudfoundry-connector:compileJava UP-TO-DATE
17-Oct-2019 14:01:38 > Task :spring-cloud:spring-cloud-cloudfoundry-connector:processResources UP-TO-DATE
17-Oct-2019 14:01:38 > Task :spring-cloud:spring-cloud-cloudfoundry-connector:classes UP-TO-DATE
17-Oct-2019 14:01:38 > Task :spring-cloud:spring-cloud-cloudfoundry-connector:compileTestJava UP-TO-DATE
17-Oct-2019 14:01:38 > Task :spring-cloud:spring-cloud-cloudfoundry-connector:processTestResources UP-TO-DATE
17-Oct-2019 14:01:38 > Task :spring-cloud:spring-cloud-cloudfoundry-connector:testClasses UP-TO-DATE
17-Oct-2019 14:01:38 > Task :spring-cloud:spring-cloud-cloudfoundry-connector:test UP-TO-DATE
17-Oct-2019 14:01:38 > Task :spring-cloud:spring-cloud-connectors-core:compileTestJava UP-TO-DATE
17-Oct-2019 14:01:38 > Task :spring-cloud:spring-cloud-connectors-core:processTestResources UP-TO-DATE
17-Oct-2019 14:01:38 > Task :spring-cloud:spring-cloud-connectors-core:testClasses UP-TO-DATE
17-Oct-2019 14:01:38 > Task :spring-cloud:spring-cloud-connectors-core:test UP-TO-DATE
17-Oct-2019 14:01:38 > Task :spring-cloud:spring-cloud-heroku-connector:compileJava UP-TO-DATE
17-Oct-2019 14:01:38 > Task :spring-cloud:spring-cloud-heroku-connector:processResources UP-TO-DATE
17-Oct-2019 14:01:38 > Task :spring-cloud:spring-cloud-heroku-connector:classes UP-TO-DATE
17-Oct-2019 14:01:38 > Task :spring-cloud:spring-cloud-heroku-connector:compileTestJava UP-TO-DATE
17-Oct-2019 14:01:38 > Task :spring-cloud:spring-cloud-heroku-connector:processTestResources NO-SOURCE
17-Oct-2019 14:01:38 > Task :spring-cloud:spring-cloud-heroku-connector:testClasses UP-TO-DATE
17-Oct-2019 14:01:38 > Task :spring-cloud:spring-cloud-heroku-connector:test UP-TO-DATE
17-Oct-2019 14:01:38 > Task :spring-cloud:spring-cloud-localconfig-connector:compileJava UP-TO-DATE
17-Oct-2019 14:01:38 > Task :spring-cloud:spring-cloud-localconfig-connector:processResources UP-TO-DATE
17-Oct-2019 14:01:38 > Task :spring-cloud:spring-cloud-localconfig-connector:classes UP-TO-DATE
17-Oct-2019 14:01:38 > Task :spring-cloud:spring-cloud-localconfig-connector:compileTestJava UP-TO-DATE
17-Oct-2019 14:01:38 > Task :spring-cloud:spring-cloud-localconfig-connector:processTestResources UP-TO-DATE
17-Oct-2019 14:01:38 > Task :spring-cloud:spring-cloud-localconfig-connector:testClasses UP-TO-DATE
17-Oct-2019 14:01:38 > Task :spring-cloud:spring-cloud-localconfig-connector:test UP-TO-DATE
17-Oct-2019 14:01:38 > Task :spring-cloud:spring-cloud-connectors-core:testJar UP-TO-DATE
17-Oct-2019 14:01:38 > Task :spring-cloud:spring-cloud-spring-service-connector:compileJava UP-TO-DATE
17-Oct-2019 14:01:38 > Task :spring-cloud:spring-cloud-spring-service-connector:processResources UP-TO-DATE
17-Oct-2019 14:01:38 > Task :spring-cloud:spring-cloud-spring-service-connector:classes UP-TO-DATE
17-Oct-2019 14:01:38 > Task :spring-cloud:spring-cloud-spring-service-connector:compileTestJava UP-TO-DATE
17-Oct-2019 14:01:38 > Task :spring-cloud:spring-cloud-spring-service-connector:processTestResources UP-TO-DATE
17-Oct-2019 14:01:38 > Task :spring-cloud:spring-cloud-spring-service-connector:testClasses UP-TO-DATE
17-Oct-2019 14:01:38 > Task :spring-cloud:spring-cloud-spring-service-connector:test UP-TO-DATE
17-Oct-2019 14:01:38 > Task :driver330-cass20
17-Oct-2019 14:01:39 > Task :spring-cloud:spring-cloud-connectors-core:compileJava UP-TO-DATE
17-Oct-2019 14:01:39 > Task :spring-cloud:spring-cloud-connectors-core:processResources NO-SOURCE
17-Oct-2019 14:01:39 > Task :spring-cloud:spring-cloud-connectors-core:classes UP-TO-DATE
17-Oct-2019 14:01:39 > Task :spring-cloud:spring-cloud-connectors-core:jar UP-TO-DATE
17-Oct-2019 14:01:39 > Task :spring-cloud:spring-cloud-cloudfoundry-connector:compileJava UP-TO-DATE
17-Oct-2019 14:01:39 > Task :spring-cloud:spring-cloud-cloudfoundry-connector:processResources UP-TO-DATE
17-Oct-2019 14:01:39 > Task :spring-cloud:spring-cloud-cloudfoundry-connector:classes UP-TO-DATE
17-Oct-2019 14:01:39 > Task :spring-cloud:spring-cloud-cloudfoundry-connector:compileTestJava UP-TO-DATE
17-Oct-2019 14:01:39 > Task :spring-cloud:spring-cloud-cloudfoundry-connector:processTestResources UP-TO-DATE
17-Oct-2019 14:01:39 > Task :spring-cloud:spring-cloud-cloudfoundry-connector:testClasses UP-TO-DATE
17-Oct-2019 14:01:39 > Task :spring-cloud:spring-cloud-cloudfoundry-connector:test UP-TO-DATE
17-Oct-2019 14:01:39 > Task :spring-cloud:spring-cloud-connectors-core:compileTestJava UP-TO-DATE
17-Oct-2019 14:01:39 > Task :spring-cloud:spring-cloud-connectors-core:processTestResources UP-TO-DATE
17-Oct-2019 14:01:39 > Task :spring-cloud:spring-cloud-connectors-core:testClasses UP-TO-DATE
17-Oct-2019 14:01:39 > Task :spring-cloud:spring-cloud-connectors-core:test UP-TO-DATE
17-Oct-2019 14:01:39 > Task :spring-cloud:spring-cloud-heroku-connector:compileJava UP-TO-DATE
17-Oct-2019 14:01:39 > Task :spring-cloud:spring-cloud-heroku-connector:processResources UP-TO-DATE
17-Oct-2019 14:01:39 > Task :spring-cloud:spring-cloud-heroku-connector:classes UP-TO-DATE
17-Oct-2019 14:01:39 > Task :spring-cloud:spring-cloud-heroku-connector:compileTestJava UP-TO-DATE
17-Oct-2019 14:01:39 > Task :spring-cloud:spring-cloud-heroku-connector:processTestResources NO-SOURCE
17-Oct-2019 14:01:39 > Task :spring-cloud:spring-cloud-heroku-connector:testClasses UP-TO-DATE
17-Oct-2019 14:01:39 > Task :spring-cloud:spring-cloud-heroku-connector:test UP-TO-DATE
17-Oct-2019 14:01:39 > Task :spring-cloud:spring-cloud-localconfig-connector:compileJava UP-TO-DATE
17-Oct-2019 14:01:39 > Task :spring-cloud:spring-cloud-localconfig-connector:processResources UP-TO-DATE
17-Oct-2019 14:01:39 > Task :spring-cloud:spring-cloud-localconfig-connector:classes UP-TO-DATE
17-Oct-2019 14:01:39 > Task :spring-cloud:spring-cloud-localconfig-connector:compileTestJava UP-TO-DATE
17-Oct-2019 14:01:39 > Task :spring-cloud:spring-cloud-localconfig-connector:processTestResources UP-TO-DATE
17-Oct-2019 14:01:39 > Task :spring-cloud:spring-cloud-localconfig-connector:testClasses UP-TO-DATE
17-Oct-2019 14:01:39 > Task :spring-cloud:spring-cloud-localconfig-connector:test UP-TO-DATE
17-Oct-2019 14:01:39 > Task :spring-cloud:spring-cloud-connectors-core:testJar UP-TO-DATE
17-Oct-2019 14:01:39 > Task :spring-cloud:spring-cloud-spring-service-connector:compileJava UP-TO-DATE
17-Oct-2019 14:01:39 > Task :spring-cloud:spring-cloud-spring-service-connector:processResources UP-TO-DATE
17-Oct-2019 14:01:39 > Task :spring-cloud:spring-cloud-spring-service-connector:classes UP-TO-DATE
17-Oct-2019 14:01:39 > Task :spring-cloud:spring-cloud-spring-service-connector:compileTestJava UP-TO-DATE
17-Oct-2019 14:01:39 > Task :spring-cloud:spring-cloud-spring-service-connector:processTestResources UP-TO-DATE
17-Oct-2019 14:01:39 > Task :spring-cloud:spring-cloud-spring-service-connector:testClasses UP-TO-DATE
17-Oct-2019 14:01:39 > Task :spring-cloud:spring-cloud-spring-service-connector:test UP-TO-DATE
17-Oct-2019 14:01:39 > Task :driver34-mongo20
17-Oct-2019 14:01:39 > Task :spring-cloud:spring-cloud-connectors-core:compileJava UP-TO-DATE
17-Oct-2019 14:01:39 > Task :spring-cloud:spring-cloud-connectors-core:processResources NO-SOURCE
17-Oct-2019 14:01:39 > Task :spring-cloud:spring-cloud-connectors-core:classes UP-TO-DATE
17-Oct-2019 14:01:39 > Task :spring-cloud:spring-cloud-connectors-core:jar UP-TO-DATE
17-Oct-2019 14:01:39 > Task :spring-cloud:spring-cloud-cloudfoundry-connector:compileJava UP-TO-DATE
17-Oct-2019 14:01:39 > Task :spring-cloud:spring-cloud-cloudfoundry-connector:processResources UP-TO-DATE
17-Oct-2019 14:01:39 > Task :spring-cloud:spring-cloud-cloudfoundry-connector:classes UP-TO-DATE
17-Oct-2019 14:01:39 > Task :spring-cloud:spring-cloud-cloudfoundry-connector:compileTestJava UP-TO-DATE
17-Oct-2019 14:01:39 > Task :spring-cloud:spring-cloud-cloudfoundry-connector:processTestResources UP-TO-DATE
17-Oct-2019 14:01:39 > Task :spring-cloud:spring-cloud-cloudfoundry-connector:testClasses UP-TO-DATE
17-Oct-2019 14:01:39 > Task :spring-cloud:spring-cloud-cloudfoundry-connector:test UP-TO-DATE
17-Oct-2019 14:01:39 > Task :spring-cloud:spring-cloud-connectors-core:compileTestJava UP-TO-DATE
17-Oct-2019 14:01:39 > Task :spring-cloud:spring-cloud-connectors-core:processTestResources UP-TO-DATE
17-Oct-2019 14:01:39 > Task :spring-cloud:spring-cloud-connectors-core:testClasses UP-TO-DATE
17-Oct-2019 14:01:39 > Task :spring-cloud:spring-cloud-connectors-core:test UP-TO-DATE
17-Oct-2019 14:01:39 > Task :spring-cloud:spring-cloud-heroku-connector:compileJava UP-TO-DATE
17-Oct-2019 14:01:39 > Task :spring-cloud:spring-cloud-heroku-connector:processResources UP-TO-DATE
17-Oct-2019 14:01:39 > Task :spring-cloud:spring-cloud-heroku-connector:classes UP-TO-DATE
17-Oct-2019 14:01:39 > Task :spring-cloud:spring-cloud-heroku-connector:compileTestJava UP-TO-DATE
17-Oct-2019 14:01:39 > Task :spring-cloud:spring-cloud-heroku-connector:processTestResources NO-SOURCE
17-Oct-2019 14:01:39 > Task :spring-cloud:spring-cloud-heroku-connector:testClasses UP-TO-DATE
17-Oct-2019 14:01:39 > Task :spring-cloud:spring-cloud-heroku-connector:test UP-TO-DATE
17-Oct-2019 14:01:39 > Task :spring-cloud:spring-cloud-localconfig-connector:compileJava UP-TO-DATE
17-Oct-2019 14:01:39 > Task :spring-cloud:spring-cloud-localconfig-connector:processResources UP-TO-DATE
17-Oct-2019 14:01:39 > Task :spring-cloud:spring-cloud-localconfig-connector:classes UP-TO-DATE
17-Oct-2019 14:01:39 > Task :spring-cloud:spring-cloud-localconfig-connector:compileTestJava UP-TO-DATE
17-Oct-2019 14:01:39 > Task :spring-cloud:spring-cloud-localconfig-connector:processTestResources UP-TO-DATE
17-Oct-2019 14:01:39 > Task :spring-cloud:spring-cloud-localconfig-connector:testClasses UP-TO-DATE
17-Oct-2019 14:01:39 > Task :spring-cloud:spring-cloud-localconfig-connector:test UP-TO-DATE
17-Oct-2019 14:01:39 > Task :spring-cloud:spring-cloud-connectors-core:testJar UP-TO-DATE
17-Oct-2019 14:01:39 > Task :spring-cloud:spring-cloud-spring-service-connector:compileJava UP-TO-DATE
17-Oct-2019 14:01:39 > Task :spring-cloud:spring-cloud-spring-service-connector:processResources UP-TO-DATE
17-Oct-2019 14:01:39 > Task :spring-cloud:spring-cloud-spring-service-connector:classes UP-TO-DATE
17-Oct-2019 14:01:39 > Task :spring-cloud:spring-cloud-spring-service-connector:compileTestJava UP-TO-DATE
17-Oct-2019 14:01:39 > Task :spring-cloud:spring-cloud-spring-service-connector:processTestResources UP-TO-DATE
17-Oct-2019 14:01:39 > Task :spring-cloud:spring-cloud-spring-service-connector:testClasses UP-TO-DATE
17-Oct-2019 14:01:39 > Task :spring-cloud:spring-cloud-spring-service-connector:test UP-TO-DATE
17-Oct-2019 14:01:39 > Task :jedis29-redis20
17-Oct-2019 14:01:39 > Task :spring-cloud:spring-cloud-connectors-core:compileJava UP-TO-DATE
17-Oct-2019 14:01:39 > Task :spring-cloud:spring-cloud-connectors-core:processResources NO-SOURCE
17-Oct-2019 14:01:39 > Task :spring-cloud:spring-cloud-connectors-core:classes UP-TO-DATE
17-Oct-2019 14:01:39 > Task :spring-cloud:spring-cloud-connectors-core:jar UP-TO-DATE
17-Oct-2019 14:01:39 > Task :spring-cloud:spring-cloud-cloudfoundry-connector:compileJava UP-TO-DATE
17-Oct-2019 14:01:39 > Task :spring-cloud:spring-cloud-cloudfoundry-connector:processResources UP-TO-DATE
17-Oct-2019 14:01:39 > Task :spring-cloud:spring-cloud-cloudfoundry-connector:classes UP-TO-DATE
17-Oct-2019 14:01:39 > Task :spring-cloud:spring-cloud-cloudfoundry-connector:compileTestJava UP-TO-DATE
17-Oct-2019 14:01:39 > Task :spring-cloud:spring-cloud-cloudfoundry-connector:processTestResources UP-TO-DATE
17-Oct-2019 14:01:39 > Task :spring-cloud:spring-cloud-cloudfoundry-connector:testClasses UP-TO-DATE
17-Oct-2019 14:01:39 > Task :spring-cloud:spring-cloud-cloudfoundry-connector:test UP-TO-DATE
17-Oct-2019 14:01:39 > Task :spring-cloud:spring-cloud-connectors-core:compileTestJava UP-TO-DATE
17-Oct-2019 14:01:39 > Task :spring-cloud:spring-cloud-connectors-core:processTestResources UP-TO-DATE
17-Oct-2019 14:01:39 > Task :spring-cloud:spring-cloud-connectors-core:testClasses UP-TO-DATE
17-Oct-2019 14:01:39 > Task :spring-cloud:spring-cloud-connectors-core:test UP-TO-DATE
17-Oct-2019 14:01:39 > Task :spring-cloud:spring-cloud-heroku-connector:compileJava UP-TO-DATE
17-Oct-2019 14:01:39 > Task :spring-cloud:spring-cloud-heroku-connector:processResources UP-TO-DATE
17-Oct-2019 14:01:39 > Task :spring-cloud:spring-cloud-heroku-connector:classes UP-TO-DATE
17-Oct-2019 14:01:39 > Task :spring-cloud:spring-cloud-heroku-connector:compileTestJava UP-TO-DATE
17-Oct-2019 14:01:39 > Task :spring-cloud:spring-cloud-heroku-connector:processTestResources NO-SOURCE
17-Oct-2019 14:01:39 > Task :spring-cloud:spring-cloud-heroku-connector:testClasses UP-TO-DATE
17-Oct-2019 14:01:39 > Task :spring-cloud:spring-cloud-heroku-connector:test UP-TO-DATE
17-Oct-2019 14:01:39 > Task :spring-cloud:spring-cloud-localconfig-connector:compileJava UP-TO-DATE
17-Oct-2019 14:01:39 > Task :spring-cloud:spring-cloud-localconfig-connector:processResources UP-TO-DATE
17-Oct-2019 14:01:39 > Task :spring-cloud:spring-cloud-localconfig-connector:classes UP-TO-DATE
17-Oct-2019 14:01:39 > Task :spring-cloud:spring-cloud-localconfig-connector:compileTestJava UP-TO-DATE
17-Oct-2019 14:01:39 > Task :spring-cloud:spring-cloud-localconfig-connector:processTestResources UP-TO-DATE
17-Oct-2019 14:01:39 > Task :spring-cloud:spring-cloud-localconfig-connector:testClasses UP-TO-DATE
17-Oct-2019 14:01:39 > Task :spring-cloud:spring-cloud-localconfig-connector:test UP-TO-DATE
17-Oct-2019 14:01:39 > Task :spring-cloud:spring-cloud-connectors-core:testJar UP-TO-DATE
17-Oct-2019 14:01:39 > Task :spring-cloud:spring-cloud-spring-service-connector:compileJava UP-TO-DATE
17-Oct-2019 14:01:39 > Task :spring-cloud:spring-cloud-spring-service-connector:processResources UP-TO-DATE
17-Oct-2019 14:01:39 > Task :spring-cloud:spring-cloud-spring-service-connector:classes UP-TO-DATE
17-Oct-2019 14:01:39 > Task :spring-cloud:spring-cloud-spring-service-connector:compileTestJava UP-TO-DATE
17-Oct-2019 14:01:39 > Task :spring-cloud:spring-cloud-spring-service-connector:processTestResources UP-TO-DATE
17-Oct-2019 14:01:39 > Task :spring-cloud:spring-cloud-spring-service-connector:testClasses UP-TO-DATE
17-Oct-2019 14:01:39 > Task :spring-cloud:spring-cloud-spring-service-connector:test UP-TO-DATE
17-Oct-2019 14:01:39 > Task :lettuce5-redis20
17-Oct-2019 14:01:39 > Task :spring-cloud:spring-cloud-connectors-core:compileJava UP-TO-DATE
17-Oct-2019 14:01:39 > Task :spring-cloud:spring-cloud-connectors-core:processResources NO-SOURCE
17-Oct-2019 14:01:39 > Task :spring-cloud:spring-cloud-connectors-core:classes UP-TO-DATE
17-Oct-2019 14:01:39 > Task :spring-cloud:spring-cloud-connectors-core:jar UP-TO-DATE
17-Oct-2019 14:01:39 > Task :spring-cloud:spring-cloud-cloudfoundry-connector:compileJava UP-TO-DATE
17-Oct-2019 14:01:39 > Task :spring-cloud:spring-cloud-cloudfoundry-connector:processResources UP-TO-DATE
17-Oct-2019 14:01:39 > Task :spring-cloud:spring-cloud-cloudfoundry-connector:classes UP-TO-DATE
17-Oct-2019 14:01:39 > Task :spring-cloud:spring-cloud-cloudfoundry-connector:compileTestJava UP-TO-DATE
17-Oct-2019 14:01:39 > Task :spring-cloud:spring-cloud-cloudfoundry-connector:processTestResources UP-TO-DATE
17-Oct-2019 14:01:39 > Task :spring-cloud:spring-cloud-cloudfoundry-connector:testClasses UP-TO-DATE
17-Oct-2019 14:01:39 > Task :spring-cloud:spring-cloud-cloudfoundry-connector:test UP-TO-DATE
17-Oct-2019 14:01:39 > Task :spring-cloud:spring-cloud-connectors-core:compileTestJava UP-TO-DATE
17-Oct-2019 14:01:39 > Task :spring-cloud:spring-cloud-connectors-core:processTestResources UP-TO-DATE
17-Oct-2019 14:01:39 > Task :spring-cloud:spring-cloud-connectors-core:testClasses UP-TO-DATE
17-Oct-2019 14:01:39 > Task :spring-cloud:spring-cloud-connectors-core:test UP-TO-DATE
17-Oct-2019 14:01:39 > Task :spring-cloud:spring-cloud-heroku-connector:compileJava UP-TO-DATE
17-Oct-2019 14:01:39 > Task :spring-cloud:spring-cloud-heroku-connector:processResources UP-TO-DATE
17-Oct-2019 14:01:39 > Task :spring-cloud:spring-cloud-heroku-connector:classes UP-TO-DATE
17-Oct-2019 14:01:39 > Task :spring-cloud:spring-cloud-heroku-connector:compileTestJava UP-TO-DATE
17-Oct-2019 14:01:39 > Task :spring-cloud:spring-cloud-heroku-connector:processTestResources NO-SOURCE
17-Oct-2019 14:01:39 > Task :spring-cloud:spring-cloud-heroku-connector:testClasses UP-TO-DATE
17-Oct-2019 14:01:39 > Task :spring-cloud:spring-cloud-heroku-connector:test UP-TO-DATE
17-Oct-2019 14:01:39 > Task :spring-cloud:spring-cloud-localconfig-connector:compileJava UP-TO-DATE
17-Oct-2019 14:01:39 > Task :spring-cloud:spring-cloud-localconfig-connector:processResources UP-TO-DATE
17-Oct-2019 14:01:39 > Task :spring-cloud:spring-cloud-localconfig-connector:classes UP-TO-DATE
17-Oct-2019 14:01:39 > Task :spring-cloud:spring-cloud-localconfig-connector:compileTestJava UP-TO-DATE
17-Oct-2019 14:01:39 > Task :spring-cloud:spring-cloud-localconfig-connector:processTestResources UP-TO-DATE
17-Oct-2019 14:01:39 > Task :spring-cloud:spring-cloud-localconfig-connector:testClasses UP-TO-DATE
17-Oct-2019 14:01:39 > Task :spring-cloud:spring-cloud-localconfig-connector:test UP-TO-DATE
17-Oct-2019 14:01:39 > Task :spring-cloud:spring-cloud-connectors-core:testJar UP-TO-DATE
17-Oct-2019 14:01:39 > Task :spring-cloud:spring-cloud-spring-service-connector:compileJava UP-TO-DATE
17-Oct-2019 14:01:39 > Task :spring-cloud:spring-cloud-spring-service-connector:processResources UP-TO-DATE
17-Oct-2019 14:01:39 > Task :spring-cloud:spring-cloud-spring-service-connector:classes UP-TO-DATE
17-Oct-2019 14:01:39 > Task :spring-cloud:spring-cloud-spring-service-connector:compileTestJava UP-TO-DATE
17-Oct-2019 14:01:39 > Task :spring-cloud:spring-cloud-spring-service-connector:processTestResources UP-TO-DATE
17-Oct-2019 14:01:39 > Task :spring-cloud:spring-cloud-spring-service-connector:testClasses UP-TO-DATE
17-Oct-2019 14:01:39 > Task :spring-cloud:spring-cloud-spring-service-connector:test UP-TO-DATE
17-Oct-2019 14:01:39 > Task :spring50
17-Oct-2019 14:01:39 > Task :spring-cloud:spring-cloud-connectors-core:compileJava UP-TO-DATE
17-Oct-2019 14:01:39 > Task :spring-cloud:spring-cloud-connectors-core:processResources NO-SOURCE
17-Oct-2019 14:01:39 > Task :spring-cloud:spring-cloud-connectors-core:classes UP-TO-DATE
17-Oct-2019 14:01:39 > Task :spring-cloud:spring-cloud-connectors-core:jar UP-TO-DATE
17-Oct-2019 14:01:39 > Task :spring-cloud:spring-cloud-cloudfoundry-connector:compileJava UP-TO-DATE
17-Oct-2019 14:01:39 > Task :spring-cloud:spring-cloud-cloudfoundry-connector:processResources UP-TO-DATE
17-Oct-2019 14:01:39 > Task :spring-cloud:spring-cloud-cloudfoundry-connector:classes UP-TO-DATE
17-Oct-2019 14:01:39 > Task :spring-cloud:spring-cloud-cloudfoundry-connector:compileTestJava UP-TO-DATE
17-Oct-2019 14:01:39 > Task :spring-cloud:spring-cloud-cloudfoundry-connector:processTestResources UP-TO-DATE
17-Oct-2019 14:01:39 > Task :spring-cloud:spring-cloud-cloudfoundry-connector:testClasses UP-TO-DATE
17-Oct-2019 14:01:39 > Task :spring-cloud:spring-cloud-cloudfoundry-connector:test UP-TO-DATE
17-Oct-2019 14:01:39 > Task :spring-cloud:spring-cloud-connectors-core:compileTestJava UP-TO-DATE
17-Oct-2019 14:01:39 > Task :spring-cloud:spring-cloud-connectors-core:processTestResources UP-TO-DATE
17-Oct-2019 14:01:39 > Task :spring-cloud:spring-cloud-connectors-core:testClasses UP-TO-DATE
17-Oct-2019 14:01:39 > Task :spring-cloud:spring-cloud-connectors-core:test UP-TO-DATE
17-Oct-2019 14:01:39 > Task :spring-cloud:spring-cloud-heroku-connector:compileJava UP-TO-DATE
17-Oct-2019 14:01:39 > Task :spring-cloud:spring-cloud-heroku-connector:processResources UP-TO-DATE
17-Oct-2019 14:01:39 > Task :spring-cloud:spring-cloud-heroku-connector:classes UP-TO-DATE
17-Oct-2019 14:01:39 > Task :spring-cloud:spring-cloud-heroku-connector:compileTestJava UP-TO-DATE
17-Oct-2019 14:01:39 > Task :spring-cloud:spring-cloud-heroku-connector:processTestResources NO-SOURCE
17-Oct-2019 14:01:39 > Task :spring-cloud:spring-cloud-heroku-connector:testClasses UP-TO-DATE
17-Oct-2019 14:01:39 > Task :spring-cloud:spring-cloud-heroku-connector:test UP-TO-DATE
17-Oct-2019 14:01:39 > Task :spring-cloud:spring-cloud-localconfig-connector:compileJava UP-TO-DATE
17-Oct-2019 14:01:39 > Task :spring-cloud:spring-cloud-localconfig-connector:processResources UP-TO-DATE
17-Oct-2019 14:01:39 > Task :spring-cloud:spring-cloud-localconfig-connector:classes UP-TO-DATE
17-Oct-2019 14:01:39 > Task :spring-cloud:spring-cloud-localconfig-connector:compileTestJava UP-TO-DATE
17-Oct-2019 14:01:39 > Task :spring-cloud:spring-cloud-localconfig-connector:processTestResources UP-TO-DATE
17-Oct-2019 14:01:39 > Task :spring-cloud:spring-cloud-localconfig-connector:testClasses UP-TO-DATE
17-Oct-2019 14:01:39 > Task :spring-cloud:spring-cloud-localconfig-connector:test UP-TO-DATE
17-Oct-2019 14:01:39 > Task :spring-cloud:spring-cloud-connectors-core:testJar UP-TO-DATE
17-Oct-2019 14:01:39 > Task :spring-cloud:spring-cloud-spring-service-connector:compileJava UP-TO-DATE
17-Oct-2019 14:01:39 > Task :spring-cloud:spring-cloud-spring-service-connector:processResources UP-TO-DATE
17-Oct-2019 14:01:39 > Task :spring-cloud:spring-cloud-spring-service-connector:classes UP-TO-DATE
17-Oct-2019 14:01:39 > Task :spring-cloud:spring-cloud-spring-service-connector:compileTestJava UP-TO-DATE
17-Oct-2019 14:01:39 > Task :spring-cloud:spring-cloud-spring-service-connector:processTestResources UP-TO-DATE
17-Oct-2019 14:01:39 > Task :spring-cloud:spring-cloud-spring-service-connector:testClasses UP-TO-DATE
17-Oct-2019 14:01:39 > Task :spring-cloud:spring-cloud-spring-service-connector:test UP-TO-DATE
17-Oct-2019 14:01:39 > Task :tomcat85
17-Oct-2019 14:01:39 > Task :matrixTests
17-Oct-2019 14:01:39 > Task :spring-cloud-connectors-core:compileJava UP-TO-DATE
17-Oct-2019 14:01:39 > Task :spring-cloud-connectors-core:processResources NO-SOURCE
17-Oct-2019 14:01:39 > Task :spring-cloud-connectors-core:classes UP-TO-DATE
17-Oct-2019 14:01:39 > Task :spring-cloud-connectors-core:jar UP-TO-DATE
17-Oct-2019 14:01:39 > Task :spring-cloud-cloudfoundry-connector:compileJava UP-TO-DATE
17-Oct-2019 14:01:39 > Task :spring-cloud-cloudfoundry-connector:processResources UP-TO-DATE
17-Oct-2019 14:01:39 > Task :spring-cloud-cloudfoundry-connector:classes UP-TO-DATE
17-Oct-2019 14:01:39 > Task :spring-cloud-cloudfoundry-connector:compileTestJava UP-TO-DATE
17-Oct-2019 14:01:39 > Task :spring-cloud-cloudfoundry-connector:processTestResources UP-TO-DATE
17-Oct-2019 14:01:39 > Task :spring-cloud-cloudfoundry-connector:testClasses UP-TO-DATE
17-Oct-2019 14:01:39 > Task :spring-cloud-cloudfoundry-connector:test UP-TO-DATE
17-Oct-2019 14:01:39 > Task :spring-cloud-connectors-core:compileTestJava UP-TO-DATE
17-Oct-2019 14:01:39 > Task :spring-cloud-connectors-core:processTestResources UP-TO-DATE
17-Oct-2019 14:01:39 > Task :spring-cloud-connectors-core:testClasses UP-TO-DATE
17-Oct-2019 14:01:39 > Task :spring-cloud-connectors-core:test UP-TO-DATE
17-Oct-2019 14:01:39 > Task :spring-cloud-heroku-connector:compileJava UP-TO-DATE
17-Oct-2019 14:01:39 > Task :spring-cloud-heroku-connector:processResources UP-TO-DATE
17-Oct-2019 14:01:39 > Task :spring-cloud-heroku-connector:classes UP-TO-DATE
17-Oct-2019 14:01:39 > Task :spring-cloud-heroku-connector:compileTestJava UP-TO-DATE
17-Oct-2019 14:01:39 > Task :spring-cloud-heroku-connector:processTestResources NO-SOURCE
17-Oct-2019 14:01:39 > Task :spring-cloud-heroku-connector:testClasses UP-TO-DATE
17-Oct-2019 14:01:39 > Task :spring-cloud-heroku-connector:test UP-TO-DATE
17-Oct-2019 14:01:39 > Task :spring-cloud-localconfig-connector:compileJava UP-TO-DATE
17-Oct-2019 14:01:39 > Task :spring-cloud-localconfig-connector:processResources UP-TO-DATE
17-Oct-2019 14:01:39 > Task :spring-cloud-localconfig-connector:classes UP-TO-DATE
17-Oct-2019 14:01:39 > Task :spring-cloud-localconfig-connector:compileTestJava UP-TO-DATE
17-Oct-2019 14:01:39 > Task :spring-cloud-localconfig-connector:processTestResources UP-TO-DATE
17-Oct-2019 14:01:39 > Task :spring-cloud-localconfig-connector:testClasses UP-TO-DATE
17-Oct-2019 14:01:39 > Task :spring-cloud-localconfig-connector:test UP-TO-DATE
17-Oct-2019 14:01:39 > Task :spring-cloud-connectors-core:testJar UP-TO-DATE
17-Oct-2019 14:01:39 > Task :spring-cloud-spring-service-connector:compileJava UP-TO-DATE
17-Oct-2019 14:01:39 > Task :spring-cloud-spring-service-connector:processResources UP-TO-DATE
17-Oct-2019 14:01:39 > Task :spring-cloud-spring-service-connector:classes UP-TO-DATE
17-Oct-2019 14:01:39 > Task :spring-cloud-spring-service-connector:compileTestJava UP-TO-DATE
17-Oct-2019 14:01:39 > Task :spring-cloud-spring-service-connector:processTestResources UP-TO-DATE
17-Oct-2019 14:01:39 > Task :spring-cloud-spring-service-connector:testClasses UP-TO-DATE
17-Oct-2019 14:01:39 > Task :spring-cloud-spring-service-connector:test UP-TO-DATE
17-Oct-2019 14:01:42 > Task :api
17-Oct-2019 14:01:42 > Task :docsZip
17-Oct-2019 14:01:42 > Task :schemaZip
17-Oct-2019 14:01:42 > Task :assemble
17-Oct-2019 14:01:42 > Task :check UP-TO-DATE
17-Oct-2019 14:01:42 > Task :build
17-Oct-2019 14:01:42 > Task :spring-cloud-cloudfoundry-connector:jar
17-Oct-2019 14:01:43 > Task :spring-cloud-cloudfoundry-connector:javadoc
17-Oct-2019 14:01:43 > Task :spring-cloud-cloudfoundry-connector:javadocJar
17-Oct-2019 14:01:43 > Task :spring-cloud-cloudfoundry-connector:packageSources
17-Oct-2019 14:01:45 ex
17-Oct-2019 14:01:45
17-Oct-2019 14:01:45 > Task :spring-cloud-cloudfoundry-connector:shadowJar FAILED
17-Oct-2019 14:01:45 java.lang.IllegalArgumentException
17-Oct-2019 14:01:45         at org.objectweb.asm.ClassReader.<init>(Unknown Source)
17-Oct-2019 14:01:45         at org.objectweb.asm.ClassReader.<init>(Unknown Source)
17-Oct-2019 14:01:45         at org.objectweb.asm.ClassReader.<init>(Unknown Source)
17-Oct-2019 14:01:45         at sun.reflect.GeneratedConstructorAccessor130.newInstance(Unknown Source)
17-Oct-2019 14:01:45         at sun.reflect.DelegatingConstructorAccessorImpl.newInstance(DelegatingConstructorAccessorImpl.java:45)
17-Oct-2019 14:01:45         at java.lang.reflect.Constructor.newInstance(Constructor.java:423)
17-Oct-2019 14:01:45         at org.codehaus.groovy.reflection.CachedConstructor.invoke(CachedConstructor.java:83)
17-Oct-2019 14:01:45         at org.codehaus.groovy.runtime.callsite.ConstructorSite$ConstructorSiteNoUnwrapNoCoerce.callConstructor(ConstructorSite.java:105)
17-Oct-2019 14:01:45         at org.codehaus.groovy.runtime.callsite.AbstractCallSite.callConstructor(AbstractCallSite.java:250)
17-Oct-2019 14:01:45         at com.github.jengelman.gradle.plugins.shadow.tasks.ShadowCopyAction$StreamAction.remapClass(ShadowCopyAction.groovy:257)
17-Oct-2019 14:01:45         at sun.reflect.GeneratedMethodAccessor283.invoke(Unknown Source)
17-Oct-2019 14:01:45         at sun.reflect.DelegatingMethodAccessorImpl.invoke(DelegatingMethodAccessorImpl.java:43)
17-Oct-2019 14:01:45         at java.lang.reflect.Method.invoke(Method.java:498)
17-Oct-2019 14:01:45         at org.codehaus.groovy.runtime.callsite.PogoMetaMethodSite$PogoCachedMethodSiteNoUnwrapNoCoerce.invoke(PogoMetaMethodSite.java:210)
17-Oct-2019 14:01:45         at org.codehaus.groovy.runtime.callsite.PogoMetaMethodSite.callCurrent(PogoMetaMethodSite.java:59)
17-Oct-2019 14:01:45         at org.codehaus.groovy.runtime.callsite.AbstractCallSite.callCurrent(AbstractCallSite.java:177)
17-Oct-2019 14:01:45         at com.github.jengelman.gradle.plugins.shadow.tasks.ShadowCopyAction$StreamAction.remapClass(ShadowCopyAction.groovy:245)
17-Oct-2019 14:01:45         at sun.reflect.GeneratedMethodAccessor301.invoke(Unknown Source)
17-Oct-2019 14:01:45         at sun.reflect.DelegatingMethodAccessorImpl.invoke(DelegatingMethodAccessorImpl.java:43)
17-Oct-2019 14:01:45         at java.lang.reflect.Method.invoke(Method.java:498)
17-Oct-2019 14:01:45         at org.codehaus.groovy.runtime.callsite.PogoMetaMethodSite$PogoCachedMethodSiteNoUnwrapNoCoerce.invoke(PogoMetaMethodSite.java:210)
17-Oct-2019 14:01:45         at org.codehaus.groovy.runtime.callsite.PogoMetaMethodSite.callCurrent(PogoMetaMethodSite.java:59)
17-Oct-2019 14:01:45         at org.codehaus.groovy.runtime.callsite.AbstractCallSite.callCurrent(AbstractCallSite.java:177)
17-Oct-2019 14:01:45         at com.github.jengelman.gradle.plugins.shadow.tasks.ShadowCopyAction$StreamAction.visitArchiveFile(ShadowCopyAction.groovy:225)
17-Oct-2019 14:01:45         at sun.reflect.GeneratedMethodAccessor300.invoke(Unknown Source)
17-Oct-2019 14:01:45         at sun.reflect.DelegatingMethodAccessorImpl.invoke(DelegatingMethodAccessorImpl.java:43)
17-Oct-2019 14:01:45         at java.lang.reflect.Method.invoke(Method.java:498)
17-Oct-2019 14:01:45         at org.codehaus.groovy.reflection.CachedMethod.invoke(CachedMethod.java:98)
17-Oct-2019 14:01:45         at groovy.lang.MetaMethod.doMethodInvoke(MetaMethod.java:325)
17-Oct-2019 14:01:45         at org.codehaus.groovy.runtime.metaclass.ClosureMetaClass.invokeMethod(ClosureMetaClass.java:352)
17-Oct-2019 14:01:45         at groovy.lang.MetaClassImpl.invokeMethod(MetaClassImpl.java:1034)
17-Oct-2019 14:01:45         at org.codehaus.groovy.runtime.callsite.PogoMetaClassSite.callCurrent(PogoMetaClassSite.java:68)
17-Oct-2019 14:01:45         at org.codehaus.groovy.runtime.callsite.AbstractCallSite.callCurrent(AbstractCallSite.java:177)
17-Oct-2019 14:01:45         at com.github.jengelman.gradle.plugins.shadow.tasks.ShadowCopyAction$StreamAction$_processArchive_closure3.doCall(ShadowCopyAction.groovy:204)
17-Oct-2019 14:01:45         at sun.reflect.GeneratedMethodAccessor294.invoke(Unknown Source)
17-Oct-2019 14:01:45         at sun.reflect.DelegatingMethodAccessorImpl.invoke(DelegatingMethodAccessorImpl.java:43)
17-Oct-2019 14:01:45         at java.lang.reflect.Method.invoke(Method.java:498)
17-Oct-2019 14:01:45         at org.codehaus.groovy.reflection.CachedMethod.invoke(CachedMethod.java:98)
17-Oct-2019 14:01:45         at groovy.lang.MetaMethod.doMethodInvoke(MetaMethod.java:325)
17-Oct-2019 14:01:45         at org.codehaus.groovy.runtime.metaclass.ClosureMetaClass.invokeMethod(ClosureMetaClass.java:264)
17-Oct-2019 14:01:45         at groovy.lang.MetaClassImpl.invokeMethod(MetaClassImpl.java:1034)
17-Oct-2019 14:01:45         at groovy.lang.Closure.call(Closure.java:418)
17-Oct-2019 14:01:45         at groovy.lang.Closure.call(Closure.java:434)
17-Oct-2019 14:01:45         at org.codehaus.groovy.runtime.DefaultGroovyMethods.each(DefaultGroovyMethods.java:2125)
17-Oct-2019 14:01:45         at org.codehaus.groovy.runtime.DefaultGroovyMethods.each(DefaultGroovyMethods.java:2110)
17-Oct-2019 14:01:45         at org.codehaus.groovy.runtime.DefaultGroovyMethods.each(DefaultGroovyMethods.java:2151)
17-Oct-2019 14:01:45         at org.codehaus.groovy.runtime.dgm$163.invoke(Unknown Source)
17-Oct-2019 14:01:45         at org.codehaus.groovy.runtime.callsite.PojoMetaMethodSite$PojoMetaMethodSiteNoUnwrapNoCoerce.invoke(PojoMetaMethodSite.java:274)
17-Oct-2019 14:01:45         at org.codehaus.groovy.runtime.callsite.PojoMetaMethodSite.call(PojoMetaMethodSite.java:56)
17-Oct-2019 14:01:45         at org.codehaus.groovy.runtime.callsite.CallSiteArray.defaultCall(CallSiteArray.java:47)
17-Oct-2019 14:01:45         at org.codehaus.groovy.runtime.callsite.AbstractCallSite.call(AbstractCallSite.java:116)
17-Oct-2019 14:01:45         at org.codehaus.groovy.runtime.callsite.AbstractCallSite.call(AbstractCallSite.java:128)
17-Oct-2019 14:01:45         at com.github.jengelman.gradle.plugins.shadow.tasks.ShadowCopyAction$StreamAction.processArchive(ShadowCopyAction.groovy:202)
17-Oct-2019 14:01:45         at sun.reflect.NativeMethodAccessorImpl.invoke0(Native Method)
17-Oct-2019 14:01:45         at sun.reflect.NativeMethodAccessorImpl.invoke(NativeMethodAccessorImpl.java:62)
17-Oct-2019 14:01:45         at sun.reflect.DelegatingMethodAccessorImpl.invoke(DelegatingMethodAccessorImpl.java:43)
17-Oct-2019 14:01:45         at java.lang.reflect.Method.invoke(Method.java:498)
17-Oct-2019 14:01:45         at org.codehaus.groovy.runtime.callsite.PogoMetaMethodSite$PogoCachedMethodSiteNoUnwrapNoCoerce.invoke(PogoMetaMethodSite.java:210)
17-Oct-2019 14:01:45         at org.codehaus.groovy.runtime.callsite.PogoMetaMethodSite.callCurrent(PogoMetaMethodSite.java:59)
17-Oct-2019 14:01:45         at org.codehaus.groovy.runtime.callsite.CallSiteArray.defaultCallCurrent(CallSiteArray.java:51)
17-Oct-2019 14:01:45         at org.codehaus.groovy.runtime.callsite.AbstractCallSite.callCurrent(AbstractCallSite.java:157)
17-Oct-2019 14:01:45         at org.codehaus.groovy.runtime.callsite.AbstractCallSite.callCurrent(AbstractCallSite.java:169)
17-Oct-2019 14:01:45         at com.github.jengelman.gradle.plugins.shadow.tasks.ShadowCopyAction$StreamAction.visitFile(ShadowCopyAction.groovy:188)
17-Oct-2019 14:01:45         at sun.reflect.GeneratedMethodAccessor278.invoke(Unknown Source)
17-Oct-2019 14:01:45         at sun.reflect.DelegatingMethodAccessorImpl.invoke(DelegatingMethodAccessorImpl.java:43)
17-Oct-2019 14:01:45         at java.lang.reflect.Method.invoke(Method.java:498)
17-Oct-2019 14:01:45         at org.codehaus.groovy.runtime.callsite.PogoMetaMethodSite$PogoCachedMethodSiteNoUnwrapNoCoerce.invoke(PogoMetaMethodSite.java:210)
17-Oct-2019 14:01:45         at org.codehaus.groovy.runtime.callsite.PogoMetaMethodSite.callCurrent(PogoMetaMethodSite.java:59)
17-Oct-2019 14:01:45         at org.codehaus.groovy.runtime.callsite.AbstractCallSite.callCurrent(AbstractCallSite.java:169)
17-Oct-2019 14:01:45         at com.github.jengelman.gradle.plugins.shadow.tasks.ShadowCopyAction$StreamAction.processFile(ShadowCopyAction.groovy:151)
17-Oct-2019 14:01:45         at org.gradle.api.internal.file.copy.NormalizingCopyActionDecorator$1$1.processFile(NormalizingCopyActionDecorator.java:66)
17-Oct-2019 14:01:45         at org.gradle.api.internal.file.copy.DuplicateHandlingCopyActionDecorator$1$1.processFile(DuplicateHandlingCopyActionDecorator.java:60)
17-Oct-2019 14:01:45         at org.gradle.api.internal.file.copy.CopyFileVisitorImpl.processFile(CopyFileVisitorImpl.java:62)
17-Oct-2019 14:01:45         at org.gradle.api.internal.file.copy.CopyFileVisitorImpl.visitFile(CopyFileVisitorImpl.java:46)
17-Oct-2019 14:01:45         at org.gradle.api.internal.file.AbstractFileTree$FilteredFileTreeImpl$1.visitFile(AbstractFileTree.java:198)
17-Oct-2019 14:01:45         at org.gradle.api.internal.file.collections.SingletonFileTree.visit(SingletonFileTree.java:42)
17-Oct-2019 14:01:45         at org.gradle.api.internal.file.collections.FileTreeAdapter.visit(FileTreeAdapter.java:117)
17-Oct-2019 14:01:45         at org.gradle.api.internal.file.AbstractFileTree$FilteredFileTreeImpl.visit(AbstractFileTree.java:189)
17-Oct-2019 14:01:45         at org.gradle.api.internal.file.CompositeFileTree.visit(CompositeFileTree.java:93)
17-Oct-2019 14:01:45         at org.gradle.api.internal.file.copy.CopySpecActionImpl.execute(CopySpecActionImpl.java:39)
17-Oct-2019 14:01:45         at org.gradle.api.internal.file.copy.CopySpecActionImpl.execute(CopySpecActionImpl.java:24)
17-Oct-2019 14:01:45         at org.gradle.api.internal.file.copy.DefaultCopySpec$DefaultCopySpecResolver.walk(DefaultCopySpec.java:707)
17-Oct-2019 14:01:45         at org.gradle.api.internal.file.copy.DefaultCopySpec$DefaultCopySpecResolver.walk(DefaultCopySpec.java:709)
17-Oct-2019 14:01:45         at org.gradle.api.internal.file.copy.DefaultCopySpec.walk(DefaultCopySpec.java:513)
17-Oct-2019 14:01:45         at org.gradle.api.internal.file.copy.CopySpecBackedCopyActionProcessingStream.process(CopySpecBackedCopyActionProcessingStream.java:38)
17-Oct-2019 14:01:45         at org.gradle.api.internal.file.copy.DuplicateHandlingCopyActionDecorator$1.process(DuplicateHandlingCopyActionDecorator.java:44)
17-Oct-2019 14:01:45         at org.gradle.api.internal.file.copy.NormalizingCopyActionDecorator$1.process(NormalizingCopyActionDecorator.java:57)
17-Oct-2019 14:01:45         at org.gradle.api.internal.file.copy.CopyActionProcessingStream$process.call(Unknown Source)
17-Oct-2019 14:01:45         at org.codehaus.groovy.runtime.callsite.CallSiteArray.defaultCall(CallSiteArray.java:47)
17-Oct-2019 14:01:45         at org.codehaus.groovy.runtime.callsite.AbstractCallSite.call(AbstractCallSite.java:116)
17-Oct-2019 14:01:45         at org.codehaus.groovy.runtime.callsite.AbstractCallSite.call(AbstractCallSite.java:128)
17-Oct-2019 14:01:45         at com.github.jengelman.gradle.plugins.shadow.tasks.ShadowCopyAction$1.execute(ShadowCopyAction.groovy:78)
17-Oct-2019 14:01:45         at com.github.jengelman.gradle.plugins.shadow.tasks.ShadowCopyAction$1$execute.call(Unknown Source)
17-Oct-2019 14:01:45         at org.codehaus.groovy.runtime.callsite.CallSiteArray.defaultCall(CallSiteArray.java:47)
17-Oct-2019 14:01:45         at org.codehaus.groovy.runtime.callsite.AbstractCallSite.call(AbstractCallSite.java:116)
17-Oct-2019 14:01:45         at org.codehaus.groovy.runtime.callsite.AbstractCallSite.call(AbstractCallSite.java:128)
17-Oct-2019 14:01:45         at com.github.jengelman.gradle.plugins.shadow.tasks.ShadowCopyAction.withResource(ShadowCopyAction.groovy:109)
17-Oct-2019 14:01:45         at sun.reflect.NativeMethodAccessorImpl.invoke0(Native Method)
17-Oct-2019 14:01:45         at sun.reflect.NativeMethodAccessorImpl.invoke(NativeMethodAccessorImpl.java:62)
17-Oct-2019 14:01:45         at sun.reflect.DelegatingMethodAccessorImpl.invoke(DelegatingMethodAccessorImpl.java:43)
17-Oct-2019 14:01:45         at java.lang.reflect.Method.invoke(Method.java:498)
17-Oct-2019 14:01:45         at org.codehaus.groovy.reflection.CachedMethod.invoke(CachedMethod.java:98)
17-Oct-2019 14:01:45         at org.codehaus.groovy.runtime.callsite.StaticMetaMethodSite$StaticMetaMethodSiteNoUnwrapNoCoerce.invoke(StaticMetaMethodSite.java:151)
17-Oct-2019 14:01:45
17-Oct-2019 14:01:45 Deprecated Gradle features were used in this build, making it incompatible with Gradle 5.0.
17-Oct-2019 14:01:45 Use '--warning-mode all' to show the individual deprecation warnings.
17-Oct-2019 14:01:45         at org.codehaus.groovy.runtime.callsite.StaticMetaMethodSite.callStatic(StaticMetaMethodSite.java:102)
17-Oct-2019 14:01:45 See https://docs.gradle.org/4.10/userguide/command_line_interface.html#sec:command_line_warnings
17-Oct-2019 14:01:45         at org.codehaus.groovy.runtime.callsite.CallSiteArray.defaultCallStatic(CallSiteArray.java:55)
17-Oct-2019 14:01:45         at org.codehaus.groovy.runtime.callsite.AbstractCallSite.callStatic(AbstractCallSite.java:197)
17-Oct-2019 14:01:45 47 actionable tasks: 16 executed, 31 up-to-date
17-Oct-2019 14:01:45         at org.codehaus.groovy.runtime.callsite.AbstractCallSite.callStatic(AbstractCallSite.java:217)
17-Oct-2019 14:01:45         at com.github.jengelman.gradle.plugins.shadow.tasks.ShadowCopyAction.execute(ShadowCopyAction.groovy:75)
17-Oct-2019 14:01:45         at org.gradle.api.internal.file.copy.NormalizingCopyActionDecorator.execute(NormalizingCopyActionDecorator.java:53)
17-Oct-2019 14:01:45         at org.gradle.api.internal.file.copy.DuplicateHandlingCopyActionDecorator.execute(DuplicateHandlingCopyActionDecorator.java:42)
17-Oct-2019 14:01:45         at org.gradle.api.internal.file.copy.CopyActionExecuter.execute(CopyActionExecuter.java:40)
17-Oct-2019 14:01:45         at org.gradle.api.tasks.AbstractCopyTask.copy(AbstractCopyTask.java:179)
17-Oct-2019 14:01:45         at com.github.jengelman.gradle.plugins.shadow.tasks.ShadowJar.copy(ShadowJar.java:70)
17-Oct-2019 14:01:45         at sun.reflect.NativeMethodAccessorImpl.invoke0(Native Method)
17-Oct-2019 14:01:45         at sun.reflect.NativeMethodAccessorImpl.invoke(NativeMethodAccessorImpl.java:62)
17-Oct-2019 14:01:45         at sun.reflect.DelegatingMethodAccessorImpl.invoke(DelegatingMethodAccessorImpl.java:43)
17-Oct-2019 14:01:45         at java.lang.reflect.Method.invoke(Method.java:498)
17-Oct-2019 14:01:45         at org.gradle.internal.reflect.JavaMethod.invoke(JavaMethod.java:73)
17-Oct-2019 14:01:45         at org.gradle.api.internal.project.taskfactory.StandardTaskAction.doExecute(StandardTaskAction.java:46)
17-Oct-2019 14:01:45         at org.gradle.api.internal.project.taskfactory.StandardTaskAction.execute(StandardTaskAction.java:39)
17-Oct-2019 14:01:45         at org.gradle.api.internal.project.taskfactory.StandardTaskAction.execute(StandardTaskAction.java:26)
17-Oct-2019 14:01:45         at org.gradle.api.internal.AbstractTask$TaskActionWrapper.execute(AbstractTask.java:801)
17-Oct-2019 14:01:45         at org.gradle.api.internal.AbstractTask$TaskActionWrapper.execute(AbstractTask.java:768)
17-Oct-2019 14:01:45         at org.gradle.api.internal.tasks.execution.ExecuteActionsTaskExecuter$1.run(ExecuteActionsTaskExecuter.java:131)
17-Oct-2019 14:01:45         at org.gradle.internal.operations.DefaultBuildOperationExecutor$RunnableBuildOperationWorker.execute(DefaultBuildOperationExecutor.java:300)
17-Oct-2019 14:01:45         at org.gradle.internal.operations.DefaultBuildOperationExecutor$RunnableBuildOperationWorker.execute(DefaultBuildOperationExecutor.java:292)
17-Oct-2019 14:01:45         at org.gradle.internal.operations.DefaultBuildOperationExecutor.execute(DefaultBuildOperationExecutor.java:174)
17-Oct-2019 14:01:45         at org.gradle.internal.operations.DefaultBuildOperationExecutor.run(DefaultBuildOperationExecutor.java:90)
17-Oct-2019 14:01:45         at org.gradle.internal.operations.DelegatingBuildOperationExecutor.run(DelegatingBuildOperationExecutor.java:31)
17-Oct-2019 14:01:45         at org.gradle.api.internal.tasks.execution.ExecuteActionsTaskExecuter.executeAction(ExecuteActionsTaskExecuter.java:120)
17-Oct-2019 14:01:45         at org.gradle.api.internal.tasks.execution.ExecuteActionsTaskExecuter.executeActions(ExecuteActionsTaskExecuter.java:99)
17-Oct-2019 14:01:45         at org.gradle.api.internal.tasks.execution.ExecuteActionsTaskExecuter.execute(ExecuteActionsTaskExecuter.java:77)
17-Oct-2019 14:01:45         at org.gradle.api.internal.tasks.execution.OutputDirectoryCreatingTaskExecuter.execute(OutputDirectoryCreatingTaskExecuter.java:51)
17-Oct-2019 14:01:45         at org.gradle.api.internal.tasks.execution.SkipUpToDateTaskExecuter.execute(SkipUpToDateTaskExecuter.java:59)
17-Oct-2019 14:01:45         at org.gradle.api.internal.tasks.execution.ResolveTaskOutputCachingStateExecuter.execute(ResolveTaskOutputCachingStateExecuter.java:54)
17-Oct-2019 14:01:45         at org.gradle.api.internal.tasks.execution.ValidatingTaskExecuter.execute(ValidatingTaskExecuter.java:59)
17-Oct-2019 14:01:45         at org.gradle.api.internal.tasks.execution.SkipEmptySourceFilesTaskExecuter.execute(SkipEmptySourceFilesTaskExecuter.java:101)
17-Oct-2019 14:01:45         at org.gradle.api.internal.tasks.execution.FinalizeInputFilePropertiesTaskExecuter.execute(FinalizeInputFilePropertiesTaskExecuter.java:44)
17-Oct-2019 14:01:45         at org.gradle.api.internal.tasks.execution.CleanupStaleOutputsExecuter.execute(CleanupStaleOutputsExecuter.java:91)
17-Oct-2019 14:01:45         at org.gradle.api.internal.tasks.execution.ResolveTaskArtifactStateTaskExecuter.execute(ResolveTaskArtifactStateTaskExecuter.java:62)
17-Oct-2019 14:01:45         at org.gradle.api.internal.tasks.execution.SkipTaskWithNoActionsExecuter.execute(SkipTaskWithNoActionsExecuter.java:59)
17-Oct-2019 14:01:45         at org.gradle.api.internal.tasks.execution.SkipOnlyIfTaskExecuter.execute(SkipOnlyIfTaskExecuter.java:54)
17-Oct-2019 14:01:45         at org.gradle.api.internal.tasks.execution.ExecuteAtMostOnceTaskExecuter.execute(ExecuteAtMostOnceTaskExecuter.java:43)
17-Oct-2019 14:01:45         at org.gradle.api.internal.tasks.execution.CatchExceptionTaskExecuter.execute(CatchExceptionTaskExecuter.java:34)
17-Oct-2019 14:01:45         at org.gradle.api.internal.tasks.execution.EventFiringTaskExecuter$1.run(EventFiringTaskExecuter.java:51)
17-Oct-2019 14:01:45         at org.gradle.internal.operations.DefaultBuildOperationExecutor$RunnableBuildOperationWorker.execute(DefaultBuildOperationExecutor.java:300)
17-Oct-2019 14:01:45         at org.gradle.internal.operations.DefaultBuildOperationExecutor$RunnableBuildOperationWorker.execute(DefaultBuildOperationExecutor.java:292)
17-Oct-2019 14:01:45         at org.gradle.internal.operations.DefaultBuildOperationExecutor.execute(DefaultBuildOperationExecutor.java:174)
17-Oct-2019 14:01:45         at org.gradle.internal.operations.DefaultBuildOperationExecutor.run(DefaultBuildOperationExecutor.java:90)
17-Oct-2019 14:01:45         at org.gradle.internal.operations.DelegatingBuildOperationExecutor.run(DelegatingBuildOperationExecutor.java:31)
17-Oct-2019 14:01:45         at org.gradle.api.internal.tasks.execution.EventFiringTaskExecuter.execute(EventFiringTaskExecuter.java:46)
17-Oct-2019 14:01:45         at org.gradle.execution.taskgraph.LocalTaskInfoExecutor.execute(LocalTaskInfoExecutor.java:42)
17-Oct-2019 14:01:45         at org.gradle.execution.taskgraph.DefaultTaskExecutionGraph$BuildOperationAwareWorkItemExecutor.execute(DefaultTaskExecutionGraph.java:277)
17-Oct-2019 14:01:45         at org.gradle.execution.taskgraph.DefaultTaskExecutionGraph$BuildOperationAwareWorkItemExecutor.execute(DefaultTaskExecutionGraph.java:262)
17-Oct-2019 14:01:45         at org.gradle.execution.taskgraph.DefaultTaskPlanExecutor$ExecutorWorker$1.execute(DefaultTaskPlanExecutor.java:135)
17-Oct-2019 14:01:45         at org.gradle.execution.taskgraph.DefaultTaskPlanExecutor$ExecutorWorker$1.execute(DefaultTaskPlanExecutor.java:130)
17-Oct-2019 14:01:45         at org.gradle.execution.taskgraph.DefaultTaskPlanExecutor$ExecutorWorker.execute(DefaultTaskPlanExecutor.java:200)
17-Oct-2019 14:01:45         at org.gradle.execution.taskgraph.DefaultTaskPlanExecutor$ExecutorWorker.executeWithWork(DefaultTaskPlanExecutor.java:191)
17-Oct-2019 14:01:45         at org.gradle.execution.taskgraph.DefaultTaskPlanExecutor$ExecutorWorker.run(DefaultTaskPlanExecutor.java:130)
17-Oct-2019 14:01:45         at org.gradle.internal.concurrent.ExecutorPolicy$CatchAndRecordFailures.onExecute(ExecutorPolicy.java:63)
17-Oct-2019 14:01:45         at org.gradle.internal.concurrent.ManagedExecutorImpl$1.run(ManagedExecutorImpl.java:46)
17-Oct-2019 14:01:45         at java.util.concurrent.ThreadPoolExecutor.runWorker(ThreadPoolExecutor.java:1149)
17-Oct-2019 14:01:45         at java.util.concurrent.ThreadPoolExecutor$Worker.run(ThreadPoolExecutor.java:624)
17-Oct-2019 14:01:45         at org.gradle.internal.concurrent.ThreadFactoryImpl$ManagedThreadRunnable.run(ThreadFactoryImpl.java:55)
17-Oct-2019 14:01:45         at java.lang.Thread.run(Thread.java:748)
17-Oct-2019 14:01:45
17-Oct-2019 14:01:45 FAILURE: Build failed with an exception.
17-Oct-2019 14:01:45
17-Oct-2019 14:01:45 * What went wrong:
17-Oct-2019 14:01:45 Execution failed for task ':spring-cloud-cloudfoundry-connector:shadowJar'.
17-Oct-2019 14:01:45 > java.lang.IllegalArgumentException (no error message)
17-Oct-2019 14:01:45
17-Oct-2019 14:01:45 * Try:
17-Oct-2019 14:01:45 Run with --stacktrace option to get the stack trace. Run with --info or --debug option to get more log output. Run with --scan to get full insights.
17-Oct-2019 14:01:45
17-Oct-2019 14:01:45 * Get more help at https://help.gradle.org
17-Oct-2019 14:01:45
17-Oct-2019 14:01:45 BUILD FAILED in 37s
17-Oct-2019 14:01:45
17-Oct-2019 14:01:45 Failing task since return code of [./gradlew clean matrixTests test build dist -I /tmp/artifactory.init.script8018729136781532307gradle -DbuildInfoConfig.propertiesFile=/tmp/buildinfo1958633005934409342properties artifactoryPublish -Dartifactory.resolve.password=******** -Dartifactory.publish.password=********] was 1 while expected 0
17-Oct-2019 14:01:45 Parsing test results under /opt/bamboo-home/xml-data/build-dir/CLOUD-CONNECTORS2-JOB1...
17-Oct-2019 14:01:45 Finished task 'Build' with result: Failed
17-Oct-2019 14:01:45 Running post build plugin 'Docker Container Cleanup'
17-Oct-2019 14:01:45 Running post build plugin 'NCover Results Collector'
17-Oct-2019 14:01:45 Running post build plugin 'Artifactory Release Management Staging'
17-Oct-2019 14:01:45 Running post build plugin 'Artifactory Build Info Copier'
17-Oct-2019 14:01:45 Running post build plugin 'Artifactory Gradle Properties Info Copier'
17-Oct-2019 14:01:45 Running post build plugin 'Clover Results Collector'
17-Oct-2019 14:01:45 Running post build plugin 'npm Cache Cleanup'
17-Oct-2019 14:01:45 Running post build plugin 'Artifact Copier'
17-Oct-2019 14:01:45 Publishing an artifact: Test Results
17-Oct-2019 14:01:45 Finished publishing of artifact Non required job artifact: [Test Results], pattern: [*/build/reports/tests/**/*.*] in 48.06 ms
17-Oct-2019 14:01:45 Finalising the build...
17-Oct-2019 14:01:45 Stopping timer.
17-Oct-2019 14:01:45 Build CLOUD-CONNECTORS2-JOB1-82 completed.
17-Oct-2019 14:01:45 Running on server: post build plugin 'NCover Results Collector'
17-Oct-2019 14:01:45 Running on server: post build plugin 'Build Hanging Detection Configuration'
17-Oct-2019 14:01:45 Running on server: post build plugin 'Bamboo project link creator'
17-Oct-2019 14:01:45 Running on server: post build plugin 'Clover Delta Calculator'
17-Oct-2019 14:01:45 Running on server: post build plugin 'Maven Dependencies Postprocessor'
17-Oct-2019 14:01:45 All post build plugins have finished
17-Oct-2019 14:01:45 Generating build results summary...
17-Oct-2019 14:01:46 Saving build results to disk...
17-Oct-2019 14:01:46 Logging substituted variables...
17-Oct-2019 14:01:46 Indexing build results...
17-Oct-2019 14:01:46 Finished building CLOUD-CONNECTORS2-JOB1-82.