Build: #115 failed Manual run by Roy Clarkson

Build result summary

Details

Completed
Duration
2 minutes
Labels
None
Revision
cfaa14ab971173524c5d3d0a91a8841781cb34e0 cfaa14ab971173524c5d3d0a91a8841781cb34e0
Total tests
249
No failed test found. A possible compilation error occurred.

Tests

  • 0 New failures
  • 0 Existing failures
  • 0 Fixed

Responsible

Code commits

Author Commit Message Commit date
Roy Clarkson Roy Clarkson cfaa14ab971173524c5d3d0a91a8841781cb34e0 cfaa14ab971173524c5d3d0a91a8841781cb34e0 Upgrade to Spring Framework 5.2.11.RELEASE
Gareth Clay <gclay@pivotal.io> Gareth Clay <[email protected]> 422a97dfc5bd50d870b27d00b1df3594e22d5510 422a97dfc5bd50d870b27d00b1df3594e22d5510 Bump to SCOSB 3.2.0 and Spring Boot 2.3.6.RELEASE
Gareth Clay <gclay@pivotal.io> Gareth Clay <[email protected]> f404c9cd28f11a9cbf79c1d70c6ee0625b82e865 f404c9cd28f11a9cbf79c1d70c6ee0625b82e865 1.2.0-SNAPSHOT
* Bump to 1.2.0-SNAPSHOT in preparation for release
* Bump to SCOSB 3.2.0-RC1

Using new Spring versioning scheme:
https://spring.io/blog/2020/04/30/updates-to-spring-versions

closes #385
Gareth Clay <gclay@pivotal.io> Gareth Clay <[email protected]> ec101addfe67a390cf071aa2cfdd9cbc9aa61bc9 ec101addfe67a390cf071aa2cfdd9cbc9aa61bc9 Dependency bumps
* BlockHound 1.0.4.RELEASE
* Checkstyle 8.37
* PMD 6.29.0
* Spring Boot 2.3.5.RELEASE
* Spring Framework 5.2.10.RELEASE
* Wiremock 2.27.2

Also:
* Fix PMD errors detected by new version
* Fix a flake due to aggressive awaitility timeouts
Gareth Clay <gclay@pivotal.io> Gareth Clay <[email protected]> 9f25fb53b6d3483e62ae3a6aa0c571faaf52dd6a 9f25fb53b6d3483e62ae3a6aa0c571faaf52dd6a Dependency bumps
* BlockHound 1.0.4.RELEASE
* Checkstyle 8.37
* PMD 6.29.0
* Spring Boot 2.3.5.RELEASE
* Spring Framework 5.2.10.RELEASE
* Wiremock 2.27.2

Configuration changes

Plan configuration has changed since the last successful build. See the plan audit log for more details.

Error summary for Default Job

The job generated some errors, drill down into the full build log for more details.


FAILURE: Build failed with an exception.

* What went wrong:
Execution failed for task ':artifactoryDeploy'.
> java.util.concurrent.ExecutionException: org.gradle.api.GradleException: File '/opt/bamboo-home/xml-data/build-dir/CLOUD-SCAB-JOB1/build/distributions/spring-cloud-app-broker-copySpec-1.2.0-SNAPSHOT.zip' does not exists, and need to be published!

* Try:
Run with --stacktrace option to get the stack trace. Run with --info or --debug option to get more log output. Run with --scan to get full insights.

* Get more help at https://help.gradle.org

BUILD FAILED in 2m 20s