Build: #117 failed Manual run by Roy Clarkson

Build result summary

Details

Completed
Duration
2 minutes
Labels
None
Agent
bamboo-23.af.pivotal.io
Revision
cfaa14ab971173524c5d3d0a91a8841781cb34e0 cfaa14ab971173524c5d3d0a91a8841781cb34e0
Total tests
249
Failing since
#115 (Manual run by Roy Clarkson)
No failed test found. A possible compilation error occurred.

Tests

  • 0 New failures
  • 0 Existing failures
  • 0 Fixed

Responsible

Configuration changes

Plan configuration has changed since the last successful build. See the plan audit log for more details.

Error summary for Default Job

The job generated some errors, drill down into the full build log for more details.


FAILURE: Build failed with an exception.

* What went wrong:
Execution failed for task ':artifactoryDeploy'.
> java.util.concurrent.ExecutionException: org.gradle.api.GradleException: File '/opt/bamboo-home/xml-data/build-dir/CLOUD-SCAB-JOB1/build/distributions/spring-cloud-app-broker-copySpec-1.2.0-SNAPSHOT.zip' does not exists, and need to be published!

* Try:
Run with --stacktrace option to get the stack trace. Run with --info or --debug option to get more log output. Run with --scan to get full insights.

* Get more help at https://help.gradle.org

BUILD FAILED in 2m 23s