Build: #10 failed Changes by Peter Tran <ptran@pivotal.io>

Build result summary

Details

Completed
Duration
1 minute
Labels
None
Revision
b2014a3582e8e2e682fb0e76ecee78cfc558f174 b2014a3582e8e2e682fb0e76ecee78cfc558f174
Total tests
26
No failed test found. A possible compilation error occurred.

Tests

  • 0 New failures
  • 0 Existing failures
  • 0 Fixed

Responsible

No one has taken responsibility for this failure

Code commits

Author Commit Message Commit date
Peter Tran <ptran@pivotal.io> Peter Tran <ptran@pivotal.io> b2014a3582e8e2e682fb0e76ecee78cfc558f174 b2014a3582e8e2e682fb0e76ecee78cfc558f174 Adds notes for v1.1.x
- it is now changed from getUsername to getDevUsername

[#134659931]

Signed-off-by: Brenda Chan <brchan@pivotal.io>

Error summary for Default Job

The job generated some errors, drill down into the full build log for more details.

warning: [options] bootstrap class path not set in conjunction with -source 1.6
1 warning
warning: [options] bootstrap class path not set in conjunction with -source 1.6
1 warning
warning: [options] bootstrap class path not set in conjunction with -source 1.6
1 warning
POM relocation to an other version number is not fully supported in Gradle : xml-apis#xml-apis;2.0.2 relocated to xml-apis#xml-apis;1.0.b2.
warning: [options] bootstrap class path not set in conjunction with -source 1.6
1 warning

FAILURE: Build failed with an exception.

* What went wrong:
Execution failed for task ':artifactoryPublish'.
> java.io.IOException: Failed to deploy file. Status code: 409 Response message: Artifactory returned the following errors:
  The repository 'libs-snapshot-local' rejected the resolution of an artifact 'libs-snapshot-local:io/pivotal/spring/cloud/spring-cloud-gemfire-cloudfoundry-connector/1.0.0.RELEASE/spring-cloud-gemfire-cloudfoundry-connector-1.0.0.RELEASE-javadoc.jar' due to conflict in the snapshot release handling policy. Status code: 409

* Try:
Run with --info or --debug option to get more log output.

* Exception is:
org.gradle.api.tasks.TaskExecutionException: Execution failed for task ':artifactoryPublish'.
        at org.gradle.api.internal.tasks.execution.ExecuteActionsTaskExecuter.executeActions(ExecuteActionsTaskExecuter.java:69)
        at org.gradle.api.internal.tasks.execution.ExecuteActionsTaskExecuter.execute(ExecuteActionsTaskExecuter.java:46)
        at org.gradle.api.internal.tasks.execution.PostExecutionAnalysisTaskExecuter.execute(PostExecutionAnalysisTaskExecuter.java:35)
        at org.gradle.api.internal.tasks.execution.SkipUpToDateTaskExecuter.execute(SkipUpToDateTaskExecuter.java:64)
        at org.gradle.api.internal.tasks.execution.ValidatingTaskExecuter.execute(ValidatingTaskExecuter.java:58)
        at org.gradle.api.internal.tasks.execution.SkipEmptySourceFilesTaskExecuter.execute(SkipEmptySourceFilesTaskExecuter.java:42)
        at org.gradle.api.internal.tasks.execution.SkipTaskWithNoActionsExecuter.execute(SkipTaskWithNoActionsExecuter.java:52)
        at org.gradle.api.internal.tasks.execution.SkipOnlyIfTaskExecuter.execute(SkipOnlyIfTaskExecuter.java:53)
        at org.gradle.api.internal.tasks.execution.ExecuteAtMostOnceTaskExecuter.execute(ExecuteAtMostOnceTaskExecuter.java:43)
        at org.gradle.api.internal.AbstractTask.executeWithoutThrowingTaskFailure(AbstractTask.java:310)
        at org.gradle.execution.taskgraph.AbstractTaskPlanExecutor$TaskExecutorWorker.executeTask(AbstractTaskPlanExecutor.java:79)
        at org.gradle.execution.taskgraph.AbstractTaskPlanExecutor$TaskExecutorWorker.processTask(AbstractTaskPlanExecutor.java:63)
        at org.gradle.execution.taskgraph.AbstractTaskPlanExecutor$TaskExecutorWorker.run(AbstractTaskPlanExecutor.java:51)
        at org.gradle.execution.taskgraph.DefaultTaskPlanExecutor.process(DefaultTaskPlanExecutor.java:23)
        at org.gradle.execution.taskgraph.DefaultTaskGraphExecuter.execute(DefaultTaskGraphExecuter.java:88)
        at org.gradle.execution.SelectedTaskExecutionAction.execute(SelectedTaskExecutionAction.java:37)
        at org.gradle.execution.DefaultBuildExecuter.execute(DefaultBuildExecuter.java:62)
        at org.gradle.execution.DefaultBuildExecuter.access$200(DefaultBuildExecuter.java:23)
        at org.gradle.execution.DefaultBuildExecuter$2.proceed(DefaultBuildExecuter.java:68)
        at org.gradle.execution.DryRunBuildExecutionAction.execute(DryRunBuildExecutionAction.java:32)
        at org.gradle.execution.DefaultBuildExecuter.execute(DefaultBuildExecuter.java:62)
        at org.gradle.execution.DefaultBuildExecuter.execute(DefaultBuildExecuter.java:55)
        at org.gradle.initialization.DefaultGradleLauncher.doBuildStages(DefaultGradleLauncher.java:149)
        at org.gradle.initialization.DefaultGradleLauncher.doBuild(DefaultGradleLauncher.java:106)
        at org.gradle.initialization.DefaultGradleLauncher.run(DefaultGradleLauncher.java:86)
        at org.gradle.launcher.exec.InProcessBuildActionExecuter$DefaultBuildController.run(InProcessBuildActionExecuter.java:90)
        at org.gradle.tooling.internal.provider.ExecuteBuildActionRunner.run(ExecuteBuildActionRunner.java:28)
        at org.gradle.launcher.exec.ChainingBuildActionRunner.run(ChainingBuildActionRunner.java:35)
        at org.gradle.launcher.exec.InProcessBuildActionExecuter.execute(InProcessBuildActionExecuter.java:41)
        at org.gradle.launcher.exec.InProcessBuildActionExecuter.execute(InProcessBuildActionExecuter.java:28)
        at org.gradle.launcher.exec.DaemonUsageSuggestingBuildActionExecuter.execute(DaemonUsageSuggestingBuildActionExecuter.java:50)
        at org.gradle.launcher.exec.DaemonUsageSuggestingBuildActionExecuter.execute(DaemonUsageSuggestingBuildActionExecuter.java:27)
        at org.gradle.launcher.cli.RunBuildAction.run(RunBuildAction.java:40)
        at org.gradle.internal.Actions$RunnableActionAdapter.execute(Actions.java:169)
        at org.gradle.launcher.cli.CommandLineActionFactory$ParseAndBuildAction.execute(CommandLineActionFactory.java:237)
        at org.gradle.launcher.cli.CommandLineActionFactory$ParseAndBuildAction.execute(CommandLineActionFactory.java:210)
        at org.gradle.launcher.cli.JavaRuntimeValidationAction.execute(JavaRuntimeValidationAction.java:35)
        at org.gradle.launcher.cli.JavaRuntimeValidationAction.execute(JavaRuntimeValidationAction.java:24)
        at org.gradle.launcher.cli.CommandLineActionFactory$WithLogging.execute(CommandLineActionFactory.java:206)
        at org.gradle.launcher.cli.CommandLineActionFactory$WithLogging.execute(CommandLineActionFactory.java:169)
        at org.gradle.launcher.cli.ExceptionReportingAction.execute(ExceptionReportingAction.java:33)
        at org.gradle.launcher.cli.ExceptionReportingAction.execute(ExceptionReportingAction.java:22)
        at org.gradle.launcher.Main.doAction(Main.java:33)
        at org.gradle.launcher.bootstrap.EntryPoint.run(EntryPoint.java:45)
        at org.gradle.launcher.bootstrap.ProcessBootstrap.runNoExit(ProcessBootstrap.java:54)
        at org.gradle.launcher.bootstrap.ProcessBootstrap.run(ProcessBootstrap.java:35)
        at org.gradle.launcher.GradleMain.main(GradleMain.java:23)
        at org.gradle.wrapper.BootstrapMainStarter.start(BootstrapMainStarter.java:30)
        at org.gradle.wrapper.WrapperExecutor.execute(WrapperExecutor.java:127)
        at org.gradle.wrapper.GradleWrapperMain.main(GradleWrapperMain.java:61)
Caused by: org.gradle.api.UncheckedIOException: java.io.IOException: Failed to deploy file. Status code: 409 Response message: Artifactory returned the following errors:
The repository 'libs-snapshot-local' rejected the resolution of an artifact 'libs-snapshot-local:io/pivotal/spring/cloud/spring-cloud-gemfire-cloudfoundry-connector/1.0.0.RELEASE/spring-cloud-gemfire-cloudfoundry-connector-1.0.0.RELEASE-javadoc.jar' due to conflict in the snapshot release handling policy. Status code: 409
        at org.gradle.internal.UncheckedException.throwAsUncheckedException(UncheckedException.java:43)
        at org.gradle.internal.reflect.JavaMethod.invoke(JavaMethod.java:78)
        at org.gradle.api.internal.project.taskfactory.AnnotationProcessingTaskFactory$StandardTaskAction.doExecute(AnnotationProcessingTaskFactory.java:226)
        at org.gradle.api.internal.project.taskfactory.AnnotationProcessingTaskFactory$StandardTaskAction.execute(AnnotationProcessingTaskFactory.java:219)
        at org.gradle.api.internal.project.taskfactory.AnnotationProcessingTaskFactory$StandardTaskAction.execute(AnnotationProcessingTaskFactory.java:208)
        at org.gradle.api.internal.AbstractTask$TaskActionWrapper.execute(AbstractTask.java:589)
        at org.gradle.api.internal.AbstractTask$TaskActionWrapper.execute(AbstractTask.java:572)
        at org.gradle.api.internal.tasks.execution.ExecuteActionsTaskExecuter.executeAction(ExecuteActionsTaskExecuter.java:80)
        at org.gradle.api.internal.tasks.execution.ExecuteActionsTaskExecuter.executeActions(ExecuteActionsTaskExecuter.java:61)
        ... 49 more
Caused by: java.io.IOException: Failed to deploy file. Status code: 409 Response message: Artifactory returned the following errors:
The repository 'libs-snapshot-local' rejected the resolution of an artifact 'libs-snapshot-local:io/pivotal/spring/cloud/spring-cloud-gemfire-cloudfoundry-connector/1.0.0.RELEASE/spring-cloud-gemfire-cloudfoundry-connector-1.0.0.RELEASE-javadoc.jar' due to conflict in the snapshot release handling policy. Status code: 409
        at org.jfrog.build.extractor.clientConfiguration.client.ArtifactoryBuildInfoClient.uploadFile(ArtifactoryBuildInfoClient.java:600)
        at org.jfrog.build.extractor.clientConfiguration.client.ArtifactoryBuildInfoClient.deployArtifact(ArtifactoryBuildInfoClient.java:313)
        at org.jfrog.gradle.plugin.artifactory.task.BuildInfoBaseTask.deployArtifacts(BuildInfoBaseTask.java:473)
        at org.jfrog.gradle.plugin.artifactory.task.BuildInfoBaseTask.prepareAndDeploy(BuildInfoBaseTask.java:400)
        at org.jfrog.gradle.plugin.artifactory.task.BuildInfoBaseTask.collectProjectBuildInfo(BuildInfoBaseTask.java:123)
        at org.gradle.internal.reflect.JavaMethod.invoke(JavaMethod.java:75)
        ... 56 more