Build: #3299 failed Scheduled

Build result summary

Details

Completed
Duration
1 minute
Labels
None
Agent
bamboo-11.af.pivotal.io
Revision
d28450c523fc9520ff19c4bdf9851c6d46378c4e d28450c523fc9520ff19c4bdf9851c6d46378c4e
Total tests
341
Failing since
#3009 (Scheduled – )

No failed tests found, a possible compilation error occurred.

Responsible

This build has been failing since #3009
No one has taken responsibility

Configuration changes

Plan configuration has changed since the last successful build. See the plan audit log for more details.

Error summary for Default Job

The job generated some errors, drill down into the full build log for more details.

org.springframework.beans.factory.BeanInitializationException: MessageBroker initialization failed; nested exception is java.lang.RuntimeException: failure before startup
        at org.springframework.flex.core.MessageBrokerFactoryBean.afterPropertiesSet(MessageBrokerFactoryBean.java:207)
        at org.springframework.flex.core.AbstractMessageBrokerTests.createMessageBroker(AbstractMessageBrokerTests.java:60)
        at org.springframework.flex.core.AbstractMessageBrokerTests.getMessageBroker(AbstractMessageBrokerTests.java:77)
        at org.springframework.flex.core.MessageBrokerFactoryBeanTests.configProcessorErrorBeforeStartup(MessageBrokerFactoryBeanTests.java:73)
        at sun.reflect.NativeMethodAccessorImpl.invoke0(Native Method)
        at sun.reflect.NativeMethodAccessorImpl.invoke(NativeMethodAccessorImpl.java:57)
        at sun.reflect.DelegatingMethodAccessorImpl.invoke(DelegatingMethodAccessorImpl.java:43)
        at java.lang.reflect.Method.invoke(Method.java:606)
        at org.junit.runners.model.FrameworkMethod$1.runReflectiveCall(FrameworkMethod.java:44)
        at org.junit.internal.runners.model.ReflectiveCallable.run(ReflectiveCallable.java:15)
        at org.junit.runners.model.FrameworkMethod.invokeExplosively(FrameworkMethod.java:41)
        at org.junit.internal.runners.statements.InvokeMethod.evaluate(InvokeMethod.java:20)
        at org.springframework.test.context.junit4.statements.RunBeforeTestMethodCallbacks.evaluate(RunBeforeTestMethodCallbacks.java:75)
        at org.springframework.test.context.junit4.statements.RunAfterTestMethodCallbacks.evaluate(RunAfterTestMethodCallbacks.java:86)
        at org.springframework.test.context.junit4.statements.SpringRepeat.evaluate(SpringRepeat.java:84)
        at org.junit.runners.ParentRunner.runLeaf(ParentRunner.java:263)
        at org.springframework.test.context.junit4.SpringJUnit4ClassRunner.runChild(SpringJUnit4ClassRunner.java:254)
        at org.springframework.test.context.junit4.SpringJUnit4ClassRunner.runChild(SpringJUnit4ClassRunner.java:89)
        at org.junit.runners.ParentRunner$3.run(ParentRunner.java:231)
        at org.junit.runners.ParentRunner$1.schedule(ParentRunner.java:60)
        at org.junit.runners.ParentRunner.runChildren(ParentRunner.java:229)
        at org.junit.runners.ParentRunner.access$000(ParentRunner.java:50)
        at org.junit.runners.ParentRunner$2.evaluate(ParentRunner.java:222)
        at org.springframework.test.context.junit4.statements.RunBeforeTestClassCallbacks.evaluate(RunBeforeTestClassCallbacks.java:61)
        at org.springframework.test.context.junit4.statements.RunAfterTestClassCallbacks.evaluate(RunAfterTestClassCallbacks.java:70)
        at org.junit.runners.ParentRunner.run(ParentRunner.java:292)
        at org.springframework.test.context.junit4.SpringJUnit4ClassRunner.run(SpringJUnit4ClassRunner.java:193)
        at org.apache.maven.surefire.junit4.JUnit4Provider.execute(JUnit4Provider.java:264)
        at org.apache.maven.surefire.junit4.JUnit4Provider.executeTestSet(JUnit4Provider.java:153)
        at org.apache.maven.surefire.junit4.JUnit4Provider.invoke(JUnit4Provider.java:124)
        at org.apache.maven.surefire.booter.ForkedBooter.invokeProviderInSameClassLoader(ForkedBooter.java:200)
        at org.apache.maven.surefire.booter.ForkedBooter.runSuitesInProcess(ForkedBooter.java:153)
        at org.apache.maven.surefire.booter.ForkedBooter.main(ForkedBooter.java:103)
Caused by: java.lang.RuntimeException: failure before startup
        at org.springframework.flex.core.MessageBrokerFactoryBeanTests$BeforeStartupErrorThrowingProcessor.processBeforeStartup(MessageBrokerFactoryBeanTests.java:125)
        at org.springframework.flex.core.MessageBrokerFactoryBean.processBeforeStart(MessageBrokerFactoryBean.java:326)
        at org.springframework.flex.core.MessageBrokerFactoryBean.afterPropertiesSet(MessageBrokerFactoryBean.java:177)
        ... 32 more
org.springframework.beans.factory.BeanInitializationException: MessageBroker initialization failed; nested exception is java.lang.RuntimeException: failure before startup
        at org.springframework.flex.core.MessageBrokerFactoryBean.afterPropertiesSet(MessageBrokerFactoryBean.java:207)
        at org.springframework.flex.core.AbstractMessageBrokerTests.createMessageBroker(AbstractMessageBrokerTests.java:60)
        at org.springframework.flex.core.AbstractMessageBrokerTests.getMessageBroker(AbstractMessageBrokerTests.java:77)
        at org.springframework.flex.core.MessageBrokerFactoryBeanTests.configProcessorErrorAfterStartup(MessageBrokerFactoryBeanTests.java:96)
        at sun.reflect.NativeMethodAccessorImpl.invoke0(Native Method)
        at sun.reflect.NativeMethodAccessorImpl.invoke(NativeMethodAccessorImpl.java:57)
        at sun.reflect.DelegatingMethodAccessorImpl.invoke(DelegatingMethodAccessorImpl.java:43)
        at java.lang.reflect.Method.invoke(Method.java:606)
        at org.junit.runners.model.FrameworkMethod$1.runReflectiveCall(FrameworkMethod.java:44)
        at org.junit.internal.runners.model.ReflectiveCallable.run(ReflectiveCallable.java:15)
        at org.junit.runners.model.FrameworkMethod.invokeExplosively(FrameworkMethod.java:41)
        at org.junit.internal.runners.statements.InvokeMethod.evaluate(InvokeMethod.java:20)
        at org.springframework.test.context.junit4.statements.RunBeforeTestMethodCallbacks.evaluate(RunBeforeTestMethodCallbacks.java:75)
        at org.springframework.test.context.junit4.statements.RunAfterTestMethodCallbacks.evaluate(RunAfterTestMethodCallbacks.java:86)
        at org.springframework.test.context.junit4.statements.SpringRepeat.evaluate(SpringRepeat.java:84)
        at org.junit.runners.ParentRunner.runLeaf(ParentRunner.java:263)
        at org.springframework.test.context.junit4.SpringJUnit4ClassRunner.runChild(SpringJUnit4ClassRunner.java:254)
        at org.springframework.test.context.junit4.SpringJUnit4ClassRunner.runChild(SpringJUnit4ClassRunner.java:89)
        at org.junit.runners.ParentRunner$3.run(ParentRunner.java:231)
        at org.junit.runners.ParentRunner$1.schedule(ParentRunner.java:60)
        at org.junit.runners.ParentRunner.runChildren(ParentRunner.java:229)
        at org.junit.runners.ParentRunner.access$000(ParentRunner.java:50)
        at org.junit.runners.ParentRunner$2.evaluate(ParentRunner.java:222)
        at org.springframework.test.context.junit4.statements.RunBeforeTestClassCallbacks.evaluate(RunBeforeTestClassCallbacks.java:61)
        at org.springframework.test.context.junit4.statements.RunAfterTestClassCallbacks.evaluate(RunAfterTestClassCallbacks.java:70)
        at org.junit.runners.ParentRunner.run(ParentRunner.java:292)
        at org.springframework.test.context.junit4.SpringJUnit4ClassRunner.run(SpringJUnit4ClassRunner.java:193)
        at org.apache.maven.surefire.junit4.JUnit4Provider.execute(JUnit4Provider.java:264)
        at org.apache.maven.surefire.junit4.JUnit4Provider.executeTestSet(JUnit4Provider.java:153)
        at org.apache.maven.surefire.junit4.JUnit4Provider.invoke(JUnit4Provider.java:124)
        at org.apache.maven.surefire.booter.ForkedBooter.invokeProviderInSameClassLoader(ForkedBooter.java:200)
        at org.apache.maven.surefire.booter.ForkedBooter.runSuitesInProcess(ForkedBooter.java:153)
        at org.apache.maven.surefire.booter.ForkedBooter.main(ForkedBooter.java:103)
Caused by: java.lang.RuntimeException: failure before startup
        at org.springframework.flex.core.MessageBrokerFactoryBeanTests$AfterStartupErrorThrowingProcessor.processAfterStartup(MessageBrokerFactoryBeanTests.java:132)
        at org.springframework.flex.core.MessageBrokerFactoryBean.processAfterStart(MessageBrokerFactoryBean.java:319)
        at org.springframework.flex.core.MessageBrokerFactoryBean.afterPropertiesSet(MessageBrokerFactoryBean.java:181)
        ... 32 more