Build: #3299 failed Scheduled

Logs

The following logs have been generated by the jobs in this plan.
  • Expand all
  • Collapse all
Job Logs
Collapse Default Job Default Stage Download or View
11-Jan-2018 02:01:34         at org.jfrog.build.extractor.maven.BuildInfoRecorder.sessionEnded(BuildInfoRecorder.java:182)
11-Jan-2018 02:01:34         at org.apache.maven.lifecycle.internal.DefaultExecutionEventCatapult.fire(DefaultExecutionEventCatapult.java:64)
11-Jan-2018 02:01:34         at org.apache.maven.lifecycle.internal.DefaultExecutionEventCatapult.fire(DefaultExecutionEventCatapult.java:42)
11-Jan-2018 02:01:34         at org.apache.maven.lifecycle.internal.LifecycleStarter.execute(LifecycleStarter.java:170)
11-Jan-2018 02:01:34         at org.apache.maven.DefaultMaven.doExecute(DefaultMaven.java:320)
11-Jan-2018 02:01:34         at org.apache.maven.DefaultMaven.execute(DefaultMaven.java:156)
11-Jan-2018 02:01:34         ... 11 more
11-Jan-2018 02:01:34 Caused by: java.lang.RuntimeException: Error occurred while publishing artifact to Artifactory: /opt/bamboo-home/xml-data/build-dir/FLEX-TRUNKSNAPSHOT-JOB1/target/spring-flex-1.6.0.BUILD-SNAPSHOT-dist.zip.
11-Jan-2018 02:01:34 Skipping deployment of remaining artifacts (if any) and build info.
11-Jan-2018 02:01:34         at org.jfrog.build.extractor.maven.BuildDeploymentHelper.deployArtifacts(BuildDeploymentHelper.java:296)
11-Jan-2018 02:01:34         at org.jfrog.build.extractor.maven.BuildDeploymentHelper.deploy(BuildDeploymentHelper.java:117)
11-Jan-2018 02:01:34         at org.jfrog.build.extractor.maven.BuildInfoRecorder.sessionEnded(BuildInfoRecorder.java:173)
11-Jan-2018 02:01:34         ... 16 more
11-Jan-2018 02:01:34 Caused by: java.io.IOException: Failed to deploy file. Status code: 401 Response message: Artifactory returned the following errors:
11-Jan-2018 02:01:34 Unauthorized Status code: 401
11-Jan-2018 02:01:34         at org.jfrog.build.extractor.clientConfiguration.client.ArtifactoryBuildInfoClient.uploadFile(ArtifactoryBuildInfoClient.java:659)
11-Jan-2018 02:01:34         at org.jfrog.build.extractor.clientConfiguration.client.ArtifactoryBuildInfoClient.deployArtifact(ArtifactoryBuildInfoClient.java:344)
11-Jan-2018 02:01:34         at org.jfrog.build.extractor.maven.BuildDeploymentHelper.deployArtifacts(BuildDeploymentHelper.java:294)
11-Jan-2018 02:01:34         ... 18 more
11-Jan-2018 02:01:34 [ERROR]
11-Jan-2018 02:01:34 [ERROR] To see the full stack trace of the errors, re-run Maven with the -e switch.
11-Jan-2018 02:01:34 [ERROR] Re-run Maven using the -X switch to enable full debug logging.
11-Jan-2018 02:01:34 [ERROR]
11-Jan-2018 02:01:34 [ERROR] For more information about the errors and possible solutions, please read the following articles:
11-Jan-2018 02:01:34 [ERROR] [Help 1] http://cwiki.apache.org/confluence/display/MAVEN/InternalErrorException