Build: #105 failed Changes by Andy Wilkinson

Build result summary

Details

Completed
Duration
42 seconds
Labels
None
Agent
bamboo-11.af.pivotal.io
Revision
aaaece7df6ddab3c52285b9957982a7bd0cc0a26 aaaece7df6ddab3c52285b9957982a7bd0cc0a26
Total tests
41
Failing since
#104 (Changes by Andy Wilkinson)
Fixed in
#106 (Changes by Andy Wilkinson)

Responsible

Code commits

Author Commit Message Commit date
Andy Wilkinson Andy Wilkinson aaaece7df6ddab3c52285b9957982a7bd0cc0a26 aaaece7df6ddab3c52285b9957982a7bd0cc0a26 Polishing

Tests

New test failures 8
Status Test View job Duration
Collapse Failed DependencyVersionMappingCheckTaskIntegrationTests notUpToDateWhenDependenciesChange History
Default Job < 1 sec
java.lang.RuntimeException: java.lang.RuntimeException: org.gradle.testkit.runner.UnexpectedBuildFailure: Unexpected build execution failure in /tmp/junit3807958452377468864/junit5310629545345040364 with arguments [-PpluginClasspath=/opt/bamboo-home/xml-data/build-dir/GRADLEPLUGINS-SPRIO-JOB1/bin,/opt/bamboo-home/xml-data/build-dir/GRADLEPLUGINS-SPRIO-JOB1/build/classes/main,/opt/bamboo-home/xml-data/build-dir/GRADLEPLUGINS-SPRIO-JOB1/build/resources/main,/opt/users/bamboo/.gradle/caches/modules-2/files-2.1/io.spring.gradle/dependency-management-plugin/1.0.3.RELEASE/c7fc988680e19cef9bf91de0c39b891e4c8dca2d/dependency-management-plugin-1.0.3.RELEASE.jar, --stacktrace, -PmanageVerions, dependencyVersionMappingCheck]

Output:

FAILURE: Build failed with an exception.

* Where:
Build file '/tmp/junit3807958452377468864/junit5310629545345040364/build.gradle' line: 11
(409 more lines...)
Collapse Failed DependencyVersionMappingCheckTaskIntegrationTests succeedsWithConfigurationAndManagedVersions History
Default Job < 1 sec
java.lang.RuntimeException: java.lang.RuntimeException: org.gradle.testkit.runner.UnexpectedBuildFailure: Unexpected build execution failure in /tmp/junit1012608340316137881/junit5668770390416476143 with arguments [-PpluginClasspath=/opt/bamboo-home/xml-data/build-dir/GRADLEPLUGINS-SPRIO-JOB1/bin,/opt/bamboo-home/xml-data/build-dir/GRADLEPLUGINS-SPRIO-JOB1/build/classes/main,/opt/bamboo-home/xml-data/build-dir/GRADLEPLUGINS-SPRIO-JOB1/build/resources/main,/opt/users/bamboo/.gradle/caches/modules-2/files-2.1/io.spring.gradle/dependency-management-plugin/1.0.3.RELEASE/c7fc988680e19cef9bf91de0c39b891e4c8dca2d/dependency-management-plugin-1.0.3.RELEASE.jar, --stacktrace, dependencyVersionMappingCheck]

Output:

FAILURE: Build failed with an exception.

* Where:
Build file '/tmp/junit1012608340316137881/junit5668770390416476143/build.gradle' line: 11
(409 more lines...)
Collapse Failed DependencyVersionMappingCheckTaskIntegrationTests notUpToDateWhenFailOnUnmappedDirectChanges History
Default Job < 1 sec
java.lang.RuntimeException: java.lang.RuntimeException: org.gradle.testkit.runner.UnexpectedBuildFailure: Unexpected build execution failure in /tmp/junit2404172176572236692/junit6546397325353338260 with arguments [-PpluginClasspath=/opt/bamboo-home/xml-data/build-dir/GRADLEPLUGINS-SPRIO-JOB1/bin,/opt/bamboo-home/xml-data/build-dir/GRADLEPLUGINS-SPRIO-JOB1/build/classes/main,/opt/bamboo-home/xml-data/build-dir/GRADLEPLUGINS-SPRIO-JOB1/build/resources/main,/opt/users/bamboo/.gradle/caches/modules-2/files-2.1/io.spring.gradle/dependency-management-plugin/1.0.3.RELEASE/c7fc988680e19cef9bf91de0c39b891e4c8dca2d/dependency-management-plugin-1.0.3.RELEASE.jar, --stacktrace, -PfailDirect=true, dependencyVersionMappingCheck]

Output:

FAILURE: Build failed with an exception.

* Where:
Build file '/tmp/junit2404172176572236692/junit6546397325353338260/build.gradle' line: 11
(409 more lines...)
Collapse Failed DependencyVersionMappingCheckTaskIntegrationTests failsWithNoManagedVersions History
Default Job < 1 sec
java.lang.NullPointerException: java.lang.NullPointerException
java.lang.NullPointerException
	at io.spring.gradle.springio.DependencyVersionMappingCheckTaskIntegrationTests.failsWithNoManagedVersions(DependencyVersionMappingCheckTaskIntegrationTests.java:45)
	at sun.reflect.NativeMethodAccessorImpl.invoke0(Native Method)
	at sun.reflect.NativeMethodAccessorImpl.invoke(NativeMethodAccessorImpl.java:62)
	at sun.reflect.DelegatingMethodAccessorImpl.invoke(DelegatingMethodAccessorImpl.java:43)
	at java.lang.reflect.Method.invoke(Method.java:498)
	at org.junit.runners.model.FrameworkMethod$1.runReflectiveCall(FrameworkMethod.java:50)
(44 more lines...)
Collapse Failed DependencyVersionMappingCheckTaskIntegrationTests notUpToDateWhenManagedVersionsChange History
Default Job 3 secs
java.lang.RuntimeException: java.lang.RuntimeException: org.gradle.testkit.runner.UnexpectedBuildFailure: Unexpected build execution failure in /tmp/junit5478001986877292226/junit4571024875257012268 with arguments [-PpluginClasspath=/opt/bamboo-home/xml-data/build-dir/GRADLEPLUGINS-SPRIO-JOB1/bin,/opt/bamboo-home/xml-data/build-dir/GRADLEPLUGINS-SPRIO-JOB1/build/classes/main,/opt/bamboo-home/xml-data/build-dir/GRADLEPLUGINS-SPRIO-JOB1/build/resources/main,/opt/users/bamboo/.gradle/caches/modules-2/files-2.1/io.spring.gradle/dependency-management-plugin/1.0.3.RELEASE/c7fc988680e19cef9bf91de0c39b891e4c8dca2d/dependency-management-plugin-1.0.3.RELEASE.jar, --stacktrace, dependencyVersionMappingCheck]

Output:

FAILURE: Build failed with an exception.

* Where:
Build file '/tmp/junit5478001986877292226/junit4571024875257012268/build.gradle' line: 11
(409 more lines...)
Collapse Failed DependencyVersionMappingCheckTaskIntegrationTests failsWithNoConfiguration History
Default Job < 1 sec
java.lang.NullPointerException: java.lang.NullPointerException
java.lang.NullPointerException
	at io.spring.gradle.springio.DependencyVersionMappingCheckTaskIntegrationTests.failsWithNoConfiguration(DependencyVersionMappingCheckTaskIntegrationTests.java:38)
	at sun.reflect.NativeMethodAccessorImpl.invoke0(Native Method)
	at sun.reflect.NativeMethodAccessorImpl.invoke(NativeMethodAccessorImpl.java:62)
	at sun.reflect.DelegatingMethodAccessorImpl.invoke(DelegatingMethodAccessorImpl.java:43)
	at java.lang.reflect.Method.invoke(Method.java:498)
	at org.junit.runners.model.FrameworkMethod$1.runReflectiveCall(FrameworkMethod.java:50)
(44 more lines...)
Collapse Failed DependencyVersionMappingCheckTaskIntegrationTests notUpToDateWhenFailOnUnmappedTransitiveChanges History
Default Job < 1 sec
java.lang.RuntimeException: java.lang.RuntimeException: org.gradle.testkit.runner.UnexpectedBuildFailure: Unexpected build execution failure in /tmp/junit3172134797098569435/junit4989157864199125289 with arguments [-PpluginClasspath=/opt/bamboo-home/xml-data/build-dir/GRADLEPLUGINS-SPRIO-JOB1/bin,/opt/bamboo-home/xml-data/build-dir/GRADLEPLUGINS-SPRIO-JOB1/build/classes/main,/opt/bamboo-home/xml-data/build-dir/GRADLEPLUGINS-SPRIO-JOB1/build/resources/main,/opt/users/bamboo/.gradle/caches/modules-2/files-2.1/io.spring.gradle/dependency-management-plugin/1.0.3.RELEASE/c7fc988680e19cef9bf91de0c39b891e4c8dca2d/dependency-management-plugin-1.0.3.RELEASE.jar, --stacktrace, -PfailTransitive=false, dependencyVersionMappingCheck]

Output:

FAILURE: Build failed with an exception.

* Where:
Build file '/tmp/junit3172134797098569435/junit4989157864199125289/build.gradle' line: 11
(409 more lines...)
Collapse Failed DependencyVersionMappingCheckTaskIntegrationTests upToDateWhenBuiltTwice History
Default Job < 1 sec
java.lang.RuntimeException: java.lang.RuntimeException: org.gradle.testkit.runner.UnexpectedBuildFailure: Unexpected build execution failure in /tmp/junit817498801357475375/junit8739095457220085178 with arguments [-PpluginClasspath=/opt/bamboo-home/xml-data/build-dir/GRADLEPLUGINS-SPRIO-JOB1/bin,/opt/bamboo-home/xml-data/build-dir/GRADLEPLUGINS-SPRIO-JOB1/build/classes/main,/opt/bamboo-home/xml-data/build-dir/GRADLEPLUGINS-SPRIO-JOB1/build/resources/main,/opt/users/bamboo/.gradle/caches/modules-2/files-2.1/io.spring.gradle/dependency-management-plugin/1.0.3.RELEASE/c7fc988680e19cef9bf91de0c39b891e4c8dca2d/dependency-management-plugin-1.0.3.RELEASE.jar, --stacktrace, dependencyVersionMappingCheck]

Output:

FAILURE: Build failed with an exception.

* Where:
Build file '/tmp/junit817498801357475375/junit8739095457220085178/build.gradle' line: 11
(409 more lines...)