E37 build and publish

Build: #135 failed Child of GRECLIPSE-TE42-225

Build result summary

Details

Completed
Duration
93 minutes
Labels
None
Agent
bamboo-02.af.pivotal.io
Revision
9afd7dd426f9db12f220da9b7e37326aad0e37e2 9afd7dd426f9db12f220da9b7e37326aad0e37e2
Total tests
4864
Failing since
#130 (Child of GRECLIPSE-TE42-220)

Responsible

This build has been failing since #130
No one has taken responsibility

Code commits

Author Commit Message Commit date
Eric Milles Eric Milles 9afd7dd426f9db12f220da9b7e37326aad0e37e2 9afd7dd426f9db12f220da9b7e37326aad0e37e2 Fix for inferencing and highlighting of Object method on Class instance
Type.getClass() was showing as a static call, when it is an instance
method call (on an instance of Class<Type>).
Eric Milles Eric Milles 1b0d0dc9a4b5e98e692884c6723d6503fe76896e 1b0d0dc9a4b5e98e692884c6723d6503fe76896e Add current version information
Eric Milles Eric Milles ccb5cde8e03c5788f9d2760224a2357ec990b7f0 ccb5cde8e03c5788f9d2760224a2357ec990b7f0 Bring proposal stuff together
Eric Milles Eric Milles f3d5f3f04052875851ed1455c6a9af955d374024 f3d5f3f04052875851ed1455c6a9af955d374024 Fix for DGM as property proposal type matching

Tests

New test failures 1
Status Test View job Duration
Collapse Failed DSLContentAssistTests testSwingBuilder1 History
Default Job 3 secs
java.lang.AssertionError: Proposal 'frame' should have preceded proposal 'find' in: 
find() : Object - DefaultGroovyMethods (Groovy) (900)
find(Closure closure) : Object - DefaultGroovyMethods (Groovy) (900)
findAll() : Collection - DefaultGroovyMethods (Groovy) (900)
findAll(Closure closure) : Collection - DefaultGroovyMethods (Groovy) (900)
findIndexOf(Closure closure) : int - DefaultGroovyMethods (Groovy) (900)
findIndexOf(int startIndex, Closure closure) : int - DefaultGroovyMethods (Groovy) (900)
findIndexValues(Closure closure) : List - DefaultGroovyMethods (Groovy) (900)
(23 more lines...)
Existing test failures 40
Status Test Failing since View job Duration
java.lang.AssertionError: Expected declaring type not found.
 Expected: groovy.swing.SwingBuilder
 Found type: java.lang.Object
 Found declaring type: TestUnit732227
 ASTNode: org.codehaus.groovy.ast.expr.VariableExpression@262964fd[variable: frame]
java.lang.AssertionError: Expected declaring type not found.
	Expected: groovy.swing.SwingBuilder
	Found type: java.lang.Object
(15 more lines...)
java.lang.AssertionError: Expected declaring type not found.
 Expected: groovy.swing.SwingBuilder
 Found type: javax.swing.JFrame
 Found declaring type: java.lang.Object
 ASTNode: org.codehaus.groovy.ast.expr.VariableExpression@63d5662b[variable: frame]
java.lang.AssertionError: Expected declaring type not found.
	Expected: groovy.swing.SwingBuilder
	Found type: javax.swing.JFrame
(18 more lines...)
java.lang.AssertionError: Proposal 'frame' should have preceded proposal 'FrameFactory - groovy.swing.factory' in: 
frame(Container contentPane, int defaultCloseOperation, String title, Component glassPane, JLayeredPane layeredPane) : JFrame - Object (SwingBuilder DSL) (99)
Frame - java.awt (17)
FramePeer - java.awt.peer (17)
From - groovy.time.BaseDuration (13)
FromAbstractTypeMethods - groovy.transform.stc (13)
FromString - groovy.transform.stc (13)
FrameBorder - javax.swing.plaf.metal.MetalBorders (5)
(44 more lines...)
junit.framework.ComparisonFailure: 
----------- Expected ------------

------------ but was ------------
Problem : TestCaseChannelPersistentStore cannot be resolved to a type [ resource : </Project/src/testpkg/AllTests.java> range : <45,75> category : <40> severity : <2>]

--------- Difference is ----------
 expected:<[]> but was:<[Problem : TestCaseChannelPersistentStore cannot be resolved to a type [ resource : </Project/src/testpkg/AllTests.java> range : <45,75> category : <40> severity : <2>]
(6 more lines...)
junit.framework.ComparisonFailure: 
----------- Expected ------------

------------ but was ------------
Problem : The project was not built since its build path is incomplete. Cannot find the class file for p.Named$Trait$Helper. Fix the build path then try building this project [ resource : </Project> range : <-1,-1> category : <10> severity : <2>]
Problem : The type p.Named$Trait$Helper cannot be resolved. It is indirectly referenced from required .class files [ resource : </Project/src/r/NamedClass.groovy> range : <0,0> category : <10> severity : <2>]

--------- Difference is ----------
(8 more lines...)
org.junit.ComparisonFailure: unexpected recompiled units. lenExpected=2 lenActual=2 expected:<{[Runner,Runner$_run_closure1]}> but was:<{[Launch,Runner]}>
	at org.junit.Assert.assertEquals(Assert.java:123)
	at org.eclipse.jdt.core.groovy.tests.builder.BuilderTestSuite.expectingCompiling(BuilderTestSuite.java:209)
	at org.eclipse.jdt.core.groovy.tests.builder.BuilderTestSuite.expectingCompiledClasses(BuilderTestSuite.java:191)
	at org.eclipse.jdt.core.groovy.tests.builder.BasicGroovyBuildTests.testClosureIncremental(BasicGroovyBuildTests.java:2070)
org.junit.ComparisonFailure: unexpected recompiled units. lenExpected=3 lenActual=4 expected:<...st.Class1,test.Class[]2,test.Class3}> but was:<...st.Class1,test.Class[1,test.Class]2,test.Class3}>
	at org.junit.Assert.assertEquals(Assert.java:123)
	at org.eclipse.jdt.core.groovy.tests.builder.BuilderTestSuite.expectingCompiling(BuilderTestSuite.java:209)
	at org.eclipse.jdt.core.groovy.tests.builder.BuilderTestSuite.expectingCompiledClasses(BuilderTestSuite.java:191)
	at org.eclipse.jdt.core.groovy.tests.builder.BasicGroovyBuildTests.testGRE1773(BasicGroovyBuildTests.java:3687)
junit.framework.ComparisonFailure: 
----------- Expected ------------

------------ but was ------------
Problem : The project was not built since its build path is incomplete. Cannot find the class file for p.MyTrait$Trait$Helper. Fix the build path then try building this project [ resource : </Project> range : <-1,-1> category : <10> severity : <2>]
Problem : The type p.MyTrait$Trait$Helper cannot be resolved. It is indirectly referenced from required .class files [ resource : </Project/src/q/MyClass.groovy> range : <0,0> category : <10> severity : <2>]

--------- Difference is ----------
(8 more lines...)
junit.framework.ComparisonFailure: 
----------- Expected ------------

------------ but was ------------
Problem : Outer cannot be resolved to a type [ resource : </Project/src/Client.java> range : <30,35> category : <40> severity : <2>]

--------- Difference is ----------
 expected:<[]> but was:<[Problem : Outer cannot be resolved to a type [ resource : </Project/src/Client.java> range : <30,35> category : <40> severity : <2>]
(6 more lines...)
junit.framework.ComparisonFailure: 
----------- Expected ------------

------------ but was ------------
Problem : The project was not built since its build path is incomplete. Cannot find the class file for p.Named$Trait$Helper. Fix the build path then try building this project [ resource : </Project> range : <-1,-1> category : <10> severity : <2>]
Problem : The type p.Named$Trait$Helper cannot be resolved. It is indirectly referenced from required .class files [ resource : </Project/src/q/NamedClass.groovy> range : <0,0> category : <10> severity : <2>]

--------- Difference is ----------
(8 more lines...)
java.lang.AssertionError: org.eclipse.jdt.core.util.ClassFormatException
	at org.junit.Assert.fail(Assert.java:91)
	at org.eclipse.jdt.groovy.core.tests.basic.GroovyCompilerTestSuite.checkDisassemblyFor(GroovyCompilerTestSuite.java:290)
	at org.eclipse.jdt.groovy.core.tests.basic.GroovyCompilerTestSuite.checkDisassemblyFor(GroovyCompilerTestSuite.java:270)
	at org.eclipse.jdt.groovy.core.tests.basic.AnnotationsTests.testFieldLevelAnnotations01(AnnotationsTests.java:621)
java.lang.AssertionError: org.eclipse.jdt.core.util.ClassFormatException
	at org.junit.Assert.fail(Assert.java:91)
	at org.eclipse.jdt.groovy.core.tests.basic.GroovyCompilerTestSuite.checkDisassemblyFor(GroovyCompilerTestSuite.java:290)
	at org.eclipse.jdt.groovy.core.tests.basic.GroovyCompilerTestSuite.checkDisassemblyFor(GroovyCompilerTestSuite.java:270)
	at org.eclipse.jdt.groovy.core.tests.basic.AnnotationsTests.testConstructorLevelAnnotations01(AnnotationsTests.java:764)
java.lang.AssertionError: org.eclipse.jdt.core.util.ClassFormatException
	at org.junit.Assert.fail(Assert.java:91)
	at org.eclipse.jdt.groovy.core.tests.basic.GroovyCompilerTestSuite.checkDisassemblyFor(GroovyCompilerTestSuite.java:290)
	at org.eclipse.jdt.groovy.core.tests.basic.GroovyCompilerTestSuite.checkDisassemblyFor(GroovyCompilerTestSuite.java:270)
	at org.eclipse.jdt.groovy.core.tests.basic.AnnotationsTests.testFieldLevelAnnotations01(AnnotationsTests.java:621)
java.lang.AssertionError: org.eclipse.jdt.core.util.ClassFormatException
	at org.junit.Assert.fail(Assert.java:91)
	at org.eclipse.jdt.groovy.core.tests.basic.GroovyCompilerTestSuite.checkDisassemblyFor(GroovyCompilerTestSuite.java:290)
	at org.eclipse.jdt.groovy.core.tests.basic.GroovyCompilerTestSuite.checkDisassemblyFor(GroovyCompilerTestSuite.java:270)
	at org.eclipse.jdt.groovy.core.tests.basic.AnnotationsTests.testMethodLevelAnnotations(AnnotationsTests.java:589)
java.lang.AssertionError: org.eclipse.jdt.core.util.ClassFormatException
	at org.junit.Assert.fail(Assert.java:91)
	at org.eclipse.jdt.groovy.core.tests.basic.GroovyCompilerTestSuite.checkDisassemblyFor(GroovyCompilerTestSuite.java:290)
	at org.eclipse.jdt.groovy.core.tests.basic.GroovyCompilerTestSuite.checkDisassemblyFor(GroovyCompilerTestSuite.java:270)
	at org.eclipse.jdt.groovy.core.tests.basic.AnnotationsTests.testConstructorLevelAnnotations01(AnnotationsTests.java:764)
java.lang.AssertionError: org.eclipse.jdt.core.util.ClassFormatException
	at org.junit.Assert.fail(Assert.java:91)
	at org.eclipse.jdt.groovy.core.tests.basic.GroovyCompilerTestSuite.checkDisassemblyFor(GroovyCompilerTestSuite.java:290)
	at org.eclipse.jdt.groovy.core.tests.basic.GroovyCompilerTestSuite.checkDisassemblyFor(GroovyCompilerTestSuite.java:270)
	at org.eclipse.jdt.groovy.core.tests.basic.AnnotationsTests.testMethodLevelAnnotations(AnnotationsTests.java:589)
java.lang.AssertionError: org.eclipse.jdt.core.util.ClassFormatException
	at org.junit.Assert.fail(Assert.java:91)
	at org.eclipse.jdt.groovy.core.tests.basic.GroovyCompilerTestSuite.checkDisassemblyFor(GroovyCompilerTestSuite.java:290)
	at org.eclipse.jdt.groovy.core.tests.basic.GroovyCompilerTestSuite.checkDisassemblyFor(GroovyCompilerTestSuite.java:270)
	at org.eclipse.jdt.groovy.core.tests.basic.AnnotationsTests.testFieldLevelAnnotations_defaultRetention(AnnotationsTests.java:706)
java.lang.AssertionError: org.eclipse.jdt.core.util.ClassFormatException
	at org.junit.Assert.fail(Assert.java:91)
	at org.eclipse.jdt.groovy.core.tests.basic.GroovyCompilerTestSuite.checkDisassemblyFor(GroovyCompilerTestSuite.java:290)
	at org.eclipse.jdt.groovy.core.tests.basic.GroovyCompilerTestSuite.checkDisassemblyFor(GroovyCompilerTestSuite.java:270)
	at org.eclipse.jdt.groovy.core.tests.basic.AnnotationsTests.testTypeLevelAnnotations01(AnnotationsTests.java:558)
java.lang.AssertionError: org.eclipse.jdt.core.util.ClassFormatException
	at org.junit.Assert.fail(Assert.java:91)
	at org.eclipse.jdt.groovy.core.tests.basic.GroovyCompilerTestSuite.checkDisassemblyFor(GroovyCompilerTestSuite.java:290)
	at org.eclipse.jdt.groovy.core.tests.basic.GroovyCompilerTestSuite.checkDisassemblyFor(GroovyCompilerTestSuite.java:270)
	at org.eclipse.jdt.groovy.core.tests.basic.AnnotationsTests.testFieldLevelAnnotations_sourceRetention(AnnotationsTests.java:679)
java.lang.AssertionError: org.eclipse.jdt.core.util.ClassFormatException
	at org.junit.Assert.fail(Assert.java:91)
	at org.eclipse.jdt.groovy.core.tests.basic.GroovyCompilerTestSuite.checkDisassemblyFor(GroovyCompilerTestSuite.java:290)
	at org.eclipse.jdt.groovy.core.tests.basic.GroovyCompilerTestSuite.checkDisassemblyFor(GroovyCompilerTestSuite.java:270)
	at org.eclipse.jdt.groovy.core.tests.basic.AnnotationsTests.testFieldLevelAnnotations_classRetention(AnnotationsTests.java:650)
java.lang.AssertionError: org.eclipse.jdt.core.util.ClassFormatException
	at org.junit.Assert.fail(Assert.java:91)
	at org.eclipse.jdt.groovy.core.tests.basic.GroovyCompilerTestSuite.checkDisassemblyFor(GroovyCompilerTestSuite.java:290)
	at org.eclipse.jdt.groovy.core.tests.basic.GroovyCompilerTestSuite.checkDisassemblyFor(GroovyCompilerTestSuite.java:270)
	at org.eclipse.jdt.groovy.core.tests.basic.AnnotationsTests.testConstructorLevelAnnotations01(AnnotationsTests.java:764)
java.lang.AssertionError: org.eclipse.jdt.core.util.ClassFormatException
	at org.junit.Assert.fail(Assert.java:91)
	at org.eclipse.jdt.groovy.core.tests.basic.GroovyCompilerTestSuite.checkDisassemblyFor(GroovyCompilerTestSuite.java:290)
	at org.eclipse.jdt.groovy.core.tests.basic.GroovyCompilerTestSuite.checkDisassemblyFor(GroovyCompilerTestSuite.java:270)
	at org.eclipse.jdt.groovy.core.tests.basic.AnnotationsTests.testFieldLevelAnnotations_classRetention(AnnotationsTests.java:650)
java.lang.AssertionError: org.eclipse.jdt.core.util.ClassFormatException
	at org.junit.Assert.fail(Assert.java:91)
	at org.eclipse.jdt.groovy.core.tests.basic.GroovyCompilerTestSuite.checkDisassemblyFor(GroovyCompilerTestSuite.java:290)
	at org.eclipse.jdt.groovy.core.tests.basic.GroovyCompilerTestSuite.checkDisassemblyFor(GroovyCompilerTestSuite.java:270)
	at org.eclipse.jdt.groovy.core.tests.basic.AnnotationsTests.testFieldLevelAnnotations01(AnnotationsTests.java:621)
java.lang.AssertionError: org.eclipse.jdt.core.util.ClassFormatException
	at org.junit.Assert.fail(Assert.java:91)
	at org.eclipse.jdt.groovy.core.tests.basic.GroovyCompilerTestSuite.checkDisassemblyFor(GroovyCompilerTestSuite.java:290)
	at org.eclipse.jdt.groovy.core.tests.basic.GroovyCompilerTestSuite.checkDisassemblyFor(GroovyCompilerTestSuite.java:270)
	at org.eclipse.jdt.groovy.core.tests.basic.AnnotationsTests.testMethodLevelAnnotations(AnnotationsTests.java:589)
java.lang.AssertionError: org.eclipse.jdt.core.util.ClassFormatException
	at org.junit.Assert.fail(Assert.java:91)
	at org.eclipse.jdt.groovy.core.tests.basic.GroovyCompilerTestSuite.checkDisassemblyFor(GroovyCompilerTestSuite.java:290)
	at org.eclipse.jdt.groovy.core.tests.basic.GroovyCompilerTestSuite.checkDisassemblyFor(GroovyCompilerTestSuite.java:270)
	at org.eclipse.jdt.groovy.core.tests.basic.AnnotationsTests.testTypeLevelAnnotations01(AnnotationsTests.java:558)
java.lang.AssertionError: org.eclipse.jdt.core.util.ClassFormatException
	at org.junit.Assert.fail(Assert.java:91)
	at org.eclipse.jdt.groovy.core.tests.basic.GroovyCompilerTestSuite.checkDisassemblyFor(GroovyCompilerTestSuite.java:290)
	at org.eclipse.jdt.groovy.core.tests.basic.GroovyCompilerTestSuite.checkDisassemblyFor(GroovyCompilerTestSuite.java:270)
	at org.eclipse.jdt.groovy.core.tests.basic.AnnotationsTests.testFieldLevelAnnotations_defaultRetention(AnnotationsTests.java:706)
java.lang.AssertionError: org.eclipse.jdt.core.util.ClassFormatException
	at org.junit.Assert.fail(Assert.java:91)
	at org.eclipse.jdt.groovy.core.tests.basic.GroovyCompilerTestSuite.checkDisassemblyFor(GroovyCompilerTestSuite.java:290)
	at org.eclipse.jdt.groovy.core.tests.basic.GroovyCompilerTestSuite.checkDisassemblyFor(GroovyCompilerTestSuite.java:270)
	at org.eclipse.jdt.groovy.core.tests.basic.AnnotationsTests.testTypeLevelAnnotations01(AnnotationsTests.java:558)
java.lang.AssertionError: org.eclipse.jdt.core.util.ClassFormatException
	at org.junit.Assert.fail(Assert.java:91)
	at org.eclipse.jdt.groovy.core.tests.basic.GroovyCompilerTestSuite.checkDisassemblyFor(GroovyCompilerTestSuite.java:290)
	at org.eclipse.jdt.groovy.core.tests.basic.GroovyCompilerTestSuite.checkDisassemblyFor(GroovyCompilerTestSuite.java:270)
	at org.eclipse.jdt.groovy.core.tests.basic.AnnotationsTests.testFieldLevelAnnotations_defaultRetention(AnnotationsTests.java:706)
java.lang.AssertionError: org.eclipse.jdt.core.util.ClassFormatException
	at org.junit.Assert.fail(Assert.java:91)
	at org.eclipse.jdt.groovy.core.tests.basic.GroovyCompilerTestSuite.checkDisassemblyFor(GroovyCompilerTestSuite.java:290)
	at org.eclipse.jdt.groovy.core.tests.basic.GroovyCompilerTestSuite.checkDisassemblyFor(GroovyCompilerTestSuite.java:270)
	at org.eclipse.jdt.groovy.core.tests.basic.AnnotationsTests.testFieldLevelAnnotations_sourceRetention(AnnotationsTests.java:679)
java.lang.AssertionError: org.eclipse.jdt.core.util.ClassFormatException
	at org.junit.Assert.fail(Assert.java:91)
	at org.eclipse.jdt.groovy.core.tests.basic.GroovyCompilerTestSuite.checkDisassemblyFor(GroovyCompilerTestSuite.java:290)
	at org.eclipse.jdt.groovy.core.tests.basic.GroovyCompilerTestSuite.checkDisassemblyFor(GroovyCompilerTestSuite.java:270)
	at org.eclipse.jdt.groovy.core.tests.basic.AnnotationsTests.testFieldLevelAnnotations_sourceRetention(AnnotationsTests.java:679)
java.lang.AssertionError: org.eclipse.jdt.core.util.ClassFormatException
	at org.junit.Assert.fail(Assert.java:91)
	at org.eclipse.jdt.groovy.core.tests.basic.GroovyCompilerTestSuite.checkDisassemblyFor(GroovyCompilerTestSuite.java:290)
	at org.eclipse.jdt.groovy.core.tests.basic.GroovyCompilerTestSuite.checkDisassemblyFor(GroovyCompilerTestSuite.java:270)
	at org.eclipse.jdt.groovy.core.tests.basic.AnnotationsTests.testFieldLevelAnnotations_classRetention(AnnotationsTests.java:650)
java.lang.AssertionError: org.eclipse.jdt.core.util.ClassFormatException
	at org.junit.Assert.fail(Assert.java:91)
	at org.eclipse.jdt.groovy.core.tests.basic.GroovyCompilerTestSuite.checkDisassemblyFor(GroovyCompilerTestSuite.java:290)
	at org.eclipse.jdt.groovy.core.tests.basic.GroovySimpleTests.testDefaultValueMethods(GroovySimpleTests.java:3951)
java.lang.AssertionError: org.eclipse.jdt.core.util.ClassFormatException
	at org.junit.Assert.fail(Assert.java:91)
	at org.eclipse.jdt.groovy.core.tests.basic.GroovyCompilerTestSuite.checkDisassemblyFor(GroovyCompilerTestSuite.java:290)
	at org.eclipse.jdt.groovy.core.tests.basic.GroovySimpleTests.testDefaultValueConstructors(GroovySimpleTests.java:4063)
java.lang.AssertionError: org.eclipse.jdt.core.util.ClassFormatException
	at org.junit.Assert.fail(Assert.java:91)
	at org.eclipse.jdt.groovy.core.tests.basic.GroovyCompilerTestSuite.checkDisassemblyFor(GroovyCompilerTestSuite.java:290)
	at org.eclipse.jdt.groovy.core.tests.basic.GroovySimpleTests.testDefaultValueMethods02(GroovySimpleTests.java:4003)
java.lang.AssertionError: org.eclipse.jdt.core.util.ClassFormatException
	at org.junit.Assert.fail(Assert.java:91)
	at org.eclipse.jdt.groovy.core.tests.basic.GroovyCompilerTestSuite.checkDisassemblyFor(GroovyCompilerTestSuite.java:290)
	at org.eclipse.jdt.groovy.core.tests.basic.GroovySimpleTests.testDefaultValueConstructors(GroovySimpleTests.java:4063)
java.lang.AssertionError: org.eclipse.jdt.core.util.ClassFormatException
	at org.junit.Assert.fail(Assert.java:91)
	at org.eclipse.jdt.groovy.core.tests.basic.GroovyCompilerTestSuite.checkDisassemblyFor(GroovyCompilerTestSuite.java:290)
	at org.eclipse.jdt.groovy.core.tests.basic.GroovySimpleTests.testDefaultValueConstructors(GroovySimpleTests.java:4063)
java.lang.AssertionError: org.eclipse.jdt.core.util.ClassFormatException
	at org.junit.Assert.fail(Assert.java:91)
	at org.eclipse.jdt.groovy.core.tests.basic.GroovyCompilerTestSuite.checkDisassemblyFor(GroovyCompilerTestSuite.java:290)
	at org.eclipse.jdt.groovy.core.tests.basic.GroovySimpleTests.testDefaultValueMethods(GroovySimpleTests.java:3951)
java.lang.AssertionError: org.eclipse.jdt.core.util.ClassFormatException
	at org.junit.Assert.fail(Assert.java:91)
	at org.eclipse.jdt.groovy.core.tests.basic.GroovyCompilerTestSuite.checkDisassemblyFor(GroovyCompilerTestSuite.java:290)
	at org.eclipse.jdt.groovy.core.tests.basic.GroovySimpleTests.testDefaultValueMethods(GroovySimpleTests.java:3951)
java.lang.AssertionError: org.eclipse.jdt.core.util.ClassFormatException
	at org.junit.Assert.fail(Assert.java:91)
	at org.eclipse.jdt.groovy.core.tests.basic.GroovyCompilerTestSuite.checkDisassemblyFor(GroovyCompilerTestSuite.java:290)
	at org.eclipse.jdt.groovy.core.tests.basic.GroovySimpleTests.testDefaultValueMethods02(GroovySimpleTests.java:4003)
java.lang.AssertionError: org.eclipse.jdt.core.util.ClassFormatException
	at org.junit.Assert.fail(Assert.java:91)
	at org.eclipse.jdt.groovy.core.tests.basic.GroovyCompilerTestSuite.checkDisassemblyFor(GroovyCompilerTestSuite.java:290)
	at org.eclipse.jdt.groovy.core.tests.basic.GroovySimpleTests.testDefaultValueMethods02(GroovySimpleTests.java:4003)