E37 build and publish

Build: #183 failed Child of GRECLIPSE-TE42-282

Build result summary

Details

Completed
Duration
87 minutes
Labels
None
Agent
bamboo-08.af.pivotal.io
Revision
963d06b94da5f0e08daac857ac4981b8e908dffb 963d06b94da5f0e08daac857ac4981b8e908dffb
Total tests
5039
Failing since
#130 (Child of GRECLIPSE-TE42-220)

Responsible

This build has been failing since #130
No one has taken responsibility

Code commits

Author Commit Message Commit date
Eric Milles Eric Milles 963d06b94da5f0e08daac857ac4981b8e908dffb 963d06b94da5f0e08daac857ac4981b8e908dffb Update README.md
Eric Milles Eric Milles 7f047e71ec9819479ca0e58a7c301e72f42b9972 7f047e71ec9819479ca0e58a7c301e72f42b9972 Fix for issue #519: add null safety to binding.superInterfaces

Configuration changes

Plan configuration has changed since the last successful build. See the plan audit log for more details.

Tests

Existing test failures 43
Status Test Failing since View job Duration
java.lang.AssertionError: Expected declaring type not found.
 Expected: groovy.swing.SwingBuilder
 Found type: java.lang.Object
 Found declaring type: TestUnit670779
 ASTNode: org.codehaus.groovy.ast.expr.VariableExpression@50f3fbb7[variable: frame]
java.lang.AssertionError: Expected declaring type not found.
	Expected: groovy.swing.SwingBuilder
	Found type: java.lang.Object
(18 more lines...)
java.lang.AssertionError: Expected declaring type not found.
 Expected: groovy.swing.SwingBuilder
 Found type: java.lang.Object
 Found declaring type: TestUnit118347
 ASTNode: org.codehaus.groovy.ast.expr.VariableExpression@219f1077[variable: frame]
java.lang.AssertionError: Expected declaring type not found.
	Expected: groovy.swing.SwingBuilder
	Found type: java.lang.Object
(15 more lines...)
java.lang.AssertionError: Proposal 'frame' should have been found in: 
From - groovy.time.BaseDuration (9)
FromAbstractTypeMethods - groovy.transform.stc (9)
FromString - groovy.transform.stc (9)
Frame - java.awt (8)
FramePeer - java.awt.peer (8)
FREE_MEM - org.omg.CORBA (5)
FREM - com.sun.org.apache.bcel.internal.generic (5)
(25 more lines...)
java.lang.AssertionError: Proposal 'frame' should have been found in: 
find() : Object - DefaultGroovyMethods (Groovy) (900)
find(Closure closure) : Object - DefaultGroovyMethods (Groovy) (900)
findAll() : Collection - DefaultGroovyMethods (Groovy) (900)
findAll(Closure closure) : Collection - DefaultGroovyMethods (Groovy) (900)
findIndexOf(Closure closure) : int - DefaultGroovyMethods (Groovy) (900)
findIndexOf(int startIndex, Closure closure) : int - DefaultGroovyMethods (Groovy) (900)
findIndexValues(Closure closure) : List - DefaultGroovyMethods (Groovy) (900)
(19 more lines...)
org.codehaus.groovy.runtime.powerassert.PowerAssertionError: assert declType == 'p.IPointcut'
       |        |
       'test'   false
	at org.codehaus.groovy.runtime.InvokerHelper.assertFailed(InvokerHelper.java:413)
	at org.codehaus.groovy.runtime.ScriptBytecodeAdapter.assertFailed(ScriptBytecodeAdapter.java:658)
	at org.codehaus.groovy.eclipse.dsl.tests.MetaDSLInferencingTests.assertDsldType(MetaDSLInferencingTests.groovy:42)
	at org.codehaus.groovy.eclipse.dsl.tests.MetaDSLInferencingTests.this$4$assertDsldType(MetaDSLInferencingTests.groovy)
org.codehaus.groovy.runtime.powerassert.PowerAssertionError: assert declType == 'p.IPointcut'
       |        |
       'test'   false
	at org.codehaus.groovy.runtime.InvokerHelper.assertFailed(InvokerHelper.java:413)
	at org.codehaus.groovy.runtime.ScriptBytecodeAdapter.assertFailed(ScriptBytecodeAdapter.java:658)
	at org.codehaus.groovy.eclipse.dsl.tests.MetaDSLInferencingTests.assertDsldType(MetaDSLInferencingTests.groovy:42)
	at org.codehaus.groovy.eclipse.dsl.tests.MetaDSLInferencingTests.this$4$assertDsldType(MetaDSLInferencingTests.groovy)
junit.framework.ComparisonFailure: 
----------- Expected ------------

------------ but was ------------
Problem : The project was not built since its build path is incomplete. Cannot find the class file for p.MyTrait$Trait$Helper. Fix the build path then try building this project [ resource : </Project> range : <-1,-1> category : <10> severity : <2>]
Problem : The type p.MyTrait$Trait$Helper cannot be resolved. It is indirectly referenced from required .class files [ resource : </Project/src/q/MyClass.groovy> range : <0,0> category : <10> severity : <2>]

--------- Difference is ----------
(8 more lines...)
junit.framework.ComparisonFailure: 
----------- Expected ------------

------------ but was ------------
Problem : Outer cannot be resolved to a type [ resource : </Project/src/Client.java> range : <30,35> category : <40> severity : <2>]

--------- Difference is ----------
 expected:<[]> but was:<[Problem : Outer cannot be resolved to a type [ resource : </Project/src/Client.java> range : <30,35> category : <40> severity : <2>]
(6 more lines...)
junit.framework.ComparisonFailure: 
----------- Expected ------------

------------ but was ------------
Problem : TestCaseChannelPersistentStore cannot be resolved to a type [ resource : </Project/src/testpkg/AllTests.java> range : <45,75> category : <40> severity : <2>]

--------- Difference is ----------
 expected:<[]> but was:<[Problem : TestCaseChannelPersistentStore cannot be resolved to a type [ resource : </Project/src/testpkg/AllTests.java> range : <45,75> category : <40> severity : <2>]
(6 more lines...)
junit.framework.ComparisonFailure: 
----------- Expected ------------

------------ but was ------------
Problem : The project was not built since its build path is incomplete. Cannot find the class file for p.Named$Trait$Helper. Fix the build path then try building this project [ resource : </Project> range : <-1,-1> category : <10> severity : <2>]
Problem : The type p.Named$Trait$Helper cannot be resolved. It is indirectly referenced from required .class files [ resource : </Project/src/q/NamedClass.groovy> range : <0,0> category : <10> severity : <2>]

--------- Difference is ----------
(8 more lines...)
junit.framework.ComparisonFailure: 
----------- Expected ------------

------------ but was ------------
Problem : The project was not built since its build path is incomplete. Cannot find the class file for p.Named$Trait$Helper. Fix the build path then try building this project [ resource : </Project> range : <-1,-1> category : <10> severity : <2>]
Problem : The type p.Named$Trait$Helper cannot be resolved. It is indirectly referenced from required .class files [ resource : </Project/src/r/NamedClass.groovy> range : <0,0> category : <10> severity : <2>]

--------- Difference is ----------
(8 more lines...)
org.junit.ComparisonFailure: unexpected recompiled units. lenExpected=2 lenActual=2 expected:<{[Runner,Runner$_run_closure1]}> but was:<{[Launch,Runner]}>
	at org.junit.Assert.assertEquals(Assert.java:123)
	at org.eclipse.jdt.core.groovy.tests.builder.BuilderTestSuite.expectingCompiling(BuilderTestSuite.java:210)
	at org.eclipse.jdt.core.groovy.tests.builder.BuilderTestSuite.expectingCompiledClasses(BuilderTestSuite.java:192)
	at org.eclipse.jdt.core.groovy.tests.builder.BasicGroovyBuildTests.testClosureIncremental(BasicGroovyBuildTests.java:2070)
org.junit.ComparisonFailure: unexpected recompiled units. lenExpected=3 lenActual=4 expected:<...st.Class1,test.Class[]2,test.Class3}> but was:<...st.Class1,test.Class[1,test.Class]2,test.Class3}>
	at org.junit.Assert.assertEquals(Assert.java:123)
	at org.eclipse.jdt.core.groovy.tests.builder.BuilderTestSuite.expectingCompiling(BuilderTestSuite.java:210)
	at org.eclipse.jdt.core.groovy.tests.builder.BuilderTestSuite.expectingCompiledClasses(BuilderTestSuite.java:192)
	at org.eclipse.jdt.core.groovy.tests.builder.BasicGroovyBuildTests.testGRE1773(BasicGroovyBuildTests.java:3687)
java.lang.AssertionError: org.eclipse.jdt.core.util.ClassFormatException
	at org.junit.Assert.fail(Assert.java:91)
	at org.eclipse.jdt.groovy.core.tests.basic.GroovyCompilerTestSuite.checkDisassemblyFor(GroovyCompilerTestSuite.java:290)
	at org.eclipse.jdt.groovy.core.tests.basic.GroovyCompilerTestSuite.checkDisassemblyFor(GroovyCompilerTestSuite.java:270)
	at org.eclipse.jdt.groovy.core.tests.basic.AnnotationsTests.testConstructorLevelAnnotations01(AnnotationsTests.java:764)
java.lang.AssertionError: org.eclipse.jdt.core.util.ClassFormatException
	at org.junit.Assert.fail(Assert.java:91)
	at org.eclipse.jdt.groovy.core.tests.basic.GroovyCompilerTestSuite.checkDisassemblyFor(GroovyCompilerTestSuite.java:290)
	at org.eclipse.jdt.groovy.core.tests.basic.GroovyCompilerTestSuite.checkDisassemblyFor(GroovyCompilerTestSuite.java:270)
	at org.eclipse.jdt.groovy.core.tests.basic.AnnotationsTests.testFieldLevelAnnotations_classRetention(AnnotationsTests.java:650)
java.lang.AssertionError: org.eclipse.jdt.core.util.ClassFormatException
	at org.junit.Assert.fail(Assert.java:91)
	at org.eclipse.jdt.groovy.core.tests.basic.GroovyCompilerTestSuite.checkDisassemblyFor(GroovyCompilerTestSuite.java:290)
	at org.eclipse.jdt.groovy.core.tests.basic.GroovyCompilerTestSuite.checkDisassemblyFor(GroovyCompilerTestSuite.java:270)
	at org.eclipse.jdt.groovy.core.tests.basic.AnnotationsTests.testFieldLevelAnnotations_sourceRetention(AnnotationsTests.java:679)
java.lang.AssertionError: org.eclipse.jdt.core.util.ClassFormatException
	at org.junit.Assert.fail(Assert.java:91)
	at org.eclipse.jdt.groovy.core.tests.basic.GroovyCompilerTestSuite.checkDisassemblyFor(GroovyCompilerTestSuite.java:290)
	at org.eclipse.jdt.groovy.core.tests.basic.GroovyCompilerTestSuite.checkDisassemblyFor(GroovyCompilerTestSuite.java:270)
	at org.eclipse.jdt.groovy.core.tests.basic.AnnotationsTests.testFieldLevelAnnotations_sourceRetention(AnnotationsTests.java:679)
java.lang.AssertionError: org.eclipse.jdt.core.util.ClassFormatException
	at org.junit.Assert.fail(Assert.java:91)
	at org.eclipse.jdt.groovy.core.tests.basic.GroovyCompilerTestSuite.checkDisassemblyFor(GroovyCompilerTestSuite.java:290)
	at org.eclipse.jdt.groovy.core.tests.basic.GroovyCompilerTestSuite.checkDisassemblyFor(GroovyCompilerTestSuite.java:270)
	at org.eclipse.jdt.groovy.core.tests.basic.AnnotationsTests.testFieldLevelAnnotations_defaultRetention(AnnotationsTests.java:706)
java.lang.AssertionError: org.eclipse.jdt.core.util.ClassFormatException
	at org.junit.Assert.fail(Assert.java:91)
	at org.eclipse.jdt.groovy.core.tests.basic.GroovyCompilerTestSuite.checkDisassemblyFor(GroovyCompilerTestSuite.java:290)
	at org.eclipse.jdt.groovy.core.tests.basic.GroovyCompilerTestSuite.checkDisassemblyFor(GroovyCompilerTestSuite.java:270)
	at org.eclipse.jdt.groovy.core.tests.basic.AnnotationsTests.testTypeLevelAnnotations01(AnnotationsTests.java:558)
java.lang.AssertionError: org.eclipse.jdt.core.util.ClassFormatException
	at org.junit.Assert.fail(Assert.java:91)
	at org.eclipse.jdt.groovy.core.tests.basic.GroovyCompilerTestSuite.checkDisassemblyFor(GroovyCompilerTestSuite.java:290)
	at org.eclipse.jdt.groovy.core.tests.basic.GroovyCompilerTestSuite.checkDisassemblyFor(GroovyCompilerTestSuite.java:270)
	at org.eclipse.jdt.groovy.core.tests.basic.AnnotationsTests.testFieldLevelAnnotations_defaultRetention(AnnotationsTests.java:706)
java.lang.AssertionError: org.eclipse.jdt.core.util.ClassFormatException
	at org.junit.Assert.fail(Assert.java:91)
	at org.eclipse.jdt.groovy.core.tests.basic.GroovyCompilerTestSuite.checkDisassemblyFor(GroovyCompilerTestSuite.java:290)
	at org.eclipse.jdt.groovy.core.tests.basic.GroovyCompilerTestSuite.checkDisassemblyFor(GroovyCompilerTestSuite.java:270)
	at org.eclipse.jdt.groovy.core.tests.basic.AnnotationsTests.testTypeLevelAnnotations01(AnnotationsTests.java:558)
java.lang.AssertionError: org.eclipse.jdt.core.util.ClassFormatException
	at org.junit.Assert.fail(Assert.java:91)
	at org.eclipse.jdt.groovy.core.tests.basic.GroovyCompilerTestSuite.checkDisassemblyFor(GroovyCompilerTestSuite.java:290)
	at org.eclipse.jdt.groovy.core.tests.basic.GroovyCompilerTestSuite.checkDisassemblyFor(GroovyCompilerTestSuite.java:270)
	at org.eclipse.jdt.groovy.core.tests.basic.AnnotationsTests.testMethodLevelAnnotations(AnnotationsTests.java:589)
java.lang.AssertionError: org.eclipse.jdt.core.util.ClassFormatException
	at org.junit.Assert.fail(Assert.java:91)
	at org.eclipse.jdt.groovy.core.tests.basic.GroovyCompilerTestSuite.checkDisassemblyFor(GroovyCompilerTestSuite.java:290)
	at org.eclipse.jdt.groovy.core.tests.basic.GroovyCompilerTestSuite.checkDisassemblyFor(GroovyCompilerTestSuite.java:270)
	at org.eclipse.jdt.groovy.core.tests.basic.AnnotationsTests.testFieldLevelAnnotations01(AnnotationsTests.java:621)
java.lang.AssertionError: org.eclipse.jdt.core.util.ClassFormatException
	at org.junit.Assert.fail(Assert.java:91)
	at org.eclipse.jdt.groovy.core.tests.basic.GroovyCompilerTestSuite.checkDisassemblyFor(GroovyCompilerTestSuite.java:290)
	at org.eclipse.jdt.groovy.core.tests.basic.GroovyCompilerTestSuite.checkDisassemblyFor(GroovyCompilerTestSuite.java:270)
	at org.eclipse.jdt.groovy.core.tests.basic.AnnotationsTests.testFieldLevelAnnotations_classRetention(AnnotationsTests.java:650)
java.lang.AssertionError: org.eclipse.jdt.core.util.ClassFormatException
	at org.junit.Assert.fail(Assert.java:91)
	at org.eclipse.jdt.groovy.core.tests.basic.GroovyCompilerTestSuite.checkDisassemblyFor(GroovyCompilerTestSuite.java:290)
	at org.eclipse.jdt.groovy.core.tests.basic.GroovyCompilerTestSuite.checkDisassemblyFor(GroovyCompilerTestSuite.java:270)
	at org.eclipse.jdt.groovy.core.tests.basic.AnnotationsTests.testFieldLevelAnnotations_classRetention(AnnotationsTests.java:650)
java.lang.AssertionError: org.eclipse.jdt.core.util.ClassFormatException
	at org.junit.Assert.fail(Assert.java:91)
	at org.eclipse.jdt.groovy.core.tests.basic.GroovyCompilerTestSuite.checkDisassemblyFor(GroovyCompilerTestSuite.java:290)
	at org.eclipse.jdt.groovy.core.tests.basic.GroovyCompilerTestSuite.checkDisassemblyFor(GroovyCompilerTestSuite.java:270)
	at org.eclipse.jdt.groovy.core.tests.basic.AnnotationsTests.testFieldLevelAnnotations_sourceRetention(AnnotationsTests.java:679)
java.lang.AssertionError: org.eclipse.jdt.core.util.ClassFormatException
	at org.junit.Assert.fail(Assert.java:91)
	at org.eclipse.jdt.groovy.core.tests.basic.GroovyCompilerTestSuite.checkDisassemblyFor(GroovyCompilerTestSuite.java:290)
	at org.eclipse.jdt.groovy.core.tests.basic.GroovyCompilerTestSuite.checkDisassemblyFor(GroovyCompilerTestSuite.java:270)
	at org.eclipse.jdt.groovy.core.tests.basic.AnnotationsTests.testTypeLevelAnnotations01(AnnotationsTests.java:558)
java.lang.AssertionError: org.eclipse.jdt.core.util.ClassFormatException
	at org.junit.Assert.fail(Assert.java:91)
	at org.eclipse.jdt.groovy.core.tests.basic.GroovyCompilerTestSuite.checkDisassemblyFor(GroovyCompilerTestSuite.java:290)
	at org.eclipse.jdt.groovy.core.tests.basic.GroovyCompilerTestSuite.checkDisassemblyFor(GroovyCompilerTestSuite.java:270)
	at org.eclipse.jdt.groovy.core.tests.basic.AnnotationsTests.testFieldLevelAnnotations_defaultRetention(AnnotationsTests.java:706)
java.lang.AssertionError: org.eclipse.jdt.core.util.ClassFormatException
	at org.junit.Assert.fail(Assert.java:91)
	at org.eclipse.jdt.groovy.core.tests.basic.GroovyCompilerTestSuite.checkDisassemblyFor(GroovyCompilerTestSuite.java:290)
	at org.eclipse.jdt.groovy.core.tests.basic.GroovyCompilerTestSuite.checkDisassemblyFor(GroovyCompilerTestSuite.java:270)
	at org.eclipse.jdt.groovy.core.tests.basic.AnnotationsTests.testMethodLevelAnnotations(AnnotationsTests.java:589)
java.lang.AssertionError: org.eclipse.jdt.core.util.ClassFormatException
	at org.junit.Assert.fail(Assert.java:91)
	at org.eclipse.jdt.groovy.core.tests.basic.GroovyCompilerTestSuite.checkDisassemblyFor(GroovyCompilerTestSuite.java:290)
	at org.eclipse.jdt.groovy.core.tests.basic.GroovyCompilerTestSuite.checkDisassemblyFor(GroovyCompilerTestSuite.java:270)
	at org.eclipse.jdt.groovy.core.tests.basic.AnnotationsTests.testConstructorLevelAnnotations01(AnnotationsTests.java:764)
java.lang.AssertionError: org.eclipse.jdt.core.util.ClassFormatException
	at org.junit.Assert.fail(Assert.java:91)
	at org.eclipse.jdt.groovy.core.tests.basic.GroovyCompilerTestSuite.checkDisassemblyFor(GroovyCompilerTestSuite.java:290)
	at org.eclipse.jdt.groovy.core.tests.basic.GroovyCompilerTestSuite.checkDisassemblyFor(GroovyCompilerTestSuite.java:270)
	at org.eclipse.jdt.groovy.core.tests.basic.AnnotationsTests.testMethodLevelAnnotations(AnnotationsTests.java:589)
java.lang.AssertionError: org.eclipse.jdt.core.util.ClassFormatException
	at org.junit.Assert.fail(Assert.java:91)
	at org.eclipse.jdt.groovy.core.tests.basic.GroovyCompilerTestSuite.checkDisassemblyFor(GroovyCompilerTestSuite.java:290)
	at org.eclipse.jdt.groovy.core.tests.basic.GroovyCompilerTestSuite.checkDisassemblyFor(GroovyCompilerTestSuite.java:270)
	at org.eclipse.jdt.groovy.core.tests.basic.AnnotationsTests.testFieldLevelAnnotations01(AnnotationsTests.java:621)
java.lang.AssertionError: org.eclipse.jdt.core.util.ClassFormatException
	at org.junit.Assert.fail(Assert.java:91)
	at org.eclipse.jdt.groovy.core.tests.basic.GroovyCompilerTestSuite.checkDisassemblyFor(GroovyCompilerTestSuite.java:290)
	at org.eclipse.jdt.groovy.core.tests.basic.GroovyCompilerTestSuite.checkDisassemblyFor(GroovyCompilerTestSuite.java:270)
	at org.eclipse.jdt.groovy.core.tests.basic.AnnotationsTests.testConstructorLevelAnnotations01(AnnotationsTests.java:764)
java.lang.AssertionError: org.eclipse.jdt.core.util.ClassFormatException
	at org.junit.Assert.fail(Assert.java:91)
	at org.eclipse.jdt.groovy.core.tests.basic.GroovyCompilerTestSuite.checkDisassemblyFor(GroovyCompilerTestSuite.java:290)
	at org.eclipse.jdt.groovy.core.tests.basic.GroovyCompilerTestSuite.checkDisassemblyFor(GroovyCompilerTestSuite.java:270)
	at org.eclipse.jdt.groovy.core.tests.basic.AnnotationsTests.testFieldLevelAnnotations01(AnnotationsTests.java:621)
java.lang.AssertionError: org.eclipse.jdt.core.util.ClassFormatException
	at org.junit.Assert.fail(Assert.java:91)
	at org.eclipse.jdt.groovy.core.tests.basic.GroovyCompilerTestSuite.checkDisassemblyFor(GroovyCompilerTestSuite.java:290)
	at org.eclipse.jdt.groovy.core.tests.basic.GroovySimpleTests.testDefaultValueMethods(GroovySimpleTests.java:3952)
java.lang.AssertionError: org.eclipse.jdt.core.util.ClassFormatException
	at org.junit.Assert.fail(Assert.java:91)
	at org.eclipse.jdt.groovy.core.tests.basic.GroovyCompilerTestSuite.checkDisassemblyFor(GroovyCompilerTestSuite.java:290)
	at org.eclipse.jdt.groovy.core.tests.basic.GroovySimpleTests.testDefaultValueMethods(GroovySimpleTests.java:3952)
java.lang.AssertionError: org.eclipse.jdt.core.util.ClassFormatException
	at org.junit.Assert.fail(Assert.java:91)
	at org.eclipse.jdt.groovy.core.tests.basic.GroovyCompilerTestSuite.checkDisassemblyFor(GroovyCompilerTestSuite.java:290)
	at org.eclipse.jdt.groovy.core.tests.basic.GroovySimpleTests.testDefaultValueMethods02(GroovySimpleTests.java:4004)
java.lang.AssertionError: org.eclipse.jdt.core.util.ClassFormatException
	at org.junit.Assert.fail(Assert.java:91)
	at org.eclipse.jdt.groovy.core.tests.basic.GroovyCompilerTestSuite.checkDisassemblyFor(GroovyCompilerTestSuite.java:290)
	at org.eclipse.jdt.groovy.core.tests.basic.GroovySimpleTests.testDefaultValueMethods02(GroovySimpleTests.java:4004)
java.lang.AssertionError: org.eclipse.jdt.core.util.ClassFormatException
	at org.junit.Assert.fail(Assert.java:91)
	at org.eclipse.jdt.groovy.core.tests.basic.GroovyCompilerTestSuite.checkDisassemblyFor(GroovyCompilerTestSuite.java:290)
	at org.eclipse.jdt.groovy.core.tests.basic.GroovySimpleTests.testDefaultValueConstructors(GroovySimpleTests.java:4064)
java.lang.AssertionError: org.eclipse.jdt.core.util.ClassFormatException
	at org.junit.Assert.fail(Assert.java:91)
	at org.eclipse.jdt.groovy.core.tests.basic.GroovyCompilerTestSuite.checkDisassemblyFor(GroovyCompilerTestSuite.java:290)
	at org.eclipse.jdt.groovy.core.tests.basic.GroovySimpleTests.testDefaultValueConstructors(GroovySimpleTests.java:4064)
java.lang.AssertionError: org.eclipse.jdt.core.util.ClassFormatException
	at org.junit.Assert.fail(Assert.java:91)
	at org.eclipse.jdt.groovy.core.tests.basic.GroovyCompilerTestSuite.checkDisassemblyFor(GroovyCompilerTestSuite.java:290)
	at org.eclipse.jdt.groovy.core.tests.basic.GroovySimpleTests.testDefaultValueMethods02(GroovySimpleTests.java:4004)
java.lang.AssertionError: org.eclipse.jdt.core.util.ClassFormatException
	at org.junit.Assert.fail(Assert.java:91)
	at org.eclipse.jdt.groovy.core.tests.basic.GroovyCompilerTestSuite.checkDisassemblyFor(GroovyCompilerTestSuite.java:290)
	at org.eclipse.jdt.groovy.core.tests.basic.GroovySimpleTests.testDefaultValueMethods(GroovySimpleTests.java:3952)
java.lang.AssertionError: org.eclipse.jdt.core.util.ClassFormatException
	at org.junit.Assert.fail(Assert.java:91)
	at org.eclipse.jdt.groovy.core.tests.basic.GroovyCompilerTestSuite.checkDisassemblyFor(GroovyCompilerTestSuite.java:290)
	at org.eclipse.jdt.groovy.core.tests.basic.GroovySimpleTests.testDefaultValueConstructors(GroovySimpleTests.java:4064)