Build: #261 failed Changes by Eric Milles

Build result summary

Details

Completed
Duration
106 minutes
Labels
None
Agent
bamboo-20.af.pivotal.io
Revision
8bbefb7014e4e5788b584f75049da74526ce3016 8bbefb7014e4e5788b584f75049da74526ce3016
Total tests
5731
Failing since
#253 (Changes by Eric Milles)
Fixed in
#270 (Changes by Eric Milles)

Responsible

Code commits

Author Commit Message Commit date
Eric Milles Eric Milles 8bbefb7014e4e5788b584f75049da74526ce3016 8bbefb7014e4e5788b584f75049da74526ce3016 retry with http

Tests

New test failures 4
Status Test View job Duration
Collapse Failed DGMInferencingTests testDGM15 History
Default Job < 1 sec
java.lang.AssertionError: Expected type not found.
Expected: java.util.Map$Entry<java.lang.String,java.lang.Integer>
Found: java.lang.Object
Declaring type: groovy.lang.Closure<V extends java.lang.Object>
ASTNode: org.codehaus.groovy.ast.expr.VariableExpression@f4ba7[variable: it]
Confidence: INFERRED

java.lang.AssertionError: 
(9 more lines...)
Collapse Failed Groovy20InferencingTests testCompileStatic13 History
Default Job < 1 sec
java.lang.AssertionError: Expected type not found.
Expected: java.lang.Number
Found: java.lang.String
Declaring type: X
ASTNode: org.codehaus.groovy.ast.expr.ConstantExpression@11125f[readOnly]
Confidence: UNKNOWN

java.lang.AssertionError: 
(8 more lines...)
Collapse Failed OperatorOverloadingInferencingTests testLongExpr2 History
Default Job < 1 sec
java.lang.AssertionError: Expected type not found.
Expected: Foo
Found: java.util.List<Foo>
Declaring type: Search
ASTNode: org.codehaus.groovy.ast.expr.VariableExpression@1061bc[variable: xxx]
Confidence: INFERRED

java.lang.AssertionError: 
(8 more lines...)
Collapse Failed StaticInferencingTests testClassReference14 History
Default Job < 1 sec
java.lang.NoClassDefFoundError: org/codehaus/groovy/runtime/DefaultGroovyMethodsSupport
	at org.eclipse.jdt.core.groovy.tests.search.StaticInferencingTests.assertKnown(StaticInferencingTests.java:35)
	at org.eclipse.jdt.core.groovy.tests.search.StaticInferencingTests.testClassReference14(StaticInferencingTests.java:139)
Caused by: java.lang.ClassNotFoundException: org.codehaus.groovy.runtime.DefaultGroovyMethodsSupport
	at org.eclipse.jdt.core.groovy.tests.search.StaticInferencingTests.assertKnown(StaticInferencingTests.java:35)
	at org.eclipse.jdt.core.groovy.tests.search.StaticInferencingTests.testClassReference14(StaticInferencingTests.java:139)
Existing test failures 3
Status Test Failing since View job Duration
org.junit.ComparisonFailure: unexpected recompiled units. lenExpected=3 lenActual=4 expected:<...st.Class1,test.Class[]2,test.Class3}> but was:<...st.Class1,test.Class[1,test.Class]2,test.Class3}>
	at org.eclipse.jdt.core.groovy.tests.builder.BasicGroovyBuildTests.testGRE1773(BasicGroovyBuildTests.java:3422)
org.junit.runners.model.TestTimedOutException: test timed out after 1500 milliseconds
	at org.eclipse.jdt.groovy.core.tests.basic.EnumerationTests.testEnum4438(EnumerationTests.java:316)
org.junit.runners.model.TestTimedOutException: test timed out after 1500 milliseconds
	at org.eclipse.jdt.groovy.core.tests.basic.EnumerationTests.testEnum4438(EnumerationTests.java:316)
Fixed tests 7
Status Test Failing since View job Duration
Successful ClosureInferencingTests testClosure16 History
Failing since build #260 (Changes by Eric Milles) Default Job < 1 sec
Successful ClosureInferencingTests testNestedClosure7 History
Failing since build #260 (Changes by Eric Milles) Default Job < 1 sec
Successful ClosureInferencingTests testNestedClosure6 History
Failing since build #260 (Changes by Eric Milles) Default Job < 1 sec
Successful DGMInferencingTests testDGMClosure3 History
Failing since build #260 (Changes by Eric Milles) Default Job < 1 sec
Successful InferencingTests testLocalVar14 History
Failing since build #260 (Changes by Eric Milles) Default Job 1 sec
Successful InferencingTests testAnonInner1 History
Failing since build #260 (Changes by Eric Milles) Default Job < 1 sec
Successful OperatorOverloadingInferencingTests testNumberPlusString1 History
Failing since build #260 (Changes by Eric Milles) Default Job < 1 sec