Build: #334 failed Changes by Eric Milles

Build result summary

Details

Completed
Duration
106 minutes
Labels
None
Agent
bamboo-16.af.pivotal.io
Revision
cfc61efdfe3d1d3d4796bfb51e1097e068824722 cfc61efdfe3d1d3d4796bfb51e1097e068824722
Total tests
5965
Failing since
#332 (Changes by Eric Milles)
Fixed in
#346 (Changes by Eric Milles)

Responsible

Code commits

Author Commit Message Commit date
Eric Milles Eric Milles cfc61efdfe3d1d3d4796bfb51e1097e068824722 cfc61efdfe3d1d3d4796bfb51e1097e068824722 Fix for #943: defer check for action enablement

Tests

New test failures 10
Status Test View job Duration
Collapse Failed GroovyContentTypeTests testJavaOnlyProject History
Default Job < 1 sec
java.lang.AssertionError: L/Project/bin/p1/HelloJava.class should exist
	at org.eclipse.jdt.core.groovy.tests.model.GroovyContentTypeTests.checkJavaProject(GroovyContentTypeTests.java:152)
	at org.eclipse.jdt.core.groovy.tests.model.GroovyContentTypeTests.testJavaOnlyProject(GroovyContentTypeTests.java:70)
Collapse Failed ArrayInferencingTests testArray6 History
Default Job < 1 sec
java.lang.AssertionError: Expected type not found.
Expected: java.lang.CharSequence
Found: java.lang.CharSequence[]
Declaring type: null
ASTNode: org.codehaus.groovy.ast.expr.BinaryExpression@f47e7[org.codehaus.groovy.ast.expr.VariableExpression@f47e4[variable: x]("[" at 1:51:  "[" )org.codehaus.groovy.ast.expr.VariableExpression@f4f68[variable: i type: java.lang.Integer]]
Confidence: EXACT

java.lang.AssertionError: 
(9 more lines...)
Collapse Failed BinarySearchTests testMethodRefInInitializer History
Default Job 1 sec
java.lang.AssertionError: Expecting 2 matches, but found 0

java.lang.AssertionError: 
Expecting 2 matches, but found 0

	at org.eclipse.jdt.core.groovy.tests.search.BinarySearchTests.assertMatches(BinarySearchTests.java:135)
	at org.eclipse.jdt.core.groovy.tests.search.BinarySearchTests.testMethodRefInInitializer(BinarySearchTests.java:213)
Collapse Failed ClosureInferencingTests testClosure27 History
Default Job < 1 sec
java.lang.NoClassDefFoundError: org/codehaus/groovy/runtime/DefaultGroovyMethodsSupport
	at org.eclipse.jdt.core.groovy.tests.search.ClosureInferencingTests.testClosure27(ClosureInferencingTests.java:519)
Caused by: java.lang.ClassNotFoundException: org.codehaus.groovy.runtime.DefaultGroovyMethodsSupport
	at org.eclipse.jdt.core.groovy.tests.search.ClosureInferencingTests.testClosure27(ClosureInferencingTests.java:519)
Collapse Failed ConstructorReferenceSearchTests testConstructorReferences13 History
Default Job < 1 sec
java.lang.AssertionError: expected:<1> but was:<0>
	at org.eclipse.jdt.core.groovy.tests.search.ConstructorReferenceSearchTests.testConstructorReferences13(ConstructorReferenceSearchTests.java:349)
Collapse Failed ConstructorReferenceSearchTests testConstructorReferences12 History
Default Job < 1 sec
java.lang.AssertionError: expected:<2> but was:<0>
	at org.eclipse.jdt.core.groovy.tests.search.ConstructorReferenceSearchTests.testConstructorReferences12(ConstructorReferenceSearchTests.java:313)
Collapse Failed ConstructorReferenceSearchTests testConstructorReferences11 History
Default Job < 1 sec
java.lang.AssertionError: expected:<2> but was:<0>
	at org.eclipse.jdt.core.groovy.tests.search.ConstructorReferenceSearchTests.testConstructorReferences11(ConstructorReferenceSearchTests.java:276)
Collapse Failed DGMInferencingTests testDGMClosure18 History
Default Job < 1 sec
java.lang.AssertionError: Expected type not found.
Expected: java.util.Date
Found: java.lang.Object
Declaring type: Search
ASTNode: org.codehaus.groovy.ast.expr.VariableExpression@f1ace[variable: val]
Confidence: INFERRED

java.lang.AssertionError: 
(9 more lines...)
Collapse Failed DGMInferencingTests testDGM23 History
Default Job < 1 sec
java.lang.AssertionError: Expected type not found.
Expected: java.lang.String
Found: java.lang.Object
Declaring type: Search
ASTNode: org.codehaus.groovy.ast.expr.VariableExpression@f2252[variable: key]
Confidence: INFERRED

java.lang.AssertionError: 
(9 more lines...)
Collapse Failed MethodReferenceSearchTests testExplicitPropertySetterSearch1 History
Default Job 1 sec
java.lang.AssertionError: expected:<5> but was:<0>
	at org.eclipse.jdt.core.groovy.tests.search.MethodReferenceSearchTests.testExplicitPropertySetterSearch1(MethodReferenceSearchTests.java:549)
Fixed tests 3
Status Test Failing since View job Duration
Successful ConstructorReferenceSearchTests testNewifyConstructorReferences1 History
Failing since build #333 (Changes by Eric Milles) Default Job < 1 sec
Successful MethodReferenceSearchTests testExplicitPropertyGetterSearch1 History
Failing since build #332 (Changes by Eric Milles) Default Job < 1 sec
Successful MethodReferenceSearchTests testMethodWithDefaultParameters3 History
Failing since build #333 (Changes by Eric Milles) Default Job < 1 sec