Build: #371 failed Changes by Eric Milles

Build result summary

Details

Completed
Duration
92 minutes
Labels
None
Agent
bamboo-24.af.pivotal.io
Revision
a46793942b5faf7a7467849c54f2be6210cec5ad a46793942b5faf7a7467849c54f2be6210cec5ad
Total tests
6033
Failing since
#369 (Changes by Eric Milles)

Responsible

Code commits

Author Commit Message Commit date
Eric Milles Eric Milles a46793942b5faf7a7467849c54f2be6210cec5ad a46793942b5faf7a7467849c54f2be6210cec5ad ensureInitialized(in-progress project, synchronous) must waitForFinish()

Tests

New test failures 4
Status Test View job Duration
Collapse Failed BasicGroovyBuildTests testTaskMarkerSharedDescription History
Default Job < 1 sec
java.lang.AssertionError: Wrong size expected:<2> but was:<0>
	at org.eclipse.jdt.core.groovy.tests.builder.BasicGroovyBuildTests.testTaskMarkerSharedDescription(BasicGroovyBuildTests.java:2813)
Collapse Failed DGMInferencingTests testDGM47 History
Default Job < 1 sec
java.lang.AssertionError: Expected type not found.
Expected: java.util.List<java.lang.Object>
Found: java.lang.String
Declaring type: java.lang.String
ASTNode: org.codehaus.groovy.ast.expr.ConstantExpression@ff4c6[collect]
Confidence: UNKNOWN

java.lang.AssertionError: 
(9 more lines...)
Collapse Failed DGMInferencingTests testDGMClosure17 History
Default Job < 1 sec
java.lang.AssertionError: Expected type not found.
Expected: java.lang.Integer
Found: java.lang.Object
Declaring type: Search
ASTNode: org.codehaus.groovy.ast.expr.VariableExpression@f1ace[variable: key]
Confidence: INFERRED

java.lang.AssertionError: 
(9 more lines...)
Collapse Failed Groovy20InferencingTests testCompileStatic13 History
Default Job < 1 sec
java.lang.AssertionError: Expected type not found.
Expected: java.lang.Number
Found: java.lang.String
Declaring type: X
ASTNode: org.codehaus.groovy.ast.expr.ConstantExpression@11125f[readOnly]
Confidence: UNKNOWN

java.lang.AssertionError: 
(8 more lines...)
Fixed tests 5
Status Test Failing since View job Duration
Successful DGMInferencingTests testDGMClosure5 History
Failing since build #370 (Changes by Eric Milles) Default Job < 1 sec
Successful DGMInferencingTests testDGMClosure14 History
Failing since build #370 (Changes by Eric Milles) Default Job < 1 sec
Successful DGMInferencingTests testDGM40 History
Failing since build #370 (Changes by Eric Milles) Default Job < 1 sec
Successful DGMInferencingTests testDGM36 History
Failing since build #370 (Changes by Eric Milles) Default Job < 1 sec
Successful OperatorOverloadingInferencingTests testGetAt3 History
Failing since build #370 (Changes by Eric Milles) Default Job < 1 sec