Build: #376 failed Changes by Eric Milles

Build result summary

Details

Completed
Duration
92 minutes
Labels
None
Agent
bamboo-24.af.pivotal.io
Revision
4444e6092b4f2b618350439146f134a8e011b081 4444e6092b4f2b618350439146f134a8e011b081
Total tests
6038
Failing since
#369 (Changes by Eric Milles)

Responsible

Code commits

Author Commit Message Commit date
Eric Milles Eric Milles 4444e6092b4f2b618350439146f134a8e011b081 4444e6092b4f2b618350439146f134a8e011b081 GROOVY-9265
Eric Milles Eric Milles 786f40b7ab90b961b81e5d5e6ac9028346b3e302 786f40b7ab90b961b81e5d5e6ac9028346b3e302 Fix for #967: look for interface default methods on concrete types

Tests

New test failures 4
Status Test View job Duration
Collapse Failed BasicGroovyBuildTests testUpdateProjectPreferences History
Default Job < 1 sec
junit.framework.ComparisonFailure: 
----------- Expected ------------

------------ but was ------------
Problem : The import util.MyException is never used [ resource : </Project/src/p/Test.java> range : <18,34> category : <120> severity : <1>]

--------- Difference is ----------
 expected:<[]> but was:<[Problem : The import util.MyException is never used [ resource : </Project/src/p/Test.java> range : <18,34> category : <120> severity : <1>]
(12 more lines...)
Collapse Failed ClosureInferencingTests testClosure24 History
Default Job < 1 sec
java.lang.AssertionError: Expected type not found.
Expected: java.lang.Long
Found: java.lang.Object
Declaring type: Search
ASTNode: org.codehaus.groovy.ast.expr.VariableExpression@f29d7[variable: time]
Confidence: UNKNOWN

java.lang.AssertionError: 
(8 more lines...)
Collapse Failed DGMInferencingTests testDGM23 History
Default Job < 1 sec
java.lang.AssertionError: Expected type not found.
Expected: java.lang.String
Found: java.lang.Object
Declaring type: Search
ASTNode: org.codehaus.groovy.ast.expr.VariableExpression@f2252[variable: key]
Confidence: INFERRED

java.lang.AssertionError: 
(9 more lines...)
Collapse Failed DGMInferencingTests testDGM15 History
Default Job < 1 sec
java.lang.AssertionError: Expected type not found.
Expected: java.util.Map$Entry<java.lang.String,java.lang.Integer>
Found: java.lang.Object
Declaring type: groovy.lang.Closure<V extends java.lang.Object>
ASTNode: org.codehaus.groovy.ast.expr.VariableExpression@f4ba7[variable: it]
Confidence: INFERRED

java.lang.AssertionError: 
(9 more lines...)
Fixed tests 6
Status Test Failing since View job Duration
Successful BasicGroovyBuildTests testCompileStatic2 History
Failing since build #375 (Changes by Eric Milles) Default Job < 1 sec
Successful BasicGroovyBuildTests testNoDoubleResolve History
Failing since build #375 (Changes by Eric Milles) Default Job < 1 sec
Successful DGMInferencingTests testDGM29 History
Failing since build #375 (Changes by Eric Milles) Default Job < 1 sec
Successful DGMInferencingTests testDGM20 History
Failing since build #375 (Changes by Eric Milles) Default Job < 1 sec
Successful DeclarationInferencingTests testCategoryMethod1 History
Failing since build #375 (Changes by Eric Milles) Default Job < 1 sec
Successful OperatorOverloadingInferencingTests testGetAt5 History
Failing since build #375 (Changes by Eric Milles) Default Job < 1 sec

Jira issues

IssueDescriptionStatus
Unknown Issue TypeGROOVY-9265Could not obtain issue details from Jira