Build: #386 failed Changes by Eric Milles

Build result summary

Details

Completed
Duration
93 minutes
Labels
None
Agent
bamboo-18.af.pivotal.io
Revision
6d08a56b086f0347954a67e99772b6974c78f2f7 6d08a56b086f0347954a67e99772b6974c78f2f7
Total tests
6059
Failing since
#369 (Changes by Eric Milles)

Responsible

Code commits

Author Commit Message Commit date
Eric Milles Eric Milles 6d08a56b086f0347954a67e99772b6974c78f2f7 6d08a56b086f0347954a67e99772b6974c78f2f7 Fix for #971: off-by-one errors in GroovyCompilationUnitDeclaration

Configuration changes

Plan configuration has changed since the last successful build. See the plan audit log for more details.

Tests

New test failures 8
Status Test View job Duration
Collapse Failed BinarySearchTests testFieldDecl1 History
Default Job 1 sec
java.lang.AssertionError: Expecting 2 matches, but found 0

java.lang.AssertionError: 
Expecting 2 matches, but found 0

	at org.eclipse.jdt.core.groovy.tests.search.BinarySearchTests.assertMatches(BinarySearchTests.java:139)
	at org.eclipse.jdt.core.groovy.tests.search.BinarySearchTests.testFieldDecl1(BinarySearchTests.java:181)
Collapse Failed BinarySearchTests testMethodRefInInitializer History
Default Job 1 sec
java.lang.AssertionError: Expecting 2 matches, but found 0

java.lang.AssertionError: 
Expecting 2 matches, but found 0

	at org.eclipse.jdt.core.groovy.tests.search.BinarySearchTests.assertMatches(BinarySearchTests.java:139)
	at org.eclipse.jdt.core.groovy.tests.search.BinarySearchTests.testMethodRefInInitializer(BinarySearchTests.java:217)
Collapse Failed ClosureInferencingTests testWithAndClosure6 History
Default Job < 1 sec
java.lang.AssertionError: Expected declaring type not found.
 Expected: p.A
 Found type: java.lang.String
 Found declaring type: java.lang.Object
 ASTNode: org.codehaus.groovy.ast.expr.ConstantExpression@1146f6[foo]
java.lang.AssertionError: 
Expected declaring type not found.
	Expected: p.A
(4 more lines...)
Collapse Failed ConstructorReferenceSearchTests testNewifyConstructorReferences2 History
Default Job < 1 sec
java.lang.AssertionError: expected:<2> but was:<0>
	at org.eclipse.jdt.core.groovy.tests.search.ConstructorReferenceSearchTests.testNewifyConstructorReferences2(ConstructorReferenceSearchTests.java:408)
Collapse Failed ConstructorReferenceSearchTests testConstructorReferences1 History
Default Job < 1 sec
java.lang.AssertionError: Incorrect number of matches; expected:<3> but was:<0>
	at org.eclipse.jdt.core.groovy.tests.search.ConstructorReferenceSearchTests.testConstructorReferences1(ConstructorReferenceSearchTests.java:59)
Collapse Failed ConstructorReferenceSearchTests testConstructorReferences12 History
Default Job < 1 sec
java.lang.AssertionError: expected:<2> but was:<0>
	at org.eclipse.jdt.core.groovy.tests.search.ConstructorReferenceSearchTests.testConstructorReferences12(ConstructorReferenceSearchTests.java:313)
Collapse Failed ConstructorReferenceSearchTests testConstructorReferences4 History
Default Job < 1 sec
java.lang.AssertionError: expected:<2> but was:<0>
	at org.eclipse.jdt.core.groovy.tests.search.ConstructorReferenceSearchTests.testConstructorReferences4(ConstructorReferenceSearchTests.java:144)
Collapse Failed MethodReferenceSearchTests testExplicitPropertySetterSearch1 History
Default Job < 1 sec
java.lang.AssertionError: expected:<5> but was:<0>
	at org.eclipse.jdt.core.groovy.tests.search.MethodReferenceSearchTests.testExplicitPropertySetterSearch1(MethodReferenceSearchTests.java:569)
Existing test failures 2
Status Test Failing since View job Duration
junit.framework.ComparisonFailure: 
----------- Expected ------------

------------ but was ------------
Problem : The import util.MyException is never used [ resource : </Project/src/p/Test.java> range : <18,34> category : <120> severity : <1>]

--------- Difference is ----------
 expected:<[]> but was:<[Problem : The import util.MyException is never used [ resource : </Project/src/p/Test.java> range : <18,34> category : <120> severity : <1>]
(12 more lines...)
java.lang.AssertionError: expected:<3> but was:<0>
	at org.eclipse.jdt.core.groovy.tests.search.ConstructorReferenceSearchTests.testConstructorReferences3(ConstructorReferenceSearchTests.java:126)
Fixed tests 23
Status Test Failing since View job Duration
Successful RenameMethodTests testInitializer3 History
Failing since build #385 (Changes by Eric Milles) Default Job 1 sec
Successful RenameMethodTests testStaticImport History
Failing since build #385 (Changes by Eric Milles) Default Job 1 sec
Successful RenameMethodTests testEnumOverrides History
Failing since build #385 (Changes by Eric Milles) Default Job 1 sec
Successful RenameMethodTests testEnumOverrides2 History
Failing since build #385 (Changes by Eric Milles) Default Job 1 sec
Successful RenameMethodTests testAnonOverrides History
Failing since build #385 (Changes by Eric Milles) Default Job 9 secs
Successful RenameMethodTests testOverload3 History
Failing since build #385 (Changes by Eric Milles) Default Job 2 secs
Successful RenameMethodTests testOverload2 History
Failing since build #385 (Changes by Eric Milles) Default Job 2 secs
Successful RenameMethodTests testOverload1 History
Failing since build #385 (Changes by Eric Milles) Default Job 2 secs
Successful RenameMethodTests test4 History
Failing since build #385 (Changes by Eric Milles) Default Job 1 sec
Successful RenameMethodTests test5 History
Failing since build #385 (Changes by Eric Milles) Default Job 1 sec
Successful RenameMethodTests test2 History
Failing since build #385 (Changes by Eric Milles) Default Job 1 sec
Successful RenameMethodTests test3 History
Failing since build #385 (Changes by Eric Milles) Default Job 1 sec
Successful RenameMethodTests test8 History
Failing since build #385 (Changes by Eric Milles) Default Job 1 sec
Successful RenameMethodTests test9 History
Failing since build #385 (Changes by Eric Milles) Default Job 1 sec
Successful RenameMethodTests test6 History
Failing since build #385 (Changes by Eric Milles) Default Job 1 sec
Successful RenameMethodTests test7 History
Failing since build #385 (Changes by Eric Milles) Default Job 1 sec
Successful RenameMethodTests test1 History
Failing since build #385 (Changes by Eric Milles) Default Job 1 sec
Successful RenameMethodTests testInitializer1 History
Failing since build #385 (Changes by Eric Milles) Default Job 1 sec
Successful RenameMethodTests testInitializer2 History
Failing since build #385 (Changes by Eric Milles) Default Job 1 sec
Successful ClosureInferencingTests testNestedClosure6 History
Failing since build #385 (Changes by Eric Milles) Default Job < 1 sec
Successful ClosureInferencingTests testClosure11 History
Failing since build #385 (Changes by Eric Milles) Default Job < 1 sec
Successful ConstructorReferenceSearchTests testConstructorReferences7 History
Failing since build #385 (Changes by Eric Milles) Default Job < 1 sec
Successful InferencingTests testNothingIsUnknownWithCategories History
Failing since build #384 (Changes by Eric Milles) Default Job < 1 sec