Build: #386 failed Changes by Eric Milles

Test results

  • 6,059 tests in total
  • 10 tests failed
  • 8 failures are new
  • 23 tests were fixed
  • 122 tests were quarantined / skipped
  • 86 minutes taken in total.
New test failures 8
Status Test View job Duration
Collapse Failed BinarySearchTests testFieldDecl1 History
Default Job 1 sec
java.lang.AssertionError: Expecting 2 matches, but found 0

java.lang.AssertionError: 
Expecting 2 matches, but found 0

	at org.eclipse.jdt.core.groovy.tests.search.BinarySearchTests.assertMatches(BinarySearchTests.java:139)
	at org.eclipse.jdt.core.groovy.tests.search.BinarySearchTests.testFieldDecl1(BinarySearchTests.java:181)
Collapse Failed BinarySearchTests testMethodRefInInitializer History
Default Job 1 sec
java.lang.AssertionError: Expecting 2 matches, but found 0

java.lang.AssertionError: 
Expecting 2 matches, but found 0

	at org.eclipse.jdt.core.groovy.tests.search.BinarySearchTests.assertMatches(BinarySearchTests.java:139)
	at org.eclipse.jdt.core.groovy.tests.search.BinarySearchTests.testMethodRefInInitializer(BinarySearchTests.java:217)
Collapse Failed ClosureInferencingTests testWithAndClosure6 History
Default Job < 1 sec
java.lang.AssertionError: Expected declaring type not found.
 Expected: p.A
 Found type: java.lang.String
 Found declaring type: java.lang.Object
 ASTNode: org.codehaus.groovy.ast.expr.ConstantExpression@1146f6[foo]
java.lang.AssertionError: 
Expected declaring type not found.
	Expected: p.A
(4 more lines...)
Collapse Failed ConstructorReferenceSearchTests testNewifyConstructorReferences2 History
Default Job < 1 sec
java.lang.AssertionError: expected:<2> but was:<0>
	at org.eclipse.jdt.core.groovy.tests.search.ConstructorReferenceSearchTests.testNewifyConstructorReferences2(ConstructorReferenceSearchTests.java:408)
Collapse Failed ConstructorReferenceSearchTests testConstructorReferences1 History
Default Job < 1 sec
java.lang.AssertionError: Incorrect number of matches; expected:<3> but was:<0>
	at org.eclipse.jdt.core.groovy.tests.search.ConstructorReferenceSearchTests.testConstructorReferences1(ConstructorReferenceSearchTests.java:59)
Collapse Failed ConstructorReferenceSearchTests testConstructorReferences12 History
Default Job < 1 sec
java.lang.AssertionError: expected:<2> but was:<0>
	at org.eclipse.jdt.core.groovy.tests.search.ConstructorReferenceSearchTests.testConstructorReferences12(ConstructorReferenceSearchTests.java:313)
Collapse Failed ConstructorReferenceSearchTests testConstructorReferences4 History
Default Job < 1 sec
java.lang.AssertionError: expected:<2> but was:<0>
	at org.eclipse.jdt.core.groovy.tests.search.ConstructorReferenceSearchTests.testConstructorReferences4(ConstructorReferenceSearchTests.java:144)
Collapse Failed MethodReferenceSearchTests testExplicitPropertySetterSearch1 History
Default Job < 1 sec
java.lang.AssertionError: expected:<5> but was:<0>
	at org.eclipse.jdt.core.groovy.tests.search.MethodReferenceSearchTests.testExplicitPropertySetterSearch1(MethodReferenceSearchTests.java:569)
Existing test failures 2
Status Test Failing since View job Duration
junit.framework.ComparisonFailure: 
----------- Expected ------------

------------ but was ------------
Problem : The import util.MyException is never used [ resource : </Project/src/p/Test.java> range : <18,34> category : <120> severity : <1>]

--------- Difference is ----------
 expected:<[]> but was:<[Problem : The import util.MyException is never used [ resource : </Project/src/p/Test.java> range : <18,34> category : <120> severity : <1>]
(12 more lines...)
java.lang.AssertionError: expected:<3> but was:<0>
	at org.eclipse.jdt.core.groovy.tests.search.ConstructorReferenceSearchTests.testConstructorReferences3(ConstructorReferenceSearchTests.java:126)
Fixed tests 23
Status Test Failing since View job Duration
Successful RenameMethodTests testInitializer3 History
Failing since build #385 (Changes by Eric Milles) Default Job 1 sec
Successful RenameMethodTests testStaticImport History
Failing since build #385 (Changes by Eric Milles) Default Job 1 sec
Successful RenameMethodTests testEnumOverrides History
Failing since build #385 (Changes by Eric Milles) Default Job 1 sec
Successful RenameMethodTests testEnumOverrides2 History
Failing since build #385 (Changes by Eric Milles) Default Job 1 sec
Successful RenameMethodTests testAnonOverrides History
Failing since build #385 (Changes by Eric Milles) Default Job 9 secs
Successful RenameMethodTests testOverload3 History
Failing since build #385 (Changes by Eric Milles) Default Job 2 secs
Successful RenameMethodTests testOverload2 History
Failing since build #385 (Changes by Eric Milles) Default Job 2 secs
Successful RenameMethodTests testOverload1 History
Failing since build #385 (Changes by Eric Milles) Default Job 2 secs
Successful RenameMethodTests test4 History
Failing since build #385 (Changes by Eric Milles) Default Job 1 sec
Successful RenameMethodTests test5 History
Failing since build #385 (Changes by Eric Milles) Default Job 1 sec
Successful RenameMethodTests test2 History
Failing since build #385 (Changes by Eric Milles) Default Job 1 sec
Successful RenameMethodTests test3 History
Failing since build #385 (Changes by Eric Milles) Default Job 1 sec
Successful RenameMethodTests test8 History
Failing since build #385 (Changes by Eric Milles) Default Job 1 sec
Successful RenameMethodTests test9 History
Failing since build #385 (Changes by Eric Milles) Default Job 1 sec
Successful RenameMethodTests test6 History
Failing since build #385 (Changes by Eric Milles) Default Job 1 sec
Successful RenameMethodTests test7 History
Failing since build #385 (Changes by Eric Milles) Default Job 1 sec
Successful RenameMethodTests test1 History
Failing since build #385 (Changes by Eric Milles) Default Job 1 sec
Successful RenameMethodTests testInitializer1 History
Failing since build #385 (Changes by Eric Milles) Default Job 1 sec
Successful RenameMethodTests testInitializer2 History
Failing since build #385 (Changes by Eric Milles) Default Job 1 sec
Successful ClosureInferencingTests testNestedClosure6 History
Failing since build #385 (Changes by Eric Milles) Default Job < 1 sec
Successful ClosureInferencingTests testClosure11 History
Failing since build #385 (Changes by Eric Milles) Default Job < 1 sec
Successful ConstructorReferenceSearchTests testConstructorReferences7 History
Failing since build #385 (Changes by Eric Milles) Default Job < 1 sec
Successful InferencingTests testNothingIsUnknownWithCategories History
Failing since build #384 (Changes by Eric Milles) Default Job < 1 sec
Skipped tests 100
Status Test Failing since View job
Skipped ConstructorCompletionTests testNamedArgumentTrigger2 History
Default Job
Skipped DefaultGroovyMethodCompletionTests testDateGM History
Default Job
Skipped MethodCompletionTests testMethodPointer4a History
Default Job
Skipped MethodCompletionTests testMethodPointer2a History
Default Job
Skipped MethodCompletionTests testMethodPointer3a History
Default Job
Skipped MethodCompletionTests testMethodPointer1a History
Default Job
Skipped RelevanceTests testNewMethodThenModifier History
Default Job
Skipped CodeSelectKeywordsTests testCodeSelectKeywordDef5 History
Default Job
Skipped CodeSelectKeywordsTests testCodeSelectKeywordDef4 History
Default Job
Skipped CodeSelectTypesTests testSelectPackageOnFullyQualifiedName7b History
Default Job
Skipped CodeSelectTypesTests testSelectPackageOnFullyQualifiedName7 History
Default Job
Skipped CodeSelectTypesTests testSelectPackageOnFullyQualifiedName7a History
Default Job
Skipped BuiltInDSLInferencingTests testSwingBuilder1 History
Default Job
Skipped BuiltInDSLInferencingTests testSwingBuilder2 History
Default Job
Skipped DSLContentAssistTests testSwingBuilder3 History
Default Job
Skipped DSLContentAssistTests testSwingBuilder1 History
Default Job
Skipped DSLContentAssistTests testSwingBuilder2 History
Default Job
Skipped MoveCURefactoringTests testInnerMove3 History
Default Job
Skipped MoveCURefactoringTests testInnerMove4 History
Default Job
Skipped MoveCURefactoringTests testInnerMove2 History
Default Job
Skipped MoveCURefactoringTests testInnerMove1 History
Default Job
Skipped RenameMethodTests testEnumOverrides3 History
Default Job
Skipped RenameMethodTests testDelegate1 History
Default Job
Skipped RenameMethodTests testDelegate2 History
Default Job
Skipped ExpressionFinderTests testComplex4 History
Default Job
Skipped ExpressionFinderTests testNoExpression1 History
Default Job
Skipped GroovyScriptLaunchShortcutTests testScriptLaunch11 History
Default Job
Skipped SemanticHighlightingTests testAnnoElems2 History
Default Job
Skipped SemanticHighlightingTests testVarKeyword3 History
Default Job
Skipped SemanticHighlightingTests testVarKeyword7 History
Default Job
Skipped SemanticHighlightingTests testTailCallMethods History
Default Job
Skipped SemanticHighlightingTests testMethodReference History
Default Job
Skipped SemanticHighlightingTests testForParams2 History
Default Job
Skipped SemanticHighlightingTests testForParams3 History
Default Job
Skipped SemanticHighlightingTests testForParams1 History
Default Job
Skipped SemanticHighlightingTests testVarKeyword4 History
Default Job
Skipped SemanticHighlightingTests testVarKeyword5 History
Default Job
Skipped SemanticHighlightingTests testVarKeyword6 History
Default Job
Skipped BasicGroovyBuildTests testSpock_GRE605_2 History
Default Job
Skipped BasicGroovyBuildTests testSpock_GRE605_1 History
Default Job
Skipped BasicGroovyBuildTests testSpock_GRE558 History
Default Job
Skipped SourceLocationsTests testSourceLocationsTrailingWhitespace2 History
Default Job
Skipped SourceLocationsTests testSourceLocationsTrailingWhitespace1 History
Default Job
Skipped SourceLocationsTests testErrorPositionForUnsupportedOperation History
Default Job
Skipped GroovyPartialModelTests testFieldInitializerIsAvailable4 History
Default Job
Skipped GroovyPartialModelTests testFieldInitializerIsAvailable3 History
Default Job
Skipped DGMInferencingTests testDGM45a History
Default Job
Skipped DGMInferencingTests testDGSMDeclaring1 History
Default Job
Skipped DGMInferencingTests testDGM43 History
Default Job
Skipped GenericInferencingTests testJira1718 History
Default Job
Skipped GenericInferencingTests testStaticMethod8 History
Default Job
Skipped Groovy25InferencingTests org.eclipse.jdt.core.groovy.tests.search.Groovy25InferencingTests History
Default Job
Skipped InferencingTests testGetAt8 History
Default Job
Skipped InferencingTests testGetAt9 History
Default Job
Skipped MethodReferenceSearchTests testMethodWithDefaultParameters4 History
Default Job
Skipped MethodReferenceSearchTests testOverloadedMethodReferences5a History
Default Job
Skipped SpockInferencingTests testEqualsCheck History
Default Job
Skipped SpockInferencingTests testPropertyCheck History
Default Job
Skipped SpockInferencingTests testGetterCheck History
Default Job
Skipped SpockInferencingTests testBasics History
Default Job
Skipped SpockInferencingTests testDataTableChecks History
Default Job
Skipped StaticInferencingTests testStaticImport14 History
Default Job
Skipped StaticInferencingTests testStaticImport13 History
Default Job
Skipped StaticInferencingTests testStaticImport15 History
Default Job
Skipped AnnotationsTests testCharLiteralAttributeValue[Java 1.8] History
Default Job
Skipped AnnotationsTests testDoubleLiteralAttributeDefault2a[Java 1.8] History
Default Job
Skipped AnnotationsTests testDoubleLiteralAttributeDefault2[Java 1.8] History
Default Job
Skipped AnnotationsTests testDoubleLiteralAttributeDefault2a[Java 1.7] History
Default Job
Skipped AnnotationsTests testDoubleLiteralAttributeDefault2[Java 1.7] History
Default Job
Skipped AnnotationsTests testLongLiteralAttributeDefault2a[Java 1.8] History
Default Job
Skipped AnnotationsTests testLongLiteralAttributeDefault2[Java 1.7] History
Default Job
Skipped AnnotationsTests testLongLiteralAttributeDefault2a[Java 1.7] History
Default Job
Skipped AnnotationsTests testFloatLiteralAttributeDefault2a[Java 1.7] History
Default Job
Skipped AnnotationsTests testFloatLiteralAttributeDefault2a[Java 1.8] History
Default Job
Skipped AnnotationsTests testCharLiteralAttributeValue[Java 1.7] History
Default Job
Skipped AnnotationsTests testFloatLiteralAttributeDefault2[Java 1.8] History
Default Job
Skipped AnnotationsTests testLongLiteralAttributeDefault2[Java 1.8] History
Default Job
Skipped AnnotationsTests testFloatLiteralAttributeDefault2[Java 1.7] History
Default Job
Skipped EnumerationTests testEnums5b[Java 1.8] History
Default Job
Skipped EnumerationTests testEnums5b[Java 1.7] History
Default Job
Skipped GenericsTests testJava7_2[Java 1.7] History
Default Job
Skipped GenericsTests testGenericsPositions_6_GRE267[Java 1.8] History
Default Job
Skipped GenericsTests testGenericsPositions_6_GRE267[Java 1.7] History
Default Job
Skipped GenericsTests testExtendingGenerics_GroovyExtendsJava06[Java 1.8] History
Default Job
Skipped GenericsTests testExtendingGenerics_GroovyExtendsJava07[Java 1.8] History
Default Job
Skipped GenericsTests testExtendingGenerics_GroovyExtendsJava08[Java 1.8] History
Default Job
Skipped GenericsTests testJava7_2[Java 1.8] History
Default Job
Skipped GroovySimpleTests testMultiCatch0[Java 1.7] History
Default Job
Skipped GroovySimpleTests testMultiCatch0[Java 1.8] History
Default Job
Skipped Java8Tests testNonRepeatableAnnotation[Java 1.7] History
Default Job
Skipped Java8Tests testRepeatableAnnotation3[Java 1.7] History
Default Job
Skipped Java8Tests testFunctionalInterfaceCoercion[Java 1.7] History
Default Job
Skipped Java8Tests testRepeatableAnnotation2[Java 1.7] History
Default Job
Skipped Java8Tests testRepeatableAnnotation1[Java 1.7] History
Default Job
Skipped Java8Tests testDefaultAndStaticMethodInInterface[Java 1.7] History
Default Job
Skipped TraitsTests testTraits51[Java 1.7] History
Default Job
Skipped TraitsTests testTraits51[Java 1.8] History
Default Job
Skipped CanonicalTests testCanonical1[Java 1.7] History
Default Job
Skipped CanonicalTests testCanonical1[Java 1.8] History
Default Job
Skipped GrabTests org.eclipse.jdt.groovy.core.tests.xform.GrabTests History
Default Job