Build: #394 failed Changes by Eric Milles

Build result summary

Details

Completed
Duration
91 minutes
Labels
None
Agent
bamboo-22.af.pivotal.io
Revision
0a2be43a2140b588cd902e626377de7ebcfc75d5 0a2be43a2140b588cd902e626377de7ebcfc75d5
Total tests
6084
Failing since
#369 (Changes by Eric Milles)

Responsible

Code commits

Author Commit Message Commit date
Eric Milles Eric Milles 0a2be43a2140b588cd902e626377de7ebcfc75d5 0a2be43a2140b588cd902e626377de7ebcfc75d5 fix off-by-one error
#971
Eric Milles Eric Milles 1ae651b8c60678f0b354f5028d7f146535fe8a24 1ae651b8c60678f0b354f5028d7f146535fe8a24 fix debug/error/trace output handling
Eric Milles Eric Milles f23e2a3556d4e5cd9d7f766778dd04faf754fa1b f23e2a3556d4e5cd9d7f766778dd04faf754fa1b remove source folder jdt_src_patched
Eric Milles Eric Milles f48d6b5d50218dfa2639f8d97405f079f02347ce f48d6b5d50218dfa2639f8d97405f079f02347ce remove nowarn option

Configuration changes

Plan configuration has changed since the last successful build. See the plan audit log for more details.

Tests

New test failures 3
Status Test View job Duration
Collapse Failed BuildAccessRulesTests testAccessForExtendsGenerics History
Default Job < 1 sec
junit.framework.ComparisonFailure: 
----------- Expected ------------
Problem : Access restriction: The type 'BeanDescriptor' is not API (restriction on required library '##') [ resource : </Project/src/Foo.groovy> range : <57,71> category : <150> severity : <2>]

------------ but was ------------

--------- Difference is ----------
 expected:<[Problem : Access restriction: The type 'BeanDescriptor' is not API (restriction on required library '##') [ resource : </Project/src/Foo.groovy> range : <57,71> category : <150> severity : <2>]
(13 more lines...)
Collapse Failed ClosureInferencingTests testClosure23 History
Default Job < 1 sec
java.lang.AssertionError: Expected type not found.
Expected: java.lang.String
Found: java.lang.Object
Declaring type: Search
ASTNode: org.codehaus.groovy.ast.expr.ConstantExpression@f0bcc[substring]
Confidence: UNKNOWN

java.lang.AssertionError: 
(8 more lines...)
Collapse Failed DGMInferencingTests testDGMClosure14 History
Default Job < 1 sec
java.lang.AssertionError: Expected type not found.
Expected: java.lang.Integer
Found: java.lang.Object
Declaring type: Search
ASTNode: org.codehaus.groovy.ast.expr.VariableExpression@f3c9e[variable: i]
Confidence: INFERRED

java.lang.AssertionError: 
(9 more lines...)
Existing test failures 1
Status Test Failing since View job Duration
junit.framework.ComparisonFailure: 
----------- Expected ------------

------------ but was ------------
Problem : The import util.MyException is never used [ resource : </Project/src/p/Test.java> range : <18,34> category : <120> severity : <1>]

--------- Difference is ----------
 expected:<[]> but was:<[Problem : The import util.MyException is never used [ resource : </Project/src/p/Test.java> range : <18,34> category : <120> severity : <1>]
(12 more lines...)
Fixed tests 1
Status Test Failing since View job Duration
Successful BasicGroovyBuildTests testClosureIncremental History
Failing since build #393 (Changes by Eric Milles) Default Job 2 secs