Build: #399 failed Changes by Eric Milles

Build result summary

Details

Completed
Duration
94 minutes
Labels
None
Agent
bamboo-17.af.pivotal.io
Revision
dd002a140cf7d001788a7e80c4e9cc686f22851c dd002a140cf7d001788a7e80c4e9cc686f22851c
Total tests
6095
Failing since
#369 (Changes by Eric Milles)

Responsible

Code commits

Author Commit Message Commit date
Eric Milles Eric Milles dd002a140cf7d001788a7e80c4e9cc686f22851c dd002a140cf7d001788a7e80c4e9cc686f22851c Fix for #977: check logical-and expression for instanceof guard

Configuration changes

Plan configuration has changed since the last successful build. See the plan audit log for more details.

Tests

New test failures 8
Status Test View job Duration
Collapse Failed BasicGroovyBuildTests testFieldInitializerFromOtherFile History
Default Job < 1 sec
java.lang.NullPointerException
	at org.eclipse.jdt.core.groovy.tests.builder.BasicGroovyBuildTests.testFieldInitializerFromOtherFile(BasicGroovyBuildTests.java:2812)
Collapse Failed BuildAccessRulesTests testAccessForMethodReturnTypeGenerics History
Default Job < 1 sec
junit.framework.ComparisonFailure: 
----------- Expected ------------
Problem : Access restriction: The type 'BeanInfo' is not API (restriction on required library '##') [ resource : </Project/src/Foo.groovy> range : <39,47> category : <150> severity : <2>]

------------ but was ------------

--------- Difference is ----------
 expected:<[Problem : Access restriction: The type 'BeanInfo' is not API (restriction on required library '##') [ resource : </Project/src/Foo.groovy> range : <39,47> category : <150> severity : <2>]
(13 more lines...)
Collapse Failed GroovyContentTypeTests testJavaThenGroovyProject History
Default Job < 1 sec
java.lang.AssertionError: L/Project/bin/p1/HelloJava.class should exist
	at org.eclipse.jdt.core.groovy.tests.model.GroovyContentTypeTests.checkJavaProject(GroovyContentTypeTests.java:152)
	at org.eclipse.jdt.core.groovy.tests.model.GroovyContentTypeTests.testJavaThenGroovyProject(GroovyContentTypeTests.java:98)
Collapse Failed ClosureInferencingTests testClosure27 History
Default Job < 1 sec
java.lang.AssertionError: Expected type not found.
Expected: java.util.Date
Found: Search
Declaring type: groovy.lang.Closure<V extends java.lang.Object>
ASTNode: org.codehaus.groovy.ast.expr.VariableExpression@efcc3[variable: delegate]
Confidence: INFERRED

java.lang.AssertionError: 
(8 more lines...)
Collapse Failed ConstructorReferenceSearchTests testNewifyConstructorReferences2 History
Default Job < 1 sec
java.lang.AssertionError: expected:<2> but was:<0>
	at org.eclipse.jdt.core.groovy.tests.search.ConstructorReferenceSearchTests.testNewifyConstructorReferences2(ConstructorReferenceSearchTests.java:408)
Collapse Failed ConstructorReferenceSearchTests testConstructorReferences4 History
Default Job < 1 sec
java.lang.AssertionError: expected:<2> but was:<0>
	at org.eclipse.jdt.core.groovy.tests.search.ConstructorReferenceSearchTests.testConstructorReferences4(ConstructorReferenceSearchTests.java:144)
Collapse Failed ConstructorReferenceSearchTests testConstructorReferences13 History
Default Job < 1 sec
java.lang.AssertionError: expected:<1> but was:<0>
	at org.eclipse.jdt.core.groovy.tests.search.ConstructorReferenceSearchTests.testConstructorReferences13(ConstructorReferenceSearchTests.java:349)
Collapse Failed OperatorOverloadingInferencingTests testGetAt2 History
Default Job 1 sec
java.lang.AssertionError: Expected type not found.
Expected: Foo
Found: Foo[]
Declaring type: Search
ASTNode: org.codehaus.groovy.ast.expr.VariableExpression@fed3e[variable: xxx]
Confidence: INFERRED

java.lang.AssertionError: 
(8 more lines...)
Existing test failures 1
Status Test Failing since View job Duration
junit.framework.ComparisonFailure: 
----------- Expected ------------

------------ but was ------------
Problem : The import util.MyException is never used [ resource : </Project/src/p/Test.java> range : <18,34> category : <120> severity : <1>]

--------- Difference is ----------
 expected:<[]> but was:<[Problem : The import util.MyException is never used [ resource : </Project/src/p/Test.java> range : <18,34> category : <120> severity : <1>]
(12 more lines...)
Fixed tests 1
Status Test Failing since View job Duration
Successful BasicGroovyBuildTests testTraitBinary History
Failing since build #398 (Changes by Eric Milles) Default Job 2 secs