Build: #400 failed Changes by Eric Milles

Build result summary

Details

Completed
Duration
97 minutes
Labels
None
Agent
bamboo-23.af.pivotal.io
Revision
7df8a04317e7e56e576ac84a77bcadf7e148e981 7df8a04317e7e56e576ac84a77bcadf7e148e981
Total tests
6098
Failing since
#369 (Changes by Eric Milles)

Responsible

Code commits

Author Commit Message Commit date
Eric Milles Eric Milles 7df8a04317e7e56e576ac84a77bcadf7e148e981 7df8a04317e7e56e576ac84a77bcadf7e148e981 Fix for #978: improve flow typing support for !instanceof

Configuration changes

Plan configuration has changed since the last successful build. See the plan audit log for more details.

Tests

New test failures 2
Status Test View job Duration
Collapse Failed BuildAccessRulesTests testAccessForField History
Default Job < 1 sec
junit.framework.ComparisonFailure: 
----------- Expected ------------
Problem : Access restriction: The type 'BeanInfo' is not API (restriction on required library '##') [ resource : </Project/src/Foo.groovy> range : <42,50> category : <150> severity : <2>]

------------ but was ------------

--------- Difference is ----------
 expected:<[Problem : Access restriction: The type 'BeanInfo' is not API (restriction on required library '##') [ resource : </Project/src/Foo.groovy> range : <42,50> category : <150> severity : <2>]
(13 more lines...)
Collapse Failed DGMInferencingTests testDGM37 History
Default Job < 1 sec
java.lang.AssertionError: Expected type not found.
Expected: java.io.DataInputStream
Found: java.lang.Object
Declaring type: groovy.lang.Closure<V extends java.lang.Object>
ASTNode: org.codehaus.groovy.ast.expr.VariableExpression@f2251[variable: it]
Confidence: INFERRED

java.lang.AssertionError: 
(9 more lines...)
Existing test failures 2
Status Test Failing since View job Duration
junit.framework.ComparisonFailure: 
----------- Expected ------------

------------ but was ------------
Problem : The import util.MyException is never used [ resource : </Project/src/p/Test.java> range : <18,34> category : <120> severity : <1>]

--------- Difference is ----------
 expected:<[]> but was:<[Problem : The import util.MyException is never used [ resource : </Project/src/p/Test.java> range : <18,34> category : <120> severity : <1>]
(12 more lines...)
java.lang.AssertionError: L/Project/bin/p1/HelloJava.class should exist
	at org.eclipse.jdt.core.groovy.tests.model.GroovyContentTypeTests.checkJavaProject(GroovyContentTypeTests.java:152)
	at org.eclipse.jdt.core.groovy.tests.model.GroovyContentTypeTests.testJavaThenGroovyProject(GroovyContentTypeTests.java:98)
Fixed tests 7
Status Test Failing since View job Duration
Successful BasicGroovyBuildTests testFieldInitializerFromOtherFile History
Failing since build #399 (Changes by Eric Milles) Default Job < 1 sec
Successful BuildAccessRulesTests testAccessForMethodReturnTypeGenerics History
Failing since build #399 (Changes by Eric Milles) Default Job < 1 sec
Successful ClosureInferencingTests testClosure27 History
Failing since build #399 (Changes by Eric Milles) Default Job < 1 sec
Successful ConstructorReferenceSearchTests testConstructorReferences4 History
Failing since build #399 (Changes by Eric Milles) Default Job < 1 sec
Successful ConstructorReferenceSearchTests testConstructorReferences13 History
Failing since build #399 (Changes by Eric Milles) Default Job < 1 sec
Successful ConstructorReferenceSearchTests testNewifyConstructorReferences2 History
Failing since build #399 (Changes by Eric Milles) Default Job < 1 sec
Successful OperatorOverloadingInferencingTests testGetAt2 History
Failing since build #399 (Changes by Eric Milles) Default Job < 1 sec