Build: #401 failed Changes by Eric Milles

Build result summary

Details

Completed
Duration
91 minutes
Labels
None
Agent
bamboo-18.af.pivotal.io
Revision
01528c53865d414081271d87753919ac6d9ed6df 01528c53865d414081271d87753919ac6d9ed6df
Total tests
6098
Failing since
#369 (Changes by Eric Milles)

Responsible

Code commits

Author Commit Message Commit date
Eric Milles Eric Milles 01528c53865d414081271d87753919ac6d9ed6df 01528c53865d414081271d87753919ac6d9ed6df Tycho 1.5.0
Eric Milles Eric Milles e3eda99f442c584bc34d5995fa9873b3a7b84577 e3eda99f442c584bc34d5995fa9873b3a7b84577 Normalize pref page links

Configuration changes

Plan configuration has changed since the last successful build. See the plan audit log for more details.

Tests

New test failures 6
Status Test View job Duration
Collapse Failed ClosureInferencingTests testClosureReturnType4 History
Default Job < 1 sec
java.lang.AssertionError: Expected type not found.
Expected: Foo[]
Found: java.lang.String
Declaring type: Search
ASTNode: org.codehaus.groovy.ast.expr.VariableExpression@1070c4[variable: arr]
Confidence: INFERRED

java.lang.AssertionError: 
(8 more lines...)
Collapse Failed ConstructorReferenceSearchTests testConstructorReferences2 History
Default Job < 1 sec
java.lang.AssertionError: Incorrect number of matches; expected:<1> but was:<0>
	at org.eclipse.jdt.core.groovy.tests.search.ConstructorReferenceSearchTests.testConstructorReferences2(ConstructorReferenceSearchTests.java:96)
Collapse Failed ConstructorReferenceSearchTests testConstructorReferences3 History
Default Job 1 sec
java.lang.AssertionError: expected:<3> but was:<0>
	at org.eclipse.jdt.core.groovy.tests.search.ConstructorReferenceSearchTests.testConstructorReferences3(ConstructorReferenceSearchTests.java:126)
Collapse Failed ConstructorReferenceSearchTests testNewifyConstructorReferences4 History
Default Job < 1 sec
java.lang.AssertionError: expected:<2> but was:<0>
	at org.eclipse.jdt.core.groovy.tests.search.ConstructorReferenceSearchTests.testNewifyConstructorReferences4(ConstructorReferenceSearchTests.java:450)
Collapse Failed ConstructorReferenceSearchTests testConstructorReferences6 History
Default Job < 1 sec
java.lang.AssertionError: expected:<2> but was:<0>
	at org.eclipse.jdt.core.groovy.tests.search.ConstructorReferenceSearchTests.testConstructorReferences6(ConstructorReferenceSearchTests.java:180)
Collapse Failed DGMInferencingTests testDGM14 History
Default Job < 1 sec
java.lang.AssertionError: Expected type not found.
Expected: java.lang.Integer
Found: java.lang.Object
Declaring type: groovy.lang.Closure<V extends java.lang.Object>
ASTNode: org.codehaus.groovy.ast.expr.VariableExpression@ed367[variable: it]
Confidence: INFERRED

java.lang.AssertionError: 
(9 more lines...)
Existing test failures 1
Status Test Failing since View job Duration
junit.framework.ComparisonFailure: 
----------- Expected ------------

------------ but was ------------
Problem : The import util.MyException is never used [ resource : </Project/src/p/Test.java> range : <18,34> category : <120> severity : <1>]

--------- Difference is ----------
 expected:<[]> but was:<[Problem : The import util.MyException is never used [ resource : </Project/src/p/Test.java> range : <18,34> category : <120> severity : <1>]
(12 more lines...)
Fixed tests 3
Status Test Failing since View job Duration
Successful BuildAccessRulesTests testAccessForField History
Failing since build #400 (Changes by Eric Milles) Default Job < 1 sec
Successful GroovyContentTypeTests testJavaThenGroovyProject History
Failing since build #399 (Changes by Eric Milles) Default Job < 1 sec
Successful DGMInferencingTests testDGM37 History
Failing since build #400 (Changes by Eric Milles) Default Job < 1 sec