Build: #402 failed Changes by Eric Milles

Build result summary

Details

Completed
Duration
93 minutes
Labels
None
Agent
bamboo-15.af.pivotal.io
Revision
267f844de6a747dc82aab9c560a671daa5b39080 267f844de6a747dc82aab9c560a671daa5b39080
Total tests
6100
Failing since
#369 (Changes by Eric Milles)

Responsible

Code commits

Author Commit Message Commit date
Eric Milles Eric Milles 267f844de6a747dc82aab9c560a671daa5b39080 267f844de6a747dc82aab9c560a671daa5b39080 Update the Groovy plug-in to 3.0.0-rc-1
#979

Configuration changes

Plan configuration has changed since the last successful build. See the plan audit log for more details.

Tests

New test failures 3
Status Test View job Duration
Collapse Failed BasicGroovyBuildTests testTypeAnnotation History
Default Job < 1 sec
org.junit.ComparisonFailure: unexpected recompiled units. lenExpected=1 lenActual=5 expected:<{p[]2.Script}> but was:<{p[1.Iterables,p1.Multimap,p1.Nullable,p2.Script,p]2.Script}>
	at org.eclipse.jdt.core.groovy.tests.builder.BasicGroovyBuildTests.testTypeAnnotation(BasicGroovyBuildTests.java:3558)
Collapse Failed ClosureInferencingTests testNestedClosure7 History
Default Job < 1 sec
java.lang.AssertionError: Expected type not found.
Expected: java.lang.Integer
Found: java.lang.Object
Declaring type: groovy.lang.Closure
ASTNode: org.codehaus.groovy.ast.expr.ConstantExpression@fa99a[abs]
Confidence: UNKNOWN

java.lang.AssertionError: 
(8 more lines...)
Collapse Failed ClosureInferencingTests testNestedClosure15 History
Default Job < 1 sec
java.lang.AssertionError: Expected type not found.
Expected: java.lang.Number
Found: java.lang.Object
Declaring type: groovy.lang.Closure
ASTNode: org.codehaus.groovy.ast.expr.VariableExpression@12c643[variable: info]
Confidence: UNKNOWN

java.lang.AssertionError: 
(8 more lines...)
Existing test failures 1
Status Test Failing since View job Duration
junit.framework.ComparisonFailure: 
----------- Expected ------------

------------ but was ------------
Problem : The import util.MyException is never used [ resource : </Project/src/p/Test.java> range : <18,34> category : <120> severity : <1>]

--------- Difference is ----------
 expected:<[]> but was:<[Problem : The import util.MyException is never used [ resource : </Project/src/p/Test.java> range : <18,34> category : <120> severity : <1>]
(12 more lines...)
Fixed tests 6
Status Test Failing since View job Duration
Successful ClosureInferencingTests testClosureReturnType4 History
Failing since build #401 (Changes by Eric Milles) Default Job < 1 sec
Successful ConstructorReferenceSearchTests testNewifyConstructorReferences4 History
Failing since build #401 (Changes by Eric Milles) Default Job < 1 sec
Successful ConstructorReferenceSearchTests testConstructorReferences2 History
Failing since build #401 (Changes by Eric Milles) Default Job < 1 sec
Successful ConstructorReferenceSearchTests testConstructorReferences3 History
Failing since build #401 (Changes by Eric Milles) Default Job < 1 sec
Successful ConstructorReferenceSearchTests testConstructorReferences6 History
Failing since build #401 (Changes by Eric Milles) Default Job < 1 sec
Successful DGMInferencingTests testDGM14 History
Failing since build #401 (Changes by Eric Milles) Default Job < 1 sec