Build: #404 failed Changes by Eric Milles

Build result summary

Details

Completed
Duration
93 minutes
Labels
None
Agent
bamboo-23.af.pivotal.io
Revision
94e1d915eacbeb364b22c0bdc277fc070aa0fd81 94e1d915eacbeb364b22c0bdc277fc070aa0fd81
Total tests
6108
Failing since
#369 (Changes by Eric Milles)

Responsible

Code commits

Author Commit Message Commit date
Eric Milles Eric Milles 94e1d915eacbeb364b22c0bdc277fc070aa0fd81 94e1d915eacbeb364b22c0bdc277fc070aa0fd81 GROOVY-7996, GROOVY-9288, et al.

Configuration changes

Plan configuration has changed since the last successful build. See the plan audit log for more details.

Tests

New test failures 5
Status Test View job Duration
Collapse Failed ArrayInferencingTests testArray4 History
Default Job < 1 sec
java.lang.AssertionError: Expected type not found.
Expected: java.lang.CharSequence
Found: java.lang.CharSequence[]
Declaring type: null
ASTNode: org.codehaus.groovy.ast.expr.BinaryExpression@f1e91[org.codehaus.groovy.ast.expr.VariableExpression@f1e8e[variable: x]("[" at 1:40:  "[" )org.codehaus.groovy.ast.expr.ConstantExpression@f2612[0]]
Confidence: EXACT

java.lang.AssertionError: 
(8 more lines...)
Collapse Failed StaticCompilationTests testCompileStatic7996[Java 1.7] History
Default Job < 1 sec
junit.framework.ComparisonFailure: Unexpected error running resulting class file for Main.groovy:
--[START]--
java.lang.ClassCastException: java.lang.String cannot be cast to java.util.List
 at Bar$_doStuff_closure1.doCall(Bar.groovy:6)
 at Bar$_doStuff_closure1.call(Bar.groovy)
 at org.codehaus.groovy.runtime.DefaultGroovyMethods.with(DefaultGroovyMethods.java:351)
 at org.codehaus.groovy.runtime.DefaultGroovyMethods.with(DefaultGroovyMethods.java:298)
 at org.codehaus.groovy.runtime.dgm$852.invoke(Unknown Source)
(242 more lines...)
Collapse Failed StaticCompilationTests testCompileStatic7996[Java 1.8] History
Default Job < 1 sec
junit.framework.ComparisonFailure: Unexpected error running resulting class file for Main.groovy:
--[START]--
java.lang.ClassCastException: java.lang.String cannot be cast to java.util.List
 at Bar$_doStuff_closure1.doCall(Bar.groovy:6)
 at Bar$_doStuff_closure1.call(Bar.groovy)
 at org.codehaus.groovy.runtime.DefaultGroovyMethods.with(DefaultGroovyMethods.java:351)
 at org.codehaus.groovy.runtime.DefaultGroovyMethods.with(DefaultGroovyMethods.java:298)
 at org.codehaus.groovy.runtime.dgm$852.invoke(Unknown Source)
(242 more lines...)
Collapse Failed StaticCompilationTests testCompileStatic7996a[Java 1.7] History
Default Job < 1 sec
junit.framework.ComparisonFailure: Unexpected error running resulting class file for Main.groovy:
--[START]--
java.lang.ClassCastException: java.lang.String cannot be cast to java.util.List
 at Bar$_doStuff_closure1.doCall(Bar.groovy:6)
 at Bar$_doStuff_closure1.call(Bar.groovy)
 at org.codehaus.groovy.runtime.DefaultGroovyMethods.with(DefaultGroovyMethods.java:351)
 at org.codehaus.groovy.runtime.DefaultGroovyMethods.with(DefaultGroovyMethods.java:298)
 at org.codehaus.groovy.runtime.dgm$852.invoke(Unknown Source)
(242 more lines...)
Collapse Failed StaticCompilationTests testCompileStatic7996a[Java 1.8] History
Default Job < 1 sec
junit.framework.ComparisonFailure: Unexpected error running resulting class file for Main.groovy:
--[START]--
java.lang.ClassCastException: java.lang.String cannot be cast to java.util.List
 at Bar$_doStuff_closure1.doCall(Bar.groovy:6)
 at Bar$_doStuff_closure1.call(Bar.groovy)
 at org.codehaus.groovy.runtime.DefaultGroovyMethods.with(DefaultGroovyMethods.java:351)
 at org.codehaus.groovy.runtime.DefaultGroovyMethods.with(DefaultGroovyMethods.java:298)
 at org.codehaus.groovy.runtime.dgm$852.invoke(Unknown Source)
(242 more lines...)
Existing test failures 1
Status Test Failing since View job Duration
junit.framework.ComparisonFailure: 
----------- Expected ------------

------------ but was ------------
Problem : The import util.MyException is never used [ resource : </Project/src/p/Test.java> range : <18,34> category : <120> severity : <1>]

--------- Difference is ----------
 expected:<[]> but was:<[Problem : The import util.MyException is never used [ resource : </Project/src/p/Test.java> range : <18,34> category : <120> severity : <1>]
(12 more lines...)

Jira issues

IssueDescriptionStatus
Unknown Issue TypeGROOVY-7996Could not obtain issue details from Jira
Unknown Issue TypeGROOVY-9288Could not obtain issue details from Jira