Build: #406 failed Changes by Eric Milles

Build result summary

Details

Completed
Duration
92 minutes
Labels
None
Agent
bamboo-24.af.pivotal.io
Revision
8b05bb646fde8afbf68098c25956725081253909 8b05bb646fde8afbf68098c25956725081253909
Total tests
6108
Failing since
#369 (Changes by Eric Milles)

Responsible

Code commits

Author Commit Message Commit date
Eric Milles Eric Milles 8b05bb646fde8afbf68098c25956725081253909 8b05bb646fde8afbf68098c25956725081253909 GROOVY-7996

Configuration changes

Plan configuration has changed since the last successful build. See the plan audit log for more details.

Tests

New test failures 3
Status Test View job Duration
Collapse Failed BasicGroovyBuildTests testIncrementalCompilationTheBasics History
Default Job < 1 sec
org.junit.ComparisonFailure: unexpected recompiled units. lenExpected=2 lenActual=4 expected:<{pkg.GHello,pkg.[]Hello}> but was:<{pkg.GHello,pkg.[GHello,pkg.Hello,pkg.]Hello}>
	at org.eclipse.jdt.core.groovy.tests.builder.BasicGroovyBuildTests.testIncrementalCompilationTheBasics(BasicGroovyBuildTests.java:2066)
Collapse Failed DGMInferencingTests testDGM37 History
Default Job < 1 sec
java.lang.AssertionError: Expected type not found.
Expected: java.io.DataInputStream
Found: java.lang.Object
Declaring type: groovy.lang.Closure<V extends java.lang.Object>
ASTNode: org.codehaus.groovy.ast.expr.VariableExpression@f2251[variable: it]
Confidence: INFERRED

java.lang.AssertionError: 
(9 more lines...)
Collapse Failed DGMInferencingTests testDGM20 History
Default Job < 1 sec
java.lang.AssertionError: Expected type not found.
Expected: java.lang.String
Found: java.lang.Object
Declaring type: Search
ASTNode: org.codehaus.groovy.ast.expr.VariableExpression@f0804[variable: key]
Confidence: INFERRED

java.lang.AssertionError: 
(9 more lines...)
Existing test failures 1
Status Test Failing since View job Duration
junit.framework.ComparisonFailure: 
----------- Expected ------------

------------ but was ------------
Problem : The import util.MyException is never used [ resource : </Project/src/p/Test.java> range : <18,34> category : <120> severity : <1>]

--------- Difference is ----------
 expected:<[]> but was:<[Problem : The import util.MyException is never used [ resource : </Project/src/p/Test.java> range : <18,34> category : <120> severity : <1>]
(12 more lines...)
Fixed tests 3
Status Test Failing since View job Duration
Successful BasicGroovyBuildTests testUpdateWorkspacePreferences History
Failing since build #405 (Changes by Eric Milles) Default Job < 1 sec
Successful StaticCompilationTests testCompileStatic7996a[Java 1.7] History
Failing since build #404 (Changes by Eric Milles) Default Job < 1 sec
Successful StaticCompilationTests testCompileStatic7996a[Java 1.8] History
Failing since build #404 (Changes by Eric Milles) Default Job < 1 sec

Jira issues

IssueDescriptionStatus
Unknown Issue TypeGROOVY-7996Could not obtain issue details from Jira