Build: #417 failed Changes by Eric Milles

Build result summary

Details

Completed
Duration
101 minutes
Labels
None
Agent
bamboo-18.af.pivotal.io
Revision
702334810c22f47a5b03250aa92a87a1cd076535 702334810c22f47a5b03250aa92a87a1cd076535
Total tests
6135
Failing since
#369 (Changes by Eric Milles)

Responsible

Code commits

Author Commit Message Commit date
Eric Milles Eric Milles 702334810c22f47a5b03250aa92a87a1cd076535 702334810c22f47a5b03250aa92a87a1cd076535 rework use of ClassNode hasClass()/getTypeClass()/getClassInternalName()
Eric Milles Eric Milles 655af56eecf2bb7941e9284e00fe3975317de9fa 655af56eecf2bb7941e9284e00fe3975317de9fa minor fix-ups

Configuration changes

Plan configuration has changed since the last successful build. See the plan audit log for more details.

Tests

New test failures 4
Status Test View job Duration
Collapse Failed ConstructorReferenceSearchTests testConstructorReferences1 History
Default Job < 1 sec
java.lang.AssertionError: Incorrect number of matches; expected:<3> but was:<0>
	at org.eclipse.jdt.core.groovy.tests.search.ConstructorReferenceSearchTests.testConstructorReferences1(ConstructorReferenceSearchTests.java:59)
Collapse Failed ConstructorReferenceSearchTests testNewifyConstructorReferences4 History
Default Job < 1 sec
java.lang.AssertionError: expected:<2> but was:<0>
	at org.eclipse.jdt.core.groovy.tests.search.ConstructorReferenceSearchTests.testNewifyConstructorReferences4(ConstructorReferenceSearchTests.java:450)
Collapse Failed ConstructorReferenceSearchTests testNewifyConstructorReferences2 History
Default Job < 1 sec
java.lang.AssertionError: expected:<2> but was:<0>
	at org.eclipse.jdt.core.groovy.tests.search.ConstructorReferenceSearchTests.testNewifyConstructorReferences2(ConstructorReferenceSearchTests.java:408)
Collapse Failed DGMInferencingTests testDGMClosure18 History
Default Job < 1 sec
java.lang.AssertionError: Expected type not found.
Expected: java.util.Date
Found: java.lang.Object
Declaring type: Search
ASTNode: org.codehaus.groovy.ast.expr.VariableExpression@f1ace[variable: val]
Confidence: INFERRED

java.lang.AssertionError: 
(9 more lines...)
Existing test failures 1
Status Test Failing since View job Duration
junit.framework.ComparisonFailure: 
----------- Expected ------------

------------ but was ------------
Problem : The import util.MyException is never used [ resource : </Project/src/p/Test.java> range : <18,34> category : <120> severity : <1>]

--------- Difference is ----------
 expected:<[]> but was:<[Problem : The import util.MyException is never used [ resource : </Project/src/p/Test.java> range : <18,34> category : <120> severity : <1>]
(12 more lines...)
Fixed tests 1
Status Test Failing since View job Duration
Successful JUnit4TestFinderTests testFindAllTestSuites History
Failing since build #416 (Changes by Eric Milles) Default Job 7 secs