Build: #418 failed Changes by Eric Milles

Build result summary

Details

Completed
Duration
106 minutes
Labels
None
Agent
bamboo-18.af.pivotal.io
Revision
75840e6746dc91d9512da2e30aa607051468cf84 75840e6746dc91d9512da2e30aa607051468cf84
Total tests
6135
Failing since
#369 (Changes by Eric Milles)

Responsible

Code commits

Author Commit Message Commit date
Eric Milles Eric Milles 75840e6746dc91d9512da2e30aa607051468cf84 75840e6746dc91d9512da2e30aa607051468cf84 GROOVY-7996: exclude closure parameter reference from dynamic resolution

Configuration changes

Plan configuration has changed since the last successful build. See the plan audit log for more details.

Tests

New test failures 7
Status Test View job Duration
Collapse Failed BuildAccessRulesTests testAccessForLocalVariable History
Default Job < 1 sec
junit.framework.ComparisonFailure: 
----------- Expected ------------
Problem : Access restriction: The type 'BeanInfo' is not API (restriction on required library '##') [ resource : </Project/src/Foo.groovy> range : <51,59> category : <150> severity : <2>]

------------ but was ------------

--------- Difference is ----------
 expected:<[Problem : Access restriction: The type 'BeanInfo' is not API (restriction on required library '##') [ resource : </Project/src/Foo.groovy> range : <51,59> category : <150> severity : <2>]
(13 more lines...)
Collapse Failed BinarySearchTests testFieldDecl2 History
Default Job 1 sec
java.lang.AssertionError: Expecting 2 matches, but found 0

java.lang.AssertionError: 
Expecting 2 matches, but found 0

	at org.eclipse.jdt.core.groovy.tests.search.BinarySearchTests.assertMatches(BinarySearchTests.java:139)
	at org.eclipse.jdt.core.groovy.tests.search.BinarySearchTests.testFieldDecl2(BinarySearchTests.java:190)
Collapse Failed BinarySearchTests testMethodRefInInitializer History
Default Job 1 sec
java.lang.AssertionError: Expecting 2 matches, but found 0

java.lang.AssertionError: 
Expecting 2 matches, but found 0

	at org.eclipse.jdt.core.groovy.tests.search.BinarySearchTests.assertMatches(BinarySearchTests.java:139)
	at org.eclipse.jdt.core.groovy.tests.search.BinarySearchTests.testMethodRefInInitializer(BinarySearchTests.java:217)
Collapse Failed ClosureInferencingTests testClosure25 History
Default Job < 1 sec
java.lang.AssertionError: Expected type not found.
Expected: java.lang.Void
Found: java.lang.Long
Declaring type: Search
ASTNode: org.codehaus.groovy.ast.expr.VariableExpression@f0bc7[variable: time]
Confidence: INFERRED

java.lang.AssertionError: 
(8 more lines...)
Collapse Failed ConstructorReferenceSearchTests testConstructorReferences5 History
Default Job < 1 sec
java.lang.AssertionError: expected:<1> but was:<0>
	at org.eclipse.jdt.core.groovy.tests.search.ConstructorReferenceSearchTests.testConstructorReferences5(ConstructorReferenceSearchTests.java:162)
Collapse Failed ConstructorReferenceSearchTests testConstructorReferences4 History
Default Job < 1 sec
java.lang.AssertionError: expected:<2> but was:<0>
	at org.eclipse.jdt.core.groovy.tests.search.ConstructorReferenceSearchTests.testConstructorReferences4(ConstructorReferenceSearchTests.java:144)
Collapse Failed DGMInferencingTests testDGM38 History
Default Job < 1 sec
java.lang.AssertionError: Expected type not found.
Expected: java.io.BufferedWriter
Found: java.lang.Object
Declaring type: groovy.lang.Closure<V extends java.lang.Object>
ASTNode: org.codehaus.groovy.ast.expr.VariableExpression@f007f[variable: it]
Confidence: INFERRED

java.lang.AssertionError: 
(9 more lines...)
Existing test failures 1
Status Test Failing since View job Duration
junit.framework.ComparisonFailure: 
----------- Expected ------------

------------ but was ------------
Problem : The import util.MyException is never used [ resource : </Project/src/p/Test.java> range : <18,34> category : <120> severity : <1>]

--------- Difference is ----------
 expected:<[]> but was:<[Problem : The import util.MyException is never used [ resource : </Project/src/p/Test.java> range : <18,34> category : <120> severity : <1>]
(12 more lines...)
Fixed tests 4
Status Test Failing since View job Duration
Successful ConstructorReferenceSearchTests testNewifyConstructorReferences4 History
Failing since build #417 (Changes by Eric Milles) Default Job < 1 sec
Successful ConstructorReferenceSearchTests testNewifyConstructorReferences2 History
Failing since build #417 (Changes by Eric Milles) Default Job < 1 sec
Successful ConstructorReferenceSearchTests testConstructorReferences1 History
Failing since build #417 (Changes by Eric Milles) Default Job < 1 sec
Successful DGMInferencingTests testDGMClosure18 History
Failing since build #417 (Changes by Eric Milles) Default Job < 1 sec

Jira issues

IssueDescriptionStatus
Unknown Issue TypeGROOVY-7996Could not obtain issue details from Jira