Build: #419 failed Changes by Eric Milles

Build result summary

Details

Completed
Duration
92 minutes
Labels
None
Agent
bamboo-18.af.pivotal.io
Revision
c2eb5eb2148a0754333f8f5e8ecc69c6625bab60 c2eb5eb2148a0754333f8f5e8ecc69c6625bab60
Total tests
6135
Failing since
#369 (Changes by Eric Milles)

Responsible

Code commits

Author Commit Message Commit date
Eric Milles Eric Milles c2eb5eb2148a0754333f8f5e8ecc69c6625bab60 c2eb5eb2148a0754333f8f5e8ecc69c6625bab60 GROOVY-7996: exclude closure parameter reference from dynamic resolution
(take 2)

Configuration changes

Plan configuration has changed since the last successful build. See the plan audit log for more details.

Tests

New test failures 20
Status Test View job Duration
Collapse Failed AnnotationCompletionTests testAnno6 History
Default Job 2 secs
java.lang.AssertionError: Expected to find proposal 'Singleton' 1 times, but found it 0 times.  All Proposals:
	at org.codehaus.groovy.eclipse.codeassist.tests.AnnotationCompletionTests.testAnno6(AnnotationCompletionTests.groovy:132)
Collapse Failed AnnotationCompletionTests testAnno2 History
Default Job 2 secs
java.lang.AssertionError: Expected to find proposal 'CompileStatic' 1 times, but found it 0 times.  All Proposals:
	at org.codehaus.groovy.eclipse.codeassist.tests.AnnotationCompletionTests.testAnno2(AnnotationCompletionTests.groovy:83)
Collapse Failed AnnotationCompletionTests testAnno3 History
Default Job 2 secs
java.lang.AssertionError: Expected to find proposal 'Singleton' 1 times, but found it 0 times.  All Proposals:
	at org.codehaus.groovy.eclipse.codeassist.tests.AnnotationCompletionTests.testAnno3(AnnotationCompletionTests.groovy:105)
Collapse Failed AnnotationCompletionTests testAnno4 History
Default Job 1 sec
java.lang.AssertionError: Expected to find proposal 'Singleton' 1 times, but found it 0 times.  All Proposals:
	at org.codehaus.groovy.eclipse.codeassist.tests.AnnotationCompletionTests.testAnno4(AnnotationCompletionTests.groovy:114)
Collapse Failed AnnotationCompletionTests testAnno5 History
Default Job 2 secs
java.lang.AssertionError: Expected to find proposal 'Singleton' 1 times, but found it 0 times.  All Proposals:
	at org.codehaus.groovy.eclipse.codeassist.tests.AnnotationCompletionTests.testAnno5(AnnotationCompletionTests.groovy:123)
Collapse Failed AnnotationCompletionTests testAnno2a History
Default Job 1 sec
java.lang.AssertionError: Expected to find proposal 'CompileDynamic' 1 times, but found it 0 times.  All Proposals:
	at org.codehaus.groovy.eclipse.codeassist.tests.AnnotationCompletionTests.testAnno2a(AnnotationCompletionTests.groovy:97)
Collapse Failed AnnotationCompletionTests testAnnoAttrTypes History
Default Job 2 secs
java.lang.AssertionError: Expected to find proposal 'ObjectRange - groovy.lang' 1 times, but found it 0 times.  All Proposals:
ObjectInstance - javax.management (6)
ObjID - java.rmi.server (8)
ObjectOutputStream - java.io (8)
ObjectOutput - java.io (8)
ObjectIdentifier - sun.security.util (5)
ObjectInputFilter - sun.misc (5)
Object - java.lang (8)
(60 more lines...)
Collapse Failed AnnotationCompletionTests testConfigScriptCompletion History
Default Job 6 secs
org.codehaus.groovy.runtime.powerassert.PowerAssertionError: assert startFrom >= 0 && startFrom < proposals.length
       |         |    |  |         | |         |
       0         true |  0         | []        0
                      false        false
org.codehaus.groovy.runtime.powerassert.PowerAssertionError: 
assert startFrom >= 0 && startFrom < proposals.length
       |         |    |  |         | |         |
       0         true |  0         | []        0
(2 more lines...)
Collapse Failed SyntheticMemberSearchTests testSearchInJava4 History
Default Job 1 sec
java.lang.AssertionError: Wrong number of matches found in:
 expected:<1> but was:<0>
java.lang.AssertionError: 
Wrong number of matches found in:
 expected:<1> but was:<0>
	at org.codehaus.groovy.eclipse.core.test.SyntheticMemberSearchTests.assertNumMatch(SyntheticMemberSearchTests.groovy:291)
	at org.codehaus.groovy.eclipse.core.test.SyntheticMemberSearchTests.testSearchInJava4(SyntheticMemberSearchTests.groovy:237)
Collapse Failed SyntheticMemberSearchTests testSearchInJava2 History
Default Job 1 sec
java.lang.AssertionError: Wrong number of matches found in:
 expected:<1> but was:<0>
java.lang.AssertionError: 
Wrong number of matches found in:
 expected:<1> but was:<0>
	at org.codehaus.groovy.eclipse.core.test.SyntheticMemberSearchTests.assertNumMatch(SyntheticMemberSearchTests.groovy:291)
	at org.codehaus.groovy.eclipse.core.test.SyntheticMemberSearchTests.testSearchInJava2(SyntheticMemberSearchTests.groovy:193)
Collapse Failed SyntheticMemberSearchTests testSearchInJava1 History
Default Job 4 secs
java.lang.AssertionError: Wrong number of matches found in:
 expected:<3> but was:<0>
java.lang.AssertionError: 
Wrong number of matches found in:
 expected:<3> but was:<0>
	at org.codehaus.groovy.eclipse.core.test.SyntheticMemberSearchTests.assertNumMatch(SyntheticMemberSearchTests.groovy:291)
	at org.codehaus.groovy.eclipse.core.test.SyntheticMemberSearchTests.testSearchInJava1(SyntheticMemberSearchTests.groovy:171)
Collapse Failed SyntheticMemberSearchTests testSearchInGroovy1 History
Default Job 1 sec
java.lang.AssertionError: Wrong number of matches found in:
 expected:<3> but was:<0>
java.lang.AssertionError: 
Wrong number of matches found in:
 expected:<3> but was:<0>
	at org.codehaus.groovy.eclipse.core.test.SyntheticMemberSearchTests.assertNumMatch(SyntheticMemberSearchTests.groovy:291)
	at org.codehaus.groovy.eclipse.core.test.SyntheticMemberSearchTests.testSearchInGroovy1(SyntheticMemberSearchTests.groovy:72)
Collapse Failed SyntheticMemberSearchTests testSearchInJava3 History
Default Job 1 sec
java.lang.AssertionError: Wrong number of matches found in:
 expected:<1> but was:<0>
java.lang.AssertionError: 
Wrong number of matches found in:
 expected:<1> but was:<0>
	at org.codehaus.groovy.eclipse.core.test.SyntheticMemberSearchTests.assertNumMatch(SyntheticMemberSearchTests.groovy:291)
	at org.codehaus.groovy.eclipse.core.test.SyntheticMemberSearchTests.testSearchInJava3(SyntheticMemberSearchTests.groovy:215)
Collapse Failed BasicGroovyBuildTests testIncrementalCompilation1594 History
Default Job < 1 sec
org.junit.ComparisonFailure: unexpected recompiled units. lenExpected=3 lenActual=6 expected:<...kg.AllTests,testpkg.[TestCaseChannelPersistentStore],testpkg.TestCaseCha...> but was:<...kg.AllTests,testpkg.[AllTests,testpkg.TestCaseChannelPersistentStore,testpkg.TestCaseChannelPersistentStore,testpkg.TestCaseChannelPersistentStore$1],testpkg.TestCaseCha...>
	at org.eclipse.jdt.core.groovy.tests.builder.BasicGroovyBuildTests.testIncrementalCompilation1594(BasicGroovyBuildTests.java:2132)
Collapse Failed BasicGroovyBuildTests testInners_983 History
Default Job < 1 sec
org.junit.ComparisonFailure: unexpected recompiled units. lenExpected=1 lenActual=3 expected:<{Client[]}> but was:<{Client[,Outer,Outer$Inner]}>
	at org.eclipse.jdt.core.groovy.tests.builder.BasicGroovyBuildTests.testInners_983(BasicGroovyBuildTests.java:309)
Collapse Failed BinarySearchTests testClassDecl1 History
Default Job 1 sec
java.lang.AssertionError: Expecting 12 matches, but found 0

java.lang.AssertionError: 
Expecting 12 matches, but found 0

	at org.eclipse.jdt.core.groovy.tests.search.BinarySearchTests.assertMatches(BinarySearchTests.java:139)
	at org.eclipse.jdt.core.groovy.tests.search.BinarySearchTests.testClassDecl1(BinarySearchTests.java:165)
Collapse Failed ClosureInferencingTests testWithAndClosure6 History
Default Job < 1 sec
java.lang.AssertionError: Expected declaring type not found.
 Expected: p.A
 Found type: java.lang.String
 Found declaring type: java.lang.Object
 ASTNode: org.codehaus.groovy.ast.expr.ConstantExpression@1146f6[foo]
java.lang.AssertionError: 
Expected declaring type not found.
	Expected: p.A
(4 more lines...)
Collapse Failed ConstructorReferenceSearchTests testConstructorReferences12 History
Default Job < 1 sec
java.lang.AssertionError: expected:<2> but was:<0>
	at org.eclipse.jdt.core.groovy.tests.search.ConstructorReferenceSearchTests.testConstructorReferences12(ConstructorReferenceSearchTests.java:313)
Collapse Failed OperatorOverloadingInferencingTests testLongExpr2 History
Default Job < 1 sec
java.lang.AssertionError: Expected type not found.
Expected: Foo
Found: java.util.List<Foo>
Declaring type: Search
ASTNode: org.codehaus.groovy.ast.expr.VariableExpression@fed3e[variable: xxx]
Confidence: INFERRED

java.lang.AssertionError: 
(8 more lines...)
Collapse Failed TypeReferenceSearchTests testFindClassDeclarationWithPattern History
Default Job < 1 sec
java.lang.AssertionError: Expected but not found: SongTests (not open) [in SongTests.groovy [in gtunes [in src [in Project]]]]
Expected but not found: ArtistTests (not open) [in ArtistTests.groovy [in gtunes [in src [in Project]]]]
Found but not expected: class ArtistTests [in ArtistTests.groovy [in src.gtunes [in <project root> [in Project]]]]
  java.lang.Object testSomething()
Found but not expected: class SongTests [in SongTests.groovy [in src.gtunes [in <project root> [in Project]]]]
  java.lang.Object testSomething()

java.lang.AssertionError: 
(9 more lines...)
Existing test failures 2
Status Test Failing since View job Duration
junit.framework.ComparisonFailure: 
----------- Expected ------------

------------ but was ------------
Problem : The import util.MyException is never used [ resource : </Project/src/p/Test.java> range : <18,34> category : <120> severity : <1>]

--------- Difference is ----------
 expected:<[]> but was:<[Problem : The import util.MyException is never used [ resource : </Project/src/p/Test.java> range : <18,34> category : <120> severity : <1>]
(12 more lines...)
java.lang.AssertionError: expected:<1> but was:<0>
	at org.eclipse.jdt.core.groovy.tests.search.ConstructorReferenceSearchTests.testConstructorReferences5(ConstructorReferenceSearchTests.java:162)
Fixed tests 6
Status Test Failing since View job Duration
Successful BuildAccessRulesTests testAccessForLocalVariable History
Failing since build #418 (Changes by Eric Milles) Default Job < 1 sec
Successful BinarySearchTests testMethodRefInInitializer History
Failing since build #418 (Changes by Eric Milles) Default Job 1 sec
Successful BinarySearchTests testFieldDecl2 History
Failing since build #418 (Changes by Eric Milles) Default Job 1 sec
Successful ClosureInferencingTests testClosure25 History
Failing since build #418 (Changes by Eric Milles) Default Job < 1 sec
Successful ConstructorReferenceSearchTests testConstructorReferences4 History
Failing since build #418 (Changes by Eric Milles) Default Job < 1 sec
Successful DGMInferencingTests testDGM38 History
Failing since build #418 (Changes by Eric Milles) Default Job < 1 sec

Jira issues

IssueDescriptionStatus
Unknown Issue TypeGROOVY-7996Could not obtain issue details from Jira