Build: #425 failed Changes by Eric Milles

Build result summary

Details

Completed
Duration
94 minutes
Labels
None
Agent
bamboo-19.af.pivotal.io
Revision
cbdc80d0705393d7ff31a1419aea0049a5fb48a1 cbdc80d0705393d7ff31a1419aea0049a5fb48a1
Total tests
6149
Failing since
#369 (Changes by Eric Milles)

Responsible

Code commits

Author Commit Message Commit date
Eric Milles Eric Milles cbdc80d0705393d7ff31a1419aea0049a5fb48a1 cbdc80d0705393d7ff31a1419aea0049a5fb48a1 GROOVY-7300: Property reference found through synthetic accessor search
#935 #985

Configuration changes

Plan configuration has changed since the last successful build. See the plan audit log for more details.

Tests

New test failures 4
Status Test View job Duration
Collapse Failed BasicGroovyBuildTests testSlowAnotherAttempt_GRE870 History
Default Job < 1 sec
org.junit.ComparisonFailure: unexpected recompiled units. lenExpected=1 lenActual=1 expected:<{a.b.c.d.e.f.[Helper1,a.b.c.d.e.f.Helper2,a.b.c.d.e.f.Helper3,a.b.c.d.e.f.Helper4,a.b.c.d.e.f.Helper5,a.b.c.d.e.f.Helper6,a.b.c.d.e.f.Helper7,a.b.c.d.e.f.Helper8,a.b.c.d.e.f.Helper9,a.b.c.d.e.f.HelperBase,a.b.c.d.e.f.SomeChecks,a.b.c.d.e.f.SomeHelper]}> but was:<{a.b.c.d.e.f.[SomeChecks]}>
	at org.eclipse.jdt.core.groovy.tests.builder.BasicGroovyBuildTests.testSlowAnotherAttempt_GRE870(BasicGroovyBuildTests.java:1407)
Collapse Failed BasicGroovyBuildTests testIncrementalCompilation1594 History
Default Job < 1 sec
org.junit.ComparisonFailure: unexpected recompiled units. lenExpected=3 lenActual=6 expected:<...kg.AllTests,testpkg.[TestCaseChannelPersistentStore],testpkg.TestCaseCha...> but was:<...kg.AllTests,testpkg.[AllTests,testpkg.TestCaseChannelPersistentStore,testpkg.TestCaseChannelPersistentStore,testpkg.TestCaseChannelPersistentStore$1],testpkg.TestCaseCha...>
	at org.eclipse.jdt.core.groovy.tests.builder.BasicGroovyBuildTests.testIncrementalCompilation1594(BasicGroovyBuildTests.java:2132)
Collapse Failed BinarySearchTests testFieldDecl1 History
Default Job 1 sec
java.lang.AssertionError: Expecting 2 matches, but found 0

java.lang.AssertionError: 
Expecting 2 matches, but found 0

	at org.eclipse.jdt.core.groovy.tests.search.BinarySearchTests.assertMatches(BinarySearchTests.java:139)
	at org.eclipse.jdt.core.groovy.tests.search.BinarySearchTests.testFieldDecl1(BinarySearchTests.java:181)
Collapse Failed MethodReferenceSearchTests testExplicitPropertySetterSearch1 History
Default Job < 1 sec
java.lang.AssertionError: expected:<5> but was:<0>
	at org.eclipse.jdt.core.groovy.tests.search.MethodReferenceSearchTests.testExplicitPropertySetterSearch1(MethodReferenceSearchTests.java:623)
Existing test failures 1
Status Test Failing since View job Duration
junit.framework.ComparisonFailure: 
----------- Expected ------------

------------ but was ------------
Problem : The import util.MyException is never used [ resource : </Project/src/p/Test.java> range : <18,34> category : <120> severity : <1>]

--------- Difference is ----------
 expected:<[]> but was:<[Problem : The import util.MyException is never used [ resource : </Project/src/p/Test.java> range : <18,34> category : <120> severity : <1>]
(12 more lines...)
Fixed tests 1
Status Test Failing since View job Duration
Successful BasicGroovyBuildTests testCopyResourceNonGroovyProject_GRECLIPSE653 History
Failing since build #424 (Changes by Eric Milles) Default Job < 1 sec

Jira issues

IssueDescriptionStatus
Unknown Issue TypeGROOVY-7300Could not obtain issue details from Jira