Build: #427 failed Changes by Eric Milles

Build result summary

Details

Completed
Duration
95 minutes
Labels
None
Agent
bamboo-17.af.pivotal.io
Revision
aa5056db55f627edc4c21d684aaf105f2415d74b aa5056db55f627edc4c21d684aaf105f2415d74b
Total tests
6150
Failing since
#369 (Changes by Eric Milles)

Responsible

Code commits

Author Commit Message Commit date
Eric Milles Eric Milles aa5056db55f627edc4c21d684aaf105f2415d74b aa5056db55f627edc4c21d684aaf105f2415d74b Fix for NPE
#990

Configuration changes

Plan configuration has changed since the last successful build. See the plan audit log for more details.

Tests

New test failures 6
Status Test View job Duration
Collapse Failed BasicGroovyBuildTests testSimpleTaskMarkerInSingleLineComment History
Default Job < 1 sec
java.lang.AssertionError: missing expected problem: Problem : todonothing [ resource : </Project/src/p/A.groovy> range : <24,36> category : <-1> severity : <2>]
	at org.eclipse.jdt.core.groovy.tests.builder.BasicGroovyBuildTests.testSimpleTaskMarkerInSingleLineComment(BasicGroovyBuildTests.java:2323)
Collapse Failed BuildAccessRulesTests testAccessForMethodParameter History
Default Job < 1 sec
junit.framework.ComparisonFailure: 
----------- Expected ------------
Problem : Access restriction: The type 'BeanInfo' is not API (restriction on required library '##') [ resource : </Project/src/Foo.groovy> range : <43,51> category : <150> severity : <2>]

------------ but was ------------

--------- Difference is ----------
 expected:<[Problem : Access restriction: The type 'BeanInfo' is not API (restriction on required library '##') [ resource : </Project/src/Foo.groovy> range : <43,51> category : <150> severity : <2>]
(13 more lines...)
Collapse Failed BinarySearchTests testFieldRefInInitializer History
Default Job 1 sec
java.lang.AssertionError: Expecting 1 matches, but found 0

java.lang.AssertionError: 
Expecting 1 matches, but found 0

	at org.eclipse.jdt.core.groovy.tests.search.BinarySearchTests.assertMatches(BinarySearchTests.java:139)
	at org.eclipse.jdt.core.groovy.tests.search.BinarySearchTests.testFieldRefInInitializer(BinarySearchTests.java:208)
Collapse Failed BinarySearchTests testMethodDecl History
Default Job < 1 sec
java.lang.AssertionError: Expecting 4 matches, but found 0

java.lang.AssertionError: 
Expecting 4 matches, but found 0

	at org.eclipse.jdt.core.groovy.tests.search.BinarySearchTests.assertMatches(BinarySearchTests.java:139)
	at org.eclipse.jdt.core.groovy.tests.search.BinarySearchTests.testMethodDecl(BinarySearchTests.java:199)
Collapse Failed DGMInferencingTests testDGM40 History
Default Job < 1 sec
java.lang.AssertionError: Expected type not found.
Expected: java.io.PrintWriter
Found: java.lang.Object
Declaring type: groovy.lang.Closure<V extends java.lang.Object>
ASTNode: org.codehaus.groovy.ast.expr.VariableExpression@f1349[variable: it]
Confidence: INFERRED

java.lang.AssertionError: 
(9 more lines...)
Collapse Failed InferencingTests testNothingIsUnknownWithCategories History
Default Job < 1 sec
java.lang.AssertionError: Should not have found any AST nodes with unknown confidence, but found:
[org.codehaus.groovy.ast.expr.ConstantExpression@f96d0[use], org.codehaus.groovy.ast.expr.ConstantExpression@101a5a[println], org.codehaus.groovy.ast.expr.ConstantExpression@108ed8[println], org.codehaus.groovy.ast.expr.ConstantExpression@156326[use]]
java.lang.AssertionError: 
Should not have found any AST nodes with unknown confidence, but found:
[org.codehaus.groovy.ast.expr.ConstantExpression@f96d0[use], org.codehaus.groovy.ast.expr.ConstantExpression@101a5a[println], org.codehaus.groovy.ast.expr.ConstantExpression@108ed8[println], org.codehaus.groovy.ast.expr.ConstantExpression@156326[use]]
	at org.eclipse.jdt.core.groovy.tests.search.InferencingTests.assertNoUnknowns(InferencingTests.java:44)
	at org.eclipse.jdt.core.groovy.tests.search.InferencingTests.testNothingIsUnknownWithCategories(InferencingTests.java:2298)
Existing test failures 1
Status Test Failing since View job Duration
junit.framework.ComparisonFailure: 
----------- Expected ------------

------------ but was ------------
Problem : The import util.MyException is never used [ resource : </Project/src/p/Test.java> range : <18,34> category : <120> severity : <1>]

--------- Difference is ----------
 expected:<[]> but was:<[Problem : The import util.MyException is never used [ resource : </Project/src/p/Test.java> range : <18,34> category : <120> severity : <1>]
(12 more lines...)
Fixed tests 1
Status Test Failing since View job Duration
Successful BinarySearchTests testMethodRefInInitializer History
Failing since build #426 (Changes by Eric Milles) Default Job 1 sec